##TITLE=Silicone 7 $$ Begin of the data block
##JCAMP-DX=5.00 $$ ACD/SpecManager v 10.08
##SPECTROMETER/DATA SYSTEM=Alpha
##DATE=14 Dec 2016 11:33:10
##DATA TYPE=INFRARED SPECTRUM
##DATA CLASS=XYDATA
##ORIGIN=
##OWNER=
##NPOINTS=1667
##FIRSTX=599.65820312
##LASTX=3997.72216797
##MAXX=3997.72216797
##MINX=599.65820312
##MAXY=0.96406084
##MINY=0.10012462
##XFACTOR=1.0000000000
##YFACTOR=1.000000000000000e-9
##FIRSTY=0.85230458
##DELTAX=2.03965425
##XUNITS=1/CM
##YUNITS=ARBITRARY UNITS
##XYDATA=(X++(Y..Y))
599.7 852304578 851968408 851324439 850636125 850062490 849508405 849043846 848831892 848706126 848377049 847634554
620.1 847634554 846426427 845053077 843901515 842979789 842051864 841051221 840090930 839280128 838538408
638.4 838538408 837690115 836480081 834676385 832296908 829431474 826974690 826440036 827643931 828765273
656.8 828765273 828957319 828514457 827745795 826877177 826262832 826256812 826176286 825917900 825725973 825554013
677.2 825554013 825347841 824970901 824280620 823234022 821637988 819220185 816365480 813974798 812201798
695.5 812201798 809906304 806014180 799814761 790992737 778651059 755910993 714147866 673827827
711.8 673827827 680718005 735553443 790911436 822041094 835697711 841248751 843326151 844157994
728.2 844157994 844402373 843410134 840258002 834547460 827150404 820265234 816539645 817395091 822392583
746.5 822392583 829948008 838421702 846643507 853766441 859416604 863738894 866864264 868896961
762.8 868896961 870266080 871425569 872719347 874169528 875562191 876815557 878030479 879237413
779.1 879237413 880312026 881182015 881676912 881831229 881994128 882102072 881790876 881099284 880432963 880326569
799.5 880326569 880750954 881100953 881102204 880717874 879824758 878467798 876881063 875178277 873724222
817.9 873724222 872907400 872629106 872849524 873667896 874702096 875457108 875881910 876164913 876490057 876775205
838.3 876775205 876628101 875098586 869604290 860675573 857371569 862444222 865808189 862683892 855793953
856.7 855793953 846494734 833939195 816100836 789116383 741816700 651735425 516171157
870.9 516171157 391646028 351276964 410789937 524477243 636357188 725317240 796608388
885.2 796608388 849616051 879391432 891227424 894666553 894591868 892441988 888791978 884291530
901.5 884291530 879750907 875950515 873325467 871781409 870695531 869291902 866946220 863480031
917.8 863480031 859460711 855787277 852993309 851109087 849978805 849323452 849022627 849306822 850506485
936.2 850506485 852759659 856088996 860553384 865920961 871237099 875144899 876906157 876617849 874733388
954.6 874733388 871848524 868522048 865071177 861802459 859308243 858133674 858196914 858959377 859969795
972.9 859969795 860921979 861649632 862112999 862263083 862065077 861442268 860195756 858291388 855805218
991.3 855805218 852621615 848572373 843609095 837548852 829945207 820688128 810532570 800910950
1007.6 800910950 793304682 788677573 787007749 787516415 789506614 792448878 795582235 798089445
1023.9 798089445 799505591 799545169 797817588 793798983 786933601 777462125 767583191 760327458 756354749
1042.3 756354749 753140330 747921705 740139842 730685890 720354438 709444582 697951674 685533106
1058.6 685533106 671544254 655541062 637659669 618539393 599323869 581641376 566985846
1072.9 566985846 556018889 548257530 542307436 536567152 530006349 522480726 514199913 505307674
1089.2 505307674 495951444 486340284 476701647 467212647 458108217 449647993 442079902 435636163
1105.5 435636163 430434495 426459014 423415720 420942128 419167429 418858051 421051443 426436365
1121.8 426436365 434759259 444916844 455692649 466354579 476831257 487466127 498775631
1136.1 498775631 511359751 525559187 541046798 556776702 571465731 584335506 595449209
1150.4 595449209 605545223 615444481 625431001 635345757 645047605 654754341 664890349 675454080
1166.7 675454080 685925186 695805550 704927981 713328242 721100390 728403151 735318184 741761029
1183 741761029 747470081 752172828 755935311 759074509 761898637 764581978 767155349 769558966 771700859
1201.4 771700859 773495674 774863720 775728226 776015818 775722086 774903774 773640394 771948338 769742072
1219.7 769742072 767000794 763909996 760508537 756432176 751178741 744447827 736213267 726687908
1236 726687908 716405749 705959022 695623755 685064673 673582613 661178172 648539424 635547459
1252.4 635547459 621881485 608477116 596426904 585761964 575543880 564548492 552122116
1266.6 552122116 538955152 526758492 517291248 511386335 508419871 506844699 504986405 501957893
1282.9 501957893 498047233 494735986 494087458 497667283 505844653 517768264 531838596 546410084
1299.3 546410084 560372174 572996199 583842278 592709363 599589705 604683936 608425677 611066699
1315.6 611066699 612797797 613767743 613747537 612438679 609676957 605570614 600279033 594131351 587325871
1333.9 587325871 579768836 571390450 563018680 556003213 550616860 546523929 543493629 541297436
1350.3 541297436 539180875 536290765 531772614 524757624 514374375 499895185 481609583 460040152
1366.6 460040152 436038941 413589805 397125363 388640076 387006670 388266534 389100343 387420177
1382.9 387420177 382294416 373653084 362087548 348559380 332524359 313961357 295536101 279037118
1399.2 279037118 264544159 250072658 233101249 214909166 197957605 183316752 171304688
1413.5 171304688 161511391 153446406 147010922 141942576 137470901 133282691 129297152 125590622
1429.8 125590622 122176096 119010709 116308101 113982156 111335151 108477302 105812691 103681922
1446.1 103681922 102359392 101552196 100785188 100124620 100893579 103354894 104803517 105383091 106689893
1464.5 106689893 108499914 109665230 111136243 115022659 120989591 127459869 134498060 142562345
1480.8 142562345 151569813 160718068 170769751 183685437 198954418 213070512 228159949 248440132
1497.1 248440132 270731032 290648222 307836473 328626126 360139668 388515890 410622001
1511.4 410622001 432506472 455219984 478591979 501015246 525058806 548033357 567385077
1525.7 567385077 586424470 603188515 618643582 635870516 650537848 661834836 677205384
1539.9 677205384 694886982 708854198 720847309 731150210 740751326 749747574 757494450 763157904
1556.3 763157904 769547462 778444827 784052074 788117409 793159485 799293578 806060195 810511053
1572.6 810511053 811593473 810792863 810244799 812404156 818391681 826649666 834515035 841136336 846610308
1590.9 846610308 850487709 851997852 851190984 850195169 852190495 858512163 866471946 872781515 876736224
1609.3 876736224 879272878 880951643 882586002 885507405 888344407 889827132 890690029 891057372 889644146
1627.7 889644146 885216534 877046824 865752339 857479334 861316860 872591615 884012103 892476678
1644 892476678 899194419 906060755 910884500 914337277 919770181 924702168 927382231 928662121 929540217
1662.3 929540217 930727422 931379139 931190491 931583047 932454169 932913482 933301866 933298767 932112634 930090308
1682.7 930090308 929276943 930062950 930500925 930340111 929481566 927465260 925002933 922427833 919706941
1701.1 919706941 916733921 911712646 903913200 893432438 878830314 858378589 829569101 789153516
1717.4 789153516 745658696 708135307 673851609 645738304 628796041 622701824 626253843 641910374
1733.7 641910374 666324556 691866696 724901319 764538705 803408921 838974833 869230449
1748 869230449 894246757 913208902 925069511 932358325 937476516 940915227 943799615 946376801
1764.3 946376801 948004365 948713422 948963642 949240386 949739218 949865341 948956132 946811974 943149805
1782.7 943149805 937080503 927114844 912054598 892137468 874399364 867180824 868497908 877295136
1799 877295136 895163178 916920364 934622943 946046710 952634335 956481755 958938003 960504413
1815.3 960504413 961510420 962292194 962733448 962746978 962781131 962853551 962900460 963320076 963803828 963894367
1835.7 963894367 963951886 963995636 963556349 962885737 962949455 963518560 963879526 964026749 964060843 964048743
1856.1 964048743 963962913 963879883 963783324 963478744 962719917 961916745 962031066 962649643 962899923 962805033
1876.5 962805033 962622702 962393820 962228179 962099791 961755037 961184978 960860193 960808516 960662305 960497141
1896.9 960497141 960346520 960104227 959757268 959345162 958814859 958253860 957917392 957758129 957413137 956851780
1917.3 956851780 956455350 956181169 955979884 955977976 955920339 955674469 955413878 955158949 954874635 954584599
1937.7 954584599 954163432 953595757 953295529 953370273 953400552 953269482 953075171 952830672 952529967 952184379
1958.1 952184379 951876640 951703727 951569676 951393425 951331377 951352835 951305687 951204658 951048493 950836420
1978.5 950836420 950620115 950374246 950080752 949766994 949412048 949015498 948772788 948756039 948736191 948616982
1998.9 948616982 948420286 948178113 947907150 947585642 947281718 947052062 946830988 946542740 946231663 946025610
2019.3 946025610 945937634 945885777 945809126 945668280 945546508 945462883 945309103 945163488 945089996 944965780
2039.7 944965780 944800675 944678903 944580615 944462895 944336295 944224536 944064856 943883479 943760633 943631113
2060.1 943631113 943430781 943224192 943062842 942895234 942688942 942483425 942294002 942105711 941949606 941807449
2080.5 941807449 941641629 941469967 941259265 941027820 940875411 940751076 940582216 940412521 940252721 940076411
2100.9 940076411 939893186 939740837 939590931 939385593 939111531 938825428 938562274 938308358 938067853 937759995
2121.2 937759995 937351584 936931431 936540663 936190248 935902894 935686529 935504258 935250640 934940398 934708118
2141.6 934708118 934588969 934534431 934513867 934520364 934543788 934593260 934658468 934678614 934608459 934514940 934439242
2164.1 934439242 934390008 934378743 934282839 934078336 933889091 933771312 933701575 933589995 933412254 933270097
2184.5 933270097 933165252 933030784 932856023 932657242 932501912 932393432 932284236 932151854 931964219 931750119
2204.9 931750119 931567848 931412637 931297123 931200922 931092083 930999994 930874765 930701733 930547297 930402815
2225.3 930402815 930222988 930033445 929895759 929794669 929643571 929401159 929120779 928864896 928632140 928382277
2245.7 928382277 928124964 927887261 927657187 927439570 927250206 927063823 926828623 926551878 926275432 926014185
2266.1 926014185 925797403 925585747 925302029 925046086 924857557 924610555 924377620 924261391 924139380 923916280
2286.5 923916280 923640072 923459470 923426509 923405945 923344672 923270702 923207641 923221171 923241079 923128724 922948182
2308.9 922948182 922825694 922833025 922985315 923203409 923384011 923373163 923125327 922908783 922914684 922879934 922693074
2331.3 922693074 922695875 922902048 923040628 922948599 922567606 922034740 921431899 920963228 920920849 921205640
2351.7 921205640 921525180 921778023 921902597 921873331 921712279 921376705 920936048 920361817 919661582 919018745
2372.1 919018745 918569744 918257475 917992711 917836010 917815626 917840600 917802632 917679131 917490900 917256415
2392.5 917256415 917006969 916795433 916644752 916498363 916345119 916200280 916054964 915878057 915682197 915539324
2412.9 915539324 915410340 915186167 914898574 914666653 914514065 914425373 914318144 914100468 913822889 913554192
2433.3 913554192 913290620 913038611 912799180 912503242 912137806 911795855 911497295 911182642 910823524 910403609
2453.7 910403609 909936905 909464777 909005761 908528566 907983661 907393634 906739235 905867517 904768646
2472.1 904768646 903567255 902248383 900774777 899165392 897443056 895577848 893517852 891289592
2488.4 891289592 888815939 885858953 882295549 878217459 873772681 869079828 864256322 859605491
2504.7 859605491 855637848 852788150 851314127 851202846 852103114 853632212 855652213 858239055 861476421
2523 861476421 865314364 869589269 874018192 878359079 882489681 886262894 889468193 891795218 893037677
2541.4 893037677 893515944 893842518 894248366 894626319 894899786 895055592 895139635 895188212 895158827 895030558
2561.8 895030558 894836545 894634485 894446135 894214213 893938661 893668175 893415630 893164158 892899454 892637849
2582.2 892637849 892432511 892328441 892213345 892013311 891893327 891946793 892068386 892179012 892340124 892632127
2602.6 892632127 893054605 893582940 894194007 894828022 895392060 895888388 896417797 896923721 897228420 897360086
2623 897360086 897455692 897546828 897678554 897848368 897949576 897942483 897917688 897993326 898123920 898155808 898056090
2645.4 898056090 897892892 897721052 897530377 897270977 896961927 896665812 896358848 896032333 895715952 895376801
2665.8 895376801 895021975 894597769 894093335 893703222 893405855 893079221 892935634 893144786 893397212 893377781
2686.2 893377781 893232644 893098891 892864347 892552257 892237604 891894102 891547322 891265869 891068935 890807092
2706.6 890807092 890384674 889929295 889487267 888979077 888393462 887630582 886626601 885564268 884563327
2725 884563327 883901477 883729935 883626223 883384228 883060813 882695079 882381439 881992280 881375492 880430996
2745.4 880430996 879302979 878529429 878144801 877664089 876892090 875990689 875140429 874353468 873552084
2763.7 873552084 872663200 871625781 870432794 869090021 867728472 866863072 866520882 866010606 865116954
2782.1 865116954 864077151 862758160 861069024 859721720 859108865 858542562 857464790 856381297 855974793
2800.4 855974793 855817378 855280399 854255319 852749944 851266801 850066960 848483801 846167982 843368590
2818.8 843368590 840147018 836311638 831636727 825843751 818572700 809490979 798464715 785494030
2835.1 785494030 770623386 754570127 737575650 717885494 694273293 669219911 647722185
2849.4 647722185 632173300 620630085 610965490 603227556 598445296 596801341 596580803 595572412
2865.7 595572412 592916191 589038789 585846484 586784661 593458951 603443086 613334954 621278048
2882 621278048 626353085 628122449 626829088 623279691 618312776 612779558 607961953 604586601 602046728
2900.4 602046728 599677324 597292244 594402611 589977622 583019853 573817849 564200461 555756569
2916.7 555756569 548921227 543720961 539807141 536661983 534165323 533223987 535991013 543931544
2933 543931544 556834459 573618233 592241704 609702110 623495519 632510185 636040449 633111656
2949.3 633111656 624029577 612106025 600869358 591032326 581979215 573325515 565278530 559127331
2965.6 559127331 557195544 561655998 572905362 589433551 608924270 629055500 648755252 668617249
2981.9 668617249 688969374 709314644 729306638 748533487 766893327 784439147 800059855
2996.2 800059855 813147128 824108005 832769334 839477301 844783366 848238111 849968612 851411462
3012.5 851411462 853538454 856018186 858303845 860199988 861485720 862332821 863175154 863694072 863665879
3030.9 863665879 863539517 863876641 864626706 864856660 864461541 864352822 864839077 865425229 865516961 865151107
3051.3 865151107 864637315 864019394 863550782 863380671 863149941 862622201 862038612 861922204 862336338 862737417
3071.7 862737417 862745285 862245500 861513436 861325860 861888170 862668276 863421738 864073932 864620388 865330815
3092.1 865330815 866148710 866676569 866825044 866998196 867419600 867655933 867379546 867015123 867137015 867369235
3112.5 867369235 866996348 866403759 866305768 866789877 867512703 867979109 868038595 867856324 867714047 867725253
3132.9 867725253 867548227 867005050 866551101 866622210 866899490 866923273 866672814 866090536 865311623 864948034
3153.3 864948034 865150809 865376592 865344167 865271568 865251482 865035236 864624858 864297986 864046395 863748789
3173.7 863748789 863430023 863119721 862855077 862618685 862306535 862018585 861844063 861642778 861417711 861332655
3194.1 861332655 861358225 861307979 861139238 860938489 860800564 860777915 860830247 860886514 860888898 860814691 860755980
3216.5 860755980 860781789 860846877 860893846 860823154 860658824 860517859 860292196 860039532 860060275 860234916
3236.9 860234916 860295296 860273242 860151529 859806776 859420180 859315574 859387338 859284759 858955503 858614922
3257.3 858614922 858326077 858090818 857871652 857437193 856564224 855287611 854154646 853340209 852362990
3275.6 852362990 851178885 849909902 848237157 845818996 842764556 839250982 835075200 830373883
3292 830373883 825928867 822753966 821918249 823587358 826612413 829837978 832963288 836048484 838920593
3310.3 838920593 841470242 843776762 845811427 847541034 848987579 850090027 850901067 851762533 852765679
3328.7 852765679 853577614 854005635 854141355 854173005 854302287 854510844 854740858 855068862 855294883 855245709
3349.1 855245709 855218768 855419636 855650008 855753064 855751216 855757356 855757058 855463207 854958773 854842842 855314851
3371.5 855314851 855846465 856013358 855946898 855869174 855801404 855761707 855794847 855677426 855240345 854902804
3391.9 854902804 855019450 855205119 854983866 854562521 854600132 855108678 855348527 855167031 855011165 855041564
3412.3 855041564 855165780 855201840 855066597 854959846 854946375 854847252 854514837 854054391 853798211 853623807
3432.7 853623807 853253603 853218436 854013562 855098963 855801463 856009185 856065214 856402338 856825829 856997013
3453.1 856997013 857054293 857023716 856813371 856688261 856492758 855634034 854550004 854495227 855571151 856450140
3473.5 856450140 856370986 855593145 854801953 854791641 855148435 854966700 854574561 854502797 854546368 854344308
3493.9 854344308 853879094 853443980 853015423 852606356 852682531 853062510 853204250 853166461 853119969 853163779
3514.3 853163779 853349328 853476405 853325367 852898598 852632284 852829218 853264809 853792489 854100585 853971422
3534.7 853971422 853899717 854236186 854530752 854373634 854116857 854307532 854813755 855157971 855393767 855741262
3555.1 855741262 855955243 855818391 855526626 855198860 854827940 854893565 855655789 856446207 856842995 857001841
3575.4 857001841 857041419 856929898 856707036 856335461 855989158 856297970 857122064 857602894 857781887 857989013
3595.8 857989013 858122706 858212650 858375251 858432353 858266056 858076572 858112395 858228683 858218908 858101428
3616.2 858101428 858055592 858577669 859380960 859658897 859374940 859109938 859582126 860428810 861062229 861493468
3636.6 861493468 861781120 861943126 861963570 861587942 860743701 859998286 860365927 861603856 862591684 863040745
3657 863040745 863304496 863562465 863790870 863827229 863528073 862953782 862621963 862577438 862559557 863110781
3677.4 863110781 863891900 864252806 864344418 864159346 863499880 863178492 863903046 864866376 865551412 865966260
3697.8 865966260 866136611 866137743 866134346 866077721 865836680 865630150 865789473 866292238 866664827 866657376 866448164
3720.3 866448164 866234601 866118371 866238654 866498530 866297960 865309060 864346445 864512622 865238011 865437627
3740.7 865437627 864899695 864234209 864311635 864501595 864281058 864231706 864454031 864561021 864612699 864945590
3761 864945590 865106285 864690423 864346385 864460409 864794910 865022659 864905417 864521980 864199221 864268482
3781.4 864268482 864493906 864622355 864723861 864638746 864320219 863952756 863521636 863215506 863076568 862809539
3801.8 862809539 862808347 862965107 862988770 863136470 863266766 863043189 862390399 861831307 861532509 861579239
3822.2 861579239 861920893 862038791 862016439 861886501 861520946 861129940 860768497 860495567 860683799 861303329
3842.6 861303329 861788630 861776829 861502588 861166835 860600591 860332131 860688865 860986829 860990286 860775888
3863 860775888 860547900 860508144 860439003 860324442 860279143 860353529 860522807 860303998 859890699 859738350 859706283
3885.5 859706283 860014439 860315382 860131323 860035181 860033274 859448493 858559012 858174920 858412683 858930051
3905.9 858930051 859366298 859539926 859450936 859145641 858790755 858548164 858395338 858286321 858169138 858157516
3926.3 858157516 858169794 857905328 857625484 857705295 857901812 857872665 857607365 857231557 856924772 856809437
3946.6 856809437 856896758 857193351 857431889 857301116 856970847 856807888 856820643 856787264 856691241 856527925
3967 856527925 856249392 855956316 855688274 855598569 855768204 855839849 855628014 855438590 855417669 855252266
3987.4 855252266 854887664 854577243 854347408 854180872 854130328
3997.6 854130328
##END=$$ End of the data block
