##TITLE=Silicone 20 $$ Begin of the data block
##JCAMP-DX=5.00 $$ ACD/SpecManager v 10.08
##SPECTROMETER/DATA SYSTEM=Alpha
##DATE=14 Dec 2016 11:33:10
##DATA TYPE=INFRARED SPECTRUM
##DATA CLASS=XYDATA
##ORIGIN=
##OWNER=
##NPOINTS=1667
##FIRSTX=599.65820312
##LASTX=3997.72216797
##MAXX=3997.72216797
##MINX=599.65820312
##MAXY=1.02963102
##MINY=0.11448940
##XFACTOR=1.0000000000
##YFACTOR=0.000000010000000
##FIRSTY=0.93389815
##DELTAX=2.03965425
##XUNITS=1/CM
##YUNITS=ARBITRARY UNITS
##XYDATA=(X++(Y..Y))
599.7 93389815 93473428 93582195 93681556 93738675 93801254 93894088 93972933 94027817 94098222 94176579 94202739 94166732
624.1 94166732 94128436 94125503 94122022 94085675 94032949 93991446 93966538 93932730 93842667 93639868 93250334 92661923
648.6 92661923 92138118 92079109 92484146 92920285 93120790 93165791 93169475 93099672 92918891 92901152 93121409
671 93121409 93293220 93391144 93451488 93467009 93441349 93365186 93199706 92883587 92393798 91847712 91416150
693.5 91416150 91120726 90775472 90175384 89241195 88108277 86995834 85516590 82764411 79931986
711.8 79931986 80481112 84649229 88838691 91083562 91885185 91990715 91780996 91429454 90951633
730.2 90951633 90201783 88978785 87211215 85128552 83217067 81998724 81753772 82421011 83687115
748.6 83687115 85175931 86610019 87832582 88767236 89389545 89745396 89932966 90026188 90070057 90115279
769 90115279 90180814 90267652 90382290 90516627 90647882 90754408 90830779 90868330 90858495 90827298 90793544 90718597
793.4 90718597 90586108 90464258 90446025 90530193 90634364 90682417 90626496 90461671 90192455 89841568 89460307
815.9 89460307 89119226 88896537 88828176 88913077 89129096 89399314 89645743 89861751 90063715 90267467
836.3 90267467 90488672 90702045 90826958 90684545 90289515 90214795 90635794 90883625 90652996 90146059
856.7 90146059 89446741 88477933 87123972 85196698 81950599 75377101 64392555 53240001 49215278
875 49215278 54676175 64906204 74144316 80774993 85781997 89492691 91645724 92529666 92707515
893.4 92707515 92468578 91911298 91112804 90180129 89248919 88475919 87978452 87741524 87616658 87421995
913.8 87421995 87024319 86410826 85695857 85016125 84474993 84126848 83957767 83906853 83946162 84114754
934.2 84114754 84472746 85070407 85930914 87028855 88271648 89475727 90411949 90932810 91029871 90792686
954.6 90792686 90336651 89747357 89097935 88495582 88073349 87921649 88023341 88289833 88635266 88987184
975 88987184 89294177 89537352 89712292 89816356 89842117 89767253 89566469 89223772 88727236 88062143 87208742
997.4 87208742 86115295 84704643 82969362 81040907 79185921 77715701 76826322 76526421 76712918
1015.8 76712918 77248335 77982181 78767413 79466379 79970354 80201185 80061162 79425156 78194702 76431048
1036.1 76431048 74560523 73193192 72490585 71968949 71076131 69692254 67994666 66146594 64215493
1054.5 64215493 62194562 60011977 57580364 54857135 51866394 48713091 45594519 42769411
1070.8 42769411 40461287 38752979 37550816 36633962 35763249 34791088 33687052 32473585 31186244
1089.2 31186244 29875615 28580856 27314952 26093802 24943845 23885085 22943458 22151504 21522942
1107.5 21522942 21037142 20650229 20336775 20113464 20045680 20245840 20795564 21671252 22777322 23994926
1127.9 23994926 25235552 26484314 27780926 29200345 30835152 32745570 34905192 37183908
1144.3 37183908 39401111 41428277 43249047 44947273 46637413 48384121 50182146 52001089
1160.6 52001089 53847677 55774975 57806158 59876055 61898237 63834691 65677351 67432076
1176.9 67432076 69121540 70754629 72302216 73707545 74921137 75941575 76813573 77600396 78356302
1195.2 78356302 79108483 79850775 80551481 81176639 81707317 82130486 82436103 82627738 82717621 82718790
1215.6 82718790 82631499 82455248 82197350 81862992 81433189 80846721 80019587 78891009 77451688 75737005
1236 75737005 73835760 71875972 69963771 68101889 66175485 64057094 61711025 59182674 56607753
1254.4 56607753 54211026 52142066 50367761 48703423 46914217 44880256 42726377 40765417
1270.7 40765417 39309779 38480493 38144103 38035351 37895641 37578478 37115932 36744282 36810243 37588659
1291.1 37588659 39171448 41466174 44255760 47281951 50334764 53258663 55936617 58295506
1307.4 58295506 60311943 62012094 63471377 64729768 65796894 66698694 67403209 67840916 67975128
1325.8 67975128 67813557 67373675 66713691 65878910 64842492 63620204 62482113 61733347 61357260
1344.1 61357260 61275131 61481673 61932302 62482017 62939775 63078213 62639123 61380005 59169579 56100279
1364.5 56100279 52225965 47724599 43541172 40709880 39808244 40683675 42434686 44310021 45836014
1382.9 45836014 46748608 47092938 47065002 46693116 45834893 44536960 43110636 41740441 40445539
1401.2 40445539 38958818 37029174 34935287 32971555 31221744 29717860 28372481 27065936
1417.6 27065936 25866947 24945930 24117742 23245698 22339293 21385467 20478752 19646478 18753509 17855947
1438 17855947 17039910 16161419 15214303 14306802 13528302 12951006 12498256 12064840 11682488 11524650
1458.4 11524650 11506806 11457685 11448940 11561336 11712894 11908523 12369470 13205038 14325732 15698892
1478.8 15698892 17333202 19152389 20949002 22775146 24991877 27702880 30317190 32872462
1495.1 32872462 35884094 39043689 41791457 43944672 45978710 48915604 51994783 54472119
1511.4 54472119 56594902 58472627 60294288 62008756 63831812 65753472 67436868 69045323
1527.7 69045323 70405036 71421987 72505182 73535728 74024987 74470168 75650060 77081943 78346550
1546.1 78346550 79241800 79881114 80409271 80708283 80567700 80342782 81209052 82299167 82831800 83054113
1566.5 83054113 83172113 83444852 83631510 83140904 82197046 81774783 82096702 83041710 84307975 85409433
1586.9 85409433 86166817 86605698 86691242 86351776 85648412 84977776 84959131 85857236 87132096 88112211
1607.3 88112211 88679552 89006925 89103705 89056301 89377135 89980710 90302527 90494174 90801287 91016072
1627.7 91016072 91012627 90596122 89631724 88949478 89664781 90911657 91809624 92123014 92111653 92496812
1648.1 92496812 92895043 92769384 93211091 94350505 95011950 95107222 95041829 95176786 95193553 94885892
1668.4 94885892 94807750 95013487 95102429 95222706 95279169 94902718 94140756 93819588 94265562 94609946
1688.8 94609946 94694149 94481933 93817598 93075085 92474830 92082280 91793156 91004336 89668256 87831366
1709.2 87831366 85089898 81114215 75544119 68085045 60615498 54558188 49137786 44745469
1725.6 44745469 42114350 41084194 41403094 43353072 46741545 50583351 55693364 62121648 68845195
1743.9 68845195 75274777 80924630 85835809 89865130 92538744 94184834 95362669 96182400 96902412
1762.3 96902412 97601467 98000050 98095083 98094839 98291361 98833215 99330181 99523824 99539405 99482059 99282777
1784.7 99282777 98797846 97785068 96200579 94881475 94539553 94699270 95179826 96316868 97937882
1803.1 97937882 99352378 100237179 100708199 101056278 101407182 101661742 101806736 101927817 101963937 101854050
1823.5 101854050 101762879 101731002 101741886 101961124 102222168 102307069 102337790 102334809 102138031 101900077 102012789
1845.9 102012789 102325594 102550626 102673376 102730215 102757299 102765059 102779591 102795160 102725291 102486622 102278280
1868.3 102278280 102428353 102743280 102909625 102945888 102956057 102961659 102963102 102951372 102878523 102764714 102768159
1890.8 102768159 102848899 102872503 102901423 102946854 102952743 102922499 102872038 102789128 102714288 102716696 102737772 102643394
1915.2 102643394 102482259 102440417 102462578 102490103 102584457 102663970 102673101 102654755 102633369 102614522 102582431
1937.7 102582431 102479899 102338731 102329993 102447248 102537429 102574217 102584255 102580500 102579391 102583742 102587008 102588618
1962.2 102588618 102557480 102500057 102509296 102578509 102617061 102621675 102629006 102641428 102648413 102646565 102631962 102597332
1986.6 102597332 102536130 102464461 102463436 102543199 102598023 102604210 102594948 102577007 102560556 102549982 102543211 102540398
2011.1 102540398 102522719 102471185 102429974 102449608 102496755 102521658 102523649 102523148 102533615 102553487 102571571 102584696
2035.6 102584696 102594543 102596354 102603292 102628815 102657688 102678668 102693784 102705455 102711749 102711606 102711129 102712762 102703905
2062.1 102703905 102686477 102688599 102705812 102711582 102710629 102711773 102711523 102708375 102700877 102692425 102687263 102681065 102674520 102680171
2090.7 102680171 102692926 102696180 102690339 102689195 102698147 102705622 102708566 102710462 102709162 102703190 102694046 102683222 102672803
2117.2 102672803 102664435 102654183 102636504 102612734 102591550 102577698 102566838 102552867 102535880 102516246 102500021 102493954
2141.6 102493954 102493417 102491081 102487004 102489221 102495992 102501822 102512205 102525818 102530837 102530456 102528489 102523220 102518559 102512681
2170.2 102512681 102502406 102488482 102480006 102481234 102482712 102480972 102481747 102479470 102470005 102460837 102455211 102450240 102437925 102425003
2198.8 102425003 102420294 102414262 102406204 102402079 102397048 102394426 102396405 102399302 102408028 102412570 102402425 102390134 102388000 102390981
2227.3 102390981 102394772 102402747 102413225 102420533 102419460 102416909 102421749 102432680 102443433 102449763 102453792 102457881 102462137
2253.8 102462137 102462602 102457535 102453232 102452517 102450109 102443326 102438116 102434945 102425075 102410007 102394009 102375102 102353263 102324390
2282.4 102324390 102284408 102236402 102182639 102128327 102078676 102031064 101984835 101935685 101879013 101823306 101769781
2304.8 101769781 101707160 101630437 101555693 101507878 101480210 101445484 101389003 101317787 101254940 101211929 101181102
2327.2 101181102 101140082 101089978 101073611 101090026 101089633 101053739 101000178 100965273 100992465 101050663 101051021 100958204
2351.7 100958204 100817895 100700426 100615954 100562298 100547266 100558805 100589550 100625074 100666809 100729334 100809944
2374.2 100809944 100909495 101026011 101153648 101275361 101366639 101422584 101448119 101445353 101430416 101419282 101406634
2396.6 101406634 101389825 101376414 101366043 101356912 101351869 101342940 101326036 101310456 101302862 101300561 101295936 101288509 101279211
2423.1 101279211 101274931 101276076 101264513 101241982 101226580 101217461 101209211 101201332 101187396 101163268 101139593 101126826
2447.6 101126826 101112485 101085615 101055717 101028621 100999951 100968099 100935447 100899923 100860393 100816047 100758851
2470 100758851 100690198 100614071 100522482 100417686 100303876 100177455 100036800 99883962 99723732 99545830
2490.4 99545830 99329293 99070728 98779887 98463452 98127776 97781700 97451907 97175443 96974152 96865046
2510.8 96865046 96856445 96929991 97054160 97210050 97403300 97641683 97919160 98233068 98569560 98903799
2531.2 98903799 99221861 99507058 99740690 99902612 99982142 100014341 100045884 100078321 100097966 100105906 100105059
2553.6 100105059 100100660 100091839 100070143 100036383 99998003 99957156 99910039 99854559 99790156 99718773 99656063 99605483
2578.1 99605483 99552166 99503046 99469149 99445128 99426180 99406356 99385023 99371296 99365890 99366289 99376577 99392325
2602.6 99392325 99410540 99439716 99482536 99531978 99571347 99594063 99615860 99636221 99633825 99612057 99589419 99566680
2627.1 99566680 99544376 99526042 99504620 99474764 99445117 99433243 99437422 99433935 99418133 99404377 99392796 99368525
2651.5 99368525 99333686 99300075 99258590 99204719 99147230 99086607 99021786 98960698 98906606 98855543 98812270 98774737
2676 98774737 98739970 98732096 98764873 98805279 98821729 98815536 98786932 98739469 98691767 98647225 98605275 98569173
2700.5 98569173 98533404 98496723 98452204 98391134 98313427 98215359 98100471 97980428 97845018 97688323 97523338
2722.9 97523338 97356403 97226238 97159785 97118521 97070086 97009569 96949154 96899474 96841216 96753311 96619916
2745.4 96619916 96454149 96310550 96198624 96068454 95896423 95712739 95536447 95356625 95173669 94992930
2765.7 94992930 94808674 94611746 94398808 94190508 94030952 93906325 93755496 93577427 93398339 93194193
2786.1 93194193 92955202 92752188 92618936 92495888 92345411 92209083 92133027 92079836 91984898 91825324
2806.5 91825324 91599113 91338080 91067082 90739906 90312213 89795113 89197332 88482696 87598652 86495984
2826.9 86495984 85114950 83403975 81355947 78989780 76340789 73512465 70557362 67369318
2843.3 67369318 63881361 60259217 56816685 53749520 51072592 48816320 47091872 45986384
2859.6 45986384 45432535 45168859 44893661 44452128 43896896 43498757 43658420 44563529 45966208 47428069
2880 47428069 48617294 49349114 49569952 49339142 48778036 48031190 47249529 46575150 46079546 45731691
2900.4 45731691 45469689 45261577 45064908 44775051 44283774 43580419 42749482 41864830 40941319 39981315
2920.8 39981315 38995668 38025633 37164900 36593229 36579317 37339866 38935658 41253272 43999082
2939.1 43999082 46745691 49055439 50614053 51220775 50773090 49405304 47550267 45649660 43889645
2957.5 43889645 42267358 40723771 39279988 38144955 37673572 38193166 39805079 42334738 45449692
2975.8 45449692 48806870 52213424 55683035 59265113 62933815 66643614 70332915 73929590
2992.1 73929590 77358598 80457556 83116561 85355949 87182957 88658577 89853179 90744495 91370749
3010.5 91370749 91891485 92416781 92922658 93360388 93724209 94009751 94242483 94462764 94626349 94710857
3030.9 94710857 94789594 94939226 95132840 95248359 95280540 95335418 95445538 95552224 95579892 95532858 95455712
3053.3 95455712 95355850 95274568 95249522 95239925 95209914 95183247 95215309 95317185 95432836 95512241 95543998
3075.8 95543998 95567065 95662355 95841825 96036291 96213061 96364015 96485996 96602792 96711534 96781772
3096.2 96781772 96803236 96815759 96866071 96922642 96930462 96918964 96950680 96987355 96955621 96904862 96917993 96998876
3120.6 96998876 97105706 97185808 97214764 97214985 97225547 97249138 97246069 97194171 97147799 97172678 97227991 97247946
3145.1 97247946 97229916 97166520 97074938 97041857 97090626 97144121 97155696 97145915 97139454 97124636 97092354 97062802
3169.6 97062802 97042543 97017556 96979642 96938890 96919823 96922332 96919143 96911758 96914423 96918225 96917379 96918672 96924764
3196.1 96924764 96936125 96952420 96971554 96995175 97020686 97046041 97066998 97076005 97076100 97066671 97058839 97083479 97130984
3222.6 97130984 97157776 97160107 97155249 97128981 97096097 97111225 97167343 97218037 97244096 97230977 97177976 97137785
3247.1 97137785 97155535 97192079 97188878 97154260 97139770 97155827 97161782 97130972 97074908 96994549 96882778 96788198
3271.6 96788198 96739852 96708113 96667904 96592444 96466333 96295571 96090770 95845640 95528609 95160758
3292 95160758 94835597 94644541 94643903 94805413 95010775 95184177 95355982 95571905 95812976 96021348 96178144
3314.4 96178144 96311182 96430916 96515876 96553028 96574998 96634954 96728104 96801853 96831280 96823186 96795928
3336.8 96795928 96786314 96807033 96836299 96863019 96867490 96840644 96832079 96864516 96895462 96897870 96873963 96848476
3361.3 96848476 96826184 96772796 96710390 96711498 96782696 96847314 96862358 96856964 96851140 96838957 96830690 96836591 96813589
3387.8 96813589 96727616 96653038 96659648 96681118 96641874 96578330 96579707 96652704 96698105 96674508 96631807 96604776
3412.3 96604776 96595567 96582741 96540010 96495366 96491104 96496153 96446103 96351278 96286917 96246403 96185702 96182042
3436.8 96182042 96293807 96419924 96464562 96441042 96437794 96529710 96647793 96701014 96710229 96688950 96630913
3459.2 96630913 96599174 96584481 96468079 96294165 96277350 96440780 96573550 96568877 96450454 96303111 96273196
3481.6 96273196 96316665 96290153 96244109 96236193 96200579 96110511 96011019 95937693 95848829 95730621 95706904 95771813
3506.1 95771813 95777082 95744526 95756239 95790559 95817560 95816290 95748800 95630342 95561010 95583469 95661765 95777649
3530.6 95777649 95860505 95849180 95835841 95895922 95913988 95793384 95646918 95663410 95809245 95898926 95955181
3553 95955181 96060145 96116269 96055681 95928842 95714289 95390236 95276135 95597470 95961380 96095932
3573.4 96095932 96106601 96102720 96090835 96048826 95879340 95561194 95438957 95710164 95943362 95945489 95938164
3595.8 95938164 95989883 96043128 96136093 96175063 96025324 95826823 95767313 95772213 95780677 95744318 95664811 95828378
3620.3 95828378 96186936 96308821 96003759 95618737 95802349 96252936 96534121 96693879 96767497 96762675
3640.7 96762675 96680862 96369028 95743883 95273495 95610988 96259648 96567506 96699500 96930414 97123265
3661.1 97123265 97192997 97111082 96770829 96313643 96122575 96004176 95880598 96216738 96735740 97048122
3681.5 97048122 97122622 96909934 96454477 96231312 96567494 97031713 97294891 97355533 97270751 97203833
3701.9 97203833 97288781 97310388 97058707 96688920 96667415 97059447 97370028 97377884 97196126 97003251 96917051
3724.3 96917051 96984917 97087067 96925825 96402633 95948690 96087688 96557581 96740985 96443462 96097970
3744.7 96097970 96113396 96060586 95984048 96341413 96764654 96879435 96870601 97015828 97138584 97060901 96948457
3767.2 96948457 96941495 97105515 97321975 97350180 97180951 97052860 97118604 97198528 97231412 97317588 97386670
3789.6 97386670 97353303 97189099 96931952 96716040 96504104 96386099 96524066 96649909 96806800 97077024
3810 97077024 97145426 96873617 96512282 96298671 96130532 96229690 96568620 96759403 96805352 96735620 96552968
3832.4 96552968 96320689 96055084 95929563 96094495 96400172 96700108 96870303 96738231 96207571 95599133
3852.8 95599133 95738977 96319175 96631074 96584105 96361411 96259385 96235842 96108735 96102387 96306664
3873.2 96306664 96545541 96640348 96475154 96312666 96283525 96307033 96460921 96535355 96497732 96616352 96694058
3895.7 96694058 96440542 96031469 95814234 95919478 96286654 96662098 96846074 96852875 96726030 96519136
3916.1 96519136 96400321 96428257 96453834 96429944 96457475 96475166 96374953 96321034 96441895 96573591 96580368
3938.5 96580368 96464843 96323442 96269417 96254903 96245605 96310735 96396911 96414477 96388829 96362168 96347523
3960.9 96347523 96358597 96369445 96336645 96271986 96213561 96174455 96165061 96183938 96181667 96137470 96109486 96114802
3985.4 96114802 96092272 96032947 95991743 95978469 95965981 95959461
3997.6 95959461
##END=$$ End of the data block
