##TITLE=Silicone 2 $$ Begin of the data block
##JCAMP-DX=5.00 $$ ACD/SpecManager v 10.08
##DATE=14 Dec 2016 11:33:00
##DATA TYPE=INFRARED SPECTRUM
##DATA CLASS=XYDATA
##ORIGIN=Marcelo Quint
##OWNER=
##NPOINTS=1667
##FIRSTX=599.65820312
##LASTX=3997.72216797
##MAXX=3997.72216797
##MINX=599.65820312
##MAXY=1.06791592
##MINY=0.36861771
##XFACTOR=1.0000000000
##YFACTOR=0.000000010000000
##FIRSTY=1.01839483
##DELTAX=2.03965425
##XUNITS=1/CM
##YUNITS=ARBITRARY UNITS
##XYDATA=(X++(Y..Y))
599.7A01839483n6339l2901J2290M363q583K1649L6633L7455N5266L4737l4344p3469
$$ 101839483 101783144 101750243 101762533 101766896 101758313 101779962 101816595 101854050 101909316 101944053 101909709 101836240
624.1A01836240l4690K063k0755l3760o306L1650N5111M0102J7011J0741j6296r3174
$$ 101836240 101801550 101803613 101782858 101749098 101742792 101774442 101829553 101869655 101886666 101897407 101881111 101787937
648.6A01787937k09618l67606p03227j221222j425218r08608j60724J90372K43669
$$ 101787937 101578319 101210713 100507486 99286264 97861046 96952438 96791714 96982086 97225755
667I7225755J48899k7716q1051j18094k03562l01558l79062l84962k69890r6434L087
$$ 97225755 97374654 97346938 97265887 97147793 96944231 96642673 96263611 95878649 95608759 95512325 95515412
689.4I5515412j0967p6997j56421k22331k24084j29819M6855K97708O18386R18669
$$ 95515412 95504445 95427448 95271027 95048696 94824612 94694793 94741648 95039356 95657742 96576411
709.8I6576411J029717Q99727O41691L68417J67530R6774J12904J31350J15931P6771
$$ 96576411 97606128 98505855 99147546 99515963 99683493 99780267 99893171 100024521 100140452 100217223
730.2A00217223M0758k074o6173j02807r2583o3873l2121k4265o1655j25158j75875
$$ 100217223 100257981 100255907 100189734 100086927 99994344 99930471 99898350 99874085 99812430 99687272 99511397
752.6I9511397k16228k66892l30126m12267n20307o52808q09962j008433j280081j672393
$$ 99511397 99295169 99028277 98698151 98285884 97765577 97112769 96302807 95294374 94014293 92341900
773I2341900k211750k872741l624153m447657n306309o051851o419718o247044n554828
$$ 92341900 90130150 87257409 83633256 79185599 73879290 67827439 61407721 55160677 49605849
791.4D9605849m545661l475959k483150j565990o73318K12476J063028J780218K261257
$$ 49605849 45060188 41584229 39101079 37535089 36861771 37074247 38137275 39917493 42178750
809.7D2178750K410847K233365J915273J821095K294284L346735M549992N282742N227626
$$ 42178750 44589597 46822962 48738235 50559330 52853614 56200349 60750341 66033083 71260709
828.1G1260709M589235L758383K972639K325022J823693J426048J100742Q36820N89758
$$ 71260709 75849944 79608327 82580966 84905988 86729681 88155729 89256471 90093291 90683049
846.5I0683049L21054L1501k79146n87946q20774q99452p90137n13601j56606J66923
$$ 90683049 91004103 91035604 90756458 90168512 89347738 88448286 87658149 87144548 86987942 87154865
866.9H7154865L80349M94183O03854P68352R58806J140249J276356J296526J177657
$$ 87154865 87535214 88029397 88633251 89401603 90360409 91500658 92777014 94073540 95251197
885.2I5251197R89741Q22478O94365N84638N05513M51189M00978L56549L10970K59530
$$ 95251197 96240938 97063416 97757781 98342419 98847932 99299121 99700099 100056648 100367618 100627148
905.6A00627148K20347J97398J76466J60861J39403J11473J03748J06322R6298P2133
$$ 100627148 100847495 101044893 101221359 101382220 101521623 101633096 101736844 101843166 101939464 102011597
926A02011597L6001n710k8908k8694l2723m6789o0308p3290q3590q4519q5902j08517
$$ 102011597 102047598 102041888 102012980 101984286 101951563 101904774 101844466 101771176 101687586 101603067 101517165 101408648
950.5A01408648j50907j89936k20179k61867l12829l49558l79300m17161m50855m80587
$$ 101408648 101257741 101067805 100847626 100585759 100272930 99923372 99544072 99126911 98676056 98195469
970.9I8195469n19895n70244o44433p58106r04918j059925j215172j406520j654310
$$ 98195469 97675574 97105330 96460897 95702791 94797873 93737948 92522776 91116256 89461946
989.2H9461946j941818k271026k657485l100812l593523m120576m616964m978818n098527
$$ 89461946 87520128 85249102 82591617 79490805 75897282 71776706 67159742 62180924 57082397
1007.6E7082397m868883m246876l320086k277991j304108n12332N5319M23217O52176
$$ 57082397 52213514 47966638 44646552 42368561 41064453 40552121 40607440 41030657 41682833
1025.9D1682833P80049Q33992Q51821Q42479Q11896P73981P22286O52156N79375N01755
$$ 41682833 42462882 43296874 44148695 44991174 45803070 46577051 47299337 47951493 48530868 49032623
1046.3D9032623M16874L36940K49487J49286N5593k6745j18667k23699l20193m08644
$$ 49032623 49449497 49786437 50035924 50185210 50240803 50214058 50095391 49871692 49551499 49142855
1066.7D9142855n03245n93024o74245p53710q21194q74731r20167r52125r54362r13018
$$ 49142855 48639610 48046586 47372341 46618631 45797437 44922706 44002539 43050414 42096052 41183034
1087.1D1183034q18533o77770m92055k52542L2086L53577P03141J059306J401183J728326
$$ 41183034 40364501 39686731 39194676 38942134 38974220 39327797 40030938 41090244 42491427 44219753
1107.5D4219753K030608K285141K471387K581215K617693K583540K495521K371538
$$ 44219753 46250361 48535502 51006889 53588104 56205797 58789337 61284858 63656396
1123.9F3656396K220910K053136J892340J754099J626420J498914J375902J263720
$$ 63656396 65877306 67930442 69822782 71576881 73203301 74702215 76078117 77341837
1140.2G7341837J168531J090878J018787R48697Q87692Q38899P96241P55644P22051
$$ 77341837 78510368 79601246 80620033 81568730 82456422 83295321 84091562 84847206 85569257
1158.5H5569257O90841O51741O07318N69260N44268N33360N33045N29277N05853M62549
$$ 85569257 86260098 86911839 87519157 88088417 88632685 89166045 89699090 90228367 90734220 91196769
1178.9I1196769M23551M03899L85892L60704L34752L12024K95096K79475K61366K41047
$$ 91196769 91620320 92024219 92410111 92770815 93105567 93417591 93712687 93992162 94253528 94494575
1199.3I4494575K24471K20096K10846J84965J69081J62369J35880J07634R8342Q7273
$$ 94494575 94719046 94939142 95149988 95334953 95504034 95666403 95802283 95909917 96008259 96095532
1219.7I6095532P8273Q9210J03706J01436Q0722M3339j7917j13911k55406m62693p84349
$$ 96095532 96173805 96263015 96366721 96468157 96548879 96592218 96574301 96460390 96204984 95742291 94957942
1242.2I4957942j297015k046019l102738m849851p669979j0721821j1786556r367883
$$ 94957942 93660927 91614908 88512170 83662319 75992340 65270519 53483963 44116080
1258.5D4116080m071748K400147Q115751J1244571J1052519Q666313N934376L910827
$$ 44116080 40044332 42444479 50560230 61804801 72857320 81523633 87458009 91368836
1274.8I1368836K672631J917398J408547J056796Q18199O55079N36162M37152L64697
$$ 91368836 94041467 95958865 97367412 98424208 99242407 99897486 100433648 100870800 101235497
1293.1A01235497L13997K64752K26009K10667K03657J93417J82772J64926J42514J34635
$$ 101235497 101549494 101814246 102040255 102250922 102454579 102647996 102830768 102995694 103138208 103272843
1313.5A03272843J39547J35875J21366J05989Q3614N5754L4678K0874n37l7849o6769
$$ 103272843 103412390 103548265 103669631 103775620 103859234 103914988 103949666 103970540 103970003 103932154 103865385
1336A03865385o4623l4559o783l874j0932j1217q727j4448k4640m2379r3401j90973
$$ 103865385 103800762 103766203 103759420 103755546 103744614 103733397 103724670 103710222 103685582 103643203 103549802 103358829
1360.5A03358829l16334l82161l24571k24507k21038m00579o09612n01538l2556M60864
$$ 103358829 103042495 102660334 102335763 102111256 101890218 101489639 100880027 100378489 100345933 100806797
1380.9A00806797O31892N21004L59381J52254r8765l47400n24044m87733l16155j42431
$$ 100806797 101438689 101959693 102319074 102471328 102372563 102025163 101501119 101013386 100697231 100554800
1401.2A00554800r8610j99807l15278l58945k52533L2734L51412O22373Q15249P09641
$$ 100554800 100456190 100256383 99941105 99582160 99329627 99362361 99713773 100336146 101151395 101861036
1421.6A01861036M88853L32773J84774M3571p1990j91712l79968n02861m77230n13625
$$ 101861036 102349889 102682662 102867436 102911007 102839017 102647305 102267337 101764476 101287246 100773621
1442A00773621n51939n06121l98147k74206k83974m09693n47742l93701j6159J19782
$$ 100773621 100221682 99715561 99317414 99043208 98759234 98349541 97801799 97408098 97391939 97511721
1462.4I7511721J49876L27408P19166J200628J526540J219595P02107M30357K81859
$$ 97511721 97661597 97989005 98708171 99908799 101435339 102654934 103357041 103787398 104069257
1480.8A04069257J97339J38056R0265Q6821J14297J11640Q3196N3334K9302K5189J6332
$$ 104069257 104266596 104404652 104494917 104581738 104696035 104807675 104890871 104944205 104973507 104998696 105015028
1503.2A05015028n3728j10722J20O5374M2438P844J79j108j1671J7643L4082L4451
$$ 105015028 104961300 104850578 104850698 104916072 104958510 104966354 104966533 104965425 104953754 104971397 105005479 105039930
1527.7A05039930L9840N293j1170K9373R012n4383j7130M5895N5504K6620L612J6665
$$ 105039930 105079770 105085063 105073893 105103266 105112278 105057895 105040765 105086660 105142164 105168784 105172396 105189061
1552.2A05189061J5593r620m2975q750M9340L6192J1409j7071k7347Q691K551m2951
$$ 105189061 105204654 105195034 105152059 105143309 105192649 105228841 105240250 105223179 105195832 105204523 105207074 105164123
1576.7A05164123k2877J836j4341k1207j7345k3067k5249k0825k0767j8477j1611j1861
$$ 105164123 105141246 105143082 105128741 105107534 105090189 105067122 105041873 105021048 105000281 104981804 104970193 104958332
1601.1A04958332j0813L302J2446R990J3113K2685J4424J169J9300J5402j324K2078
$$ 104958332 104947519 104950821 104963267 104973257 104986370 105009055 105023479 105024648 105043948 105059350 105058026 105080104
1625.6A05080104L1435J9467K4963J1098k7823j3554J7166J2648l720l0315k1588J8274
$$ 105080104 105111539 105131006 105155969 105167067 105139244 105125690 105142856 105155504 105151784 105121469 105099881 105118155
1650.1A05118155o938k6774M2248M9043P200j5855J0002K1410j5688j9074J9491J5783
$$ 105118155 105111217 105084443 105126691 105175734 105182934 105167079 105177081 105198491 105182803 105163729 105183220 105199003
1674.6A05199003P296Q988j5461m4501k9874K0957L0768J5855n305l9494m6706k5726
$$ 105199003 105206299 105215287 105199826 105155325 105125451 105146408 105177176 105193031 105187726 105148232 105101526 105075800
1699A05075800j7082L791J609j1957r370j9884m4441o2799l8135L0350M5490J8454
$$ 105075800 105058718 105062509 105064118 105052161 105042791 105022907 104978466 104915667 104877532 104907882 104953372 104971826
1723.5A04971826J633j5795m1616o4301j06681j00672o3324p9966p8976k6393K7204
$$ 104971826 104973459 104957664 104916048 104851747 104745066 104644394 104581070 104501104 104422128 104395735 104422939
1746A04422939N6660J01471J72293J77109J26219Q2743N1368M2080N1082L2234P999
$$ 104422939 104479599 104581070 104753363 104930472 105056691 105139434 105190802 105232882 105283964 105316198 105324197
1768.4A05324197J395j4782j0133K0635L0005J9658J2326J4496K4128J8668m614M387
$$ 105324197 105325592 105310810 105300677 105321312 105351317 105370975 105383301 105397797 105421925 105440593 105435979 105440366
1792.9A05440366M2117M3118J6069N758K5022L6168K7824J6081J1122K1327K6440K0779
$$ 105440366 105482483 105525601 105541670 105547428 105572450 105608618 105636442 105652523 105663645 105684972 105711412 105732191
1817.3A05732191K1982J7345m161j3196j097P200K0790K4140Q250O771J4353o938l6943
$$ 105732191 105754173 105771518 105767357 105754161 105753064 105760264 105781054 105805194 105813444 105820215 105834568 105827630 105790687
1843.9A05790687j4306K0731K0802Q035L34m18k587k491j061o580k9624m5121l206
$$ 105790687 105776381 105797112 105817914 105825949 105826283 105825865 105823278 105820787 105819726 105813146 105783522 105738401 105735195
1870.4A05735195L4058J5485m828l803k026m29K336m327j5438l934J5211O855m208
$$ 105735195 105769253 105784738 105779910 105776107 105774081 105773652 105775988 105771661 105756223 105752289 105767500 105774355 105770147
1896.9A05770147J287K981j896o652j9502l2032k9433k3269k3830k6203k2482j7214
$$ 105770147 105771434 105774415 105772519 105765867 105746365 105714333 105684900 105661631 105637801 105611598 105589116 105571902
1921.4A05571902q750L910q4j8358l4380m4656n3036n8353n4836m3476j8191J3805
$$ 105571902 105563152 105567062 105566978 105548620 105514240 105469584 105416548 105358195 105303359 105259883 105241692 105255497
1945.8A05255497K7549K8634L4761L6037K9612K3210J8012K1816K7859L2854M8375
$$ 105255497 105283046 105311680 105346441 105382478 105412090 105435300 105453312 105475128 105502987 105535841 105584216
1968.3A05584216O0821N3370L8206L0160L0232K8848K1899J8466J7714Q321l648J812
$$ 105584216 105645037 105698407 105736613 105766773 105797005 105825853 105847752 105866218 105883932 105892253 105888605 105890417
1992.8A05890417J3375J5092J9312K5499K6274K4843K3353K2817K1577J7416R835M327
$$ 105890417 105903792 105918884 105938196 105963695 105989969 106014812 106038165 106060982 106082559 106099975 106109810 106114137
2017.2A06114137R096J5378J0454K397m137p701l576o902j8835k6679l6753m3690l8540
$$ 106114137 106123233 106138611 106149065 106151462 106147325 106139624 106136048 106129146 106110311 106083632 106046879 106003189 105964649
2043.7A05964649l0089k3365j7094o974L362Q547J0657J2422J8012K1899J4210J07
$$ 105964649 105934560 105911195 105894101 105887127 105890489 105899036 105909693 105922115 105940127 105962026 105976236 105976343
2068.2A05976343j335R143R835N305Q523J3018J5628J5855J3471J3673J2899P856M112
$$ 105976343 105975008 105984151 105993986 105999291 106007814 106020832 106036460 106052315 106065786 106079459 106092358 106100214 106104326
2094.7A06104326K814M315O580P618R084P844J406o378q451q607p689p16J67n638o366
$$ 106104326 106107140 106111455 106118035 106125653 106134737 106142581 106143987 106137609 106129158 106120551 106112862 106112146 106112313 106106675 106100309
2125.3A06100309m8Q095P843P189J1933P081m65K622Q178J1480J1551Q178L433K468
$$ 106100309 106100261 106108356 106116199 106123388 106135321 106142402 106141937 106144559 106152737 106164217 106175768 106183946 106187379 106189847
2153.9A06189847J0514J4878Q571L743J91j91Q166J0192J156n936l755N400Q619M530
$$ 106189847 106200361 106215239 106223810 106227553 106227744 106227553 106235719 106245911 106247067 106241131 106237376 106242776 106251395 106255925
2182.4A06255925L314J657m316n054O342J4460N829l326k861q70K599L469k825p546
$$ 106255925 106259239 106260896 106256580 106251526 106257868 106272328 106278157 106274831 106271970 106271100 106273699 106277168 106274343 106266797
2211A06266797p558k349M328k63q487n806j240n209r501p188m864o878j2613j8835
$$ 106266797 106259239 106256890 106261218 106260955 106252468 106246662 106245422 106240213 106230712 106223524 106218660 106211782 106199169 106180334
2239.5A06180334k2662k1076j3149q440j3911k1792k3281j7310n805o843j7357j6045
$$ 106180334 106157672 106136596 106123447 106115007 106101096 106079304 106056023 106038713 106032908 106026065 106008708 105992663
2264A05992663j4758j8609j9216j8382j6809j3018q142j645M554L565K634O390J3113
$$ 105992663 105977905 105959296 105940080 105921698 105904889 105891871 105883729 105882084 105886638 105890203 105892837 105899227 105912340
2290.5A05912340K1076K1124J6808J2183J2291K5451L2103K3091J7202K3603L6014
$$ 105912340 105933416 105954540 105971348 105983531 105995822 106021273 106053376 106076467 106093669 106117272 106153286
2313A06153286M6741N7996N9140L7789J6355K2114M3738M1389O139p105K2543L8660
$$ 106153286 106200027 106258023 106317163 106354952 106371307 106393421 106437159 106478548 106484687 106477582 106500125 106538785
2337.4A06538785K2578M720j6117o0582o1238J8204R5141J09005P7915M3308J9873
$$ 106538785 106561363 106566083 106549966 106489384 106428146 106446350 106541491 106650496 106728411 106771719 106791592
2359.9A06791592l10l0470o5053q2695p7629o9881o2334n4384n2166m6944k8515p415
$$ 106791592 106791282 106760812 106695759 106613064 106535435 106465554 106403220 106348836 106296670 106249726 106221211 106213796
2384.4A06213796L100M112l016q642m542J573P987J1266Q070M053K110L147M673J717
$$ 106213796 106216896 106221008 106217992 106209350 106204808 106206381 106214368 106225634 106233704 106237757 106239867 106243014 106247687 106249404
2412.9A06249404k384l600m18Q297R561O771Q953J895n352k063J204N901Q786K599
$$ 106249404 106247020 106243420 106243002 106251299 106260860 106267631 106276584 106278479 106273127 106271064 106272268 106278169 106286955 106289554
2441.5A06289554k075P51N949R203P665N460M17p403n650J681L504O581R501K634j705
$$ 106289554 106287479 106288230 106294179 106303382 106311047 106316507 106316924 106309521 106303871 106305552 106309056 106315637 106325138 106327772 106326067
2472.1A06326067j311o187j0335q786l338m77r41m89q822k6595l5441k5022j121K3771
$$ 106326067 106324756 106318569 106308234 106299448 106296110 106295633 106294692 106294203 106285381 106258786 106223345 106198323 106197202 106220973
2500.6A06220973M7183O7198P3695O4123N1808M3917L1423J6284M030q59K730k026
$$ 106220973 106268156 106335354 106409049 106473172 106524980 106568897 106600320 106616604 106620634 106619775 106622505 106620479
2525.1A06620479k3640m4500m6909m1604m0281l3236k7585l3998l3534k1660j4627
$$ 106620479 106596839 106552339 106505430 106463826 106423545 106390309 106362724 106328726 106295192 106273532 106258905
2547.5A06258905j1027p284q261p653j550M06r78k491n818p224p677j1623j4853j1039
$$ 106258905 106247878 106240594 106232333 106224680 106223130 106223536 106222558 106220067 106214249 106207025 106199348 106187725 106172872 106161833
2576.1A06161833r012j4234j6820j0300o640j3912j6379q416j431m780j1718p213J717
$$ 106161833 106152821 106138587 106121767 106111467 106104827 106090915 106074536 106066120 106064689 106059909 106048191 106040978 106042695
2602.6A06042695k086j6534j4091L123J514p391m828k026n710j3745j6237j0526n066
$$ 106042695 106040609 106024075 106009984 106013107 106014621 106007230 106002402 106000376 105994666 105980921 105964684 105954158 105949092
2629.1A05949092l815n650r859j1086n782n770j3399k0790k5988k3114k0135k6262
$$ 105949092 105945277 105939627 105929768 105918682 105912900 105907130 105893731 105872941 105846953 105823839 105803704 105777442
2653.6A05777442k5999j5688j2398j5676j4257p189J371J0491J6927J3209N495M077
$$ 105777442 105751443 105735755 105723357 105707681 105693424 105686235 105687606 105698097 105715024 105728233 105733728 105737805
2678A05737805J2744K7239K8038J3423M220k408q607L195J6475J0609l612q702l195
$$ 105737805 105750549 105777788 105805826 105819249 105823469 105821061 105812454 105815649 105832124 105842733 105839121 105830419 105827224
2704.6A05827224n018j0312j1575k1243k8468k0837k0314k7263k3424j9694r620J0920
$$ 105827224 105822206 105811894 105800319 105779076 105750608 105729771 105709457 105682194 105658770 105639076 105629456 105640376
2729A05640376J7631J6772J8692K0528K2233J7214Q607o974j5652L45J1206J621p999
$$ 105640376 105658007 105674779 105693471 105713999 105736232 105753446 105762053 105755079 105739427 105739772 105750978 105752599 105744600
2755.6A05744600q571j0943j4317j4222k1148l6502n5718p1120p0989n4145m8936p0560
$$ 105744600 105736029 105725086 105710769 105696547 105675399 105638897 105583179 105512059 105441070 105386925 105337989 105267429
2780A05267429r1147r8062j11150j25575j06478p0262n8591o9345o9773m7898m0436
$$ 105267429 105176282 105078220 104967070 104841495 104735017 104664755 104606164 104536819 104467046 104419148 104378712
2802.5A04378712n2893o7818r0575r2924p0679p6151j11759j37102j47617j65987k06185
$$ 104378712 104325819 104258001 104167426 104074502 104003823 103927672 103815913 103678811 103531194 103365207 103159022
2824.9A03159022k68542l52717m70722o24525q04138j025761j286357j549858j790619
$$ 103159022 102890480 102537763 102067041 101442516 100638378 99612617 98326260 96776402 94985783
2843.3I4985783j990169k165550k287752k143108j516194n38277L78042R62389J205498
$$ 94985783 92995614 90830064 88542312 86399204 84883010 84344733 84722775 85685164 86890662
2861.6H6890662J134652Q01140L81034O7133Q106K83796P23171R66591Q46719M91918
$$ 86890662 88025314 88826454 89207488 89274621 89282727 89566523 90289694 91256285 92103004 92594922
2882I2594922P2020l19880o41609q95923j090676j217866j284855j323050j337177
$$ 92594922 92666942 92347062 91705453 90809530 89718854 88500988 87216133 85893083 84555906
2900.4H4555906j300424j207173j089788j027882j102984j319480j615953j907438
$$ 84555906 83255482 82048309 80958521 79930639 78827655 77508175 75892222 73984784
2916.7G3984784k086341k024401j598274q10129J50561J033241J662505K026951K205855
$$ 73984784 71898443 69874042 68275768 67465639 67616200 68649441 70311946 72338897 74544752
2935G4544752K212637J991129J511932P91502r8604j043904j940447k683926l156215
$$ 74544752 76757389 78748518 80260450 81051952 80953348 79909444 77968997 75285071 72128856
2953.4G2128856l267926k958083k146810p65020J057440K922171M347569N035955N009514
$$ 72128856 68860930 65902847 63756037 62991017 64048457 66970628 71318197 76354152 81363666
2971.7H1363666M492629L755402L008861K366524J863969J472980J154840Q94814O85370
$$ 81363666 85856295 89611697 92620558 94987082 96851051 98324031 99478871 100373685 101059055
2990.1A01059055N43475M66955M01747L43538K97892K40481J93739J59776J08325O1036
$$ 101059055 101602530 102069485 102471232 102814770 103112662 103353143 103546882 103706658 103814983 103876019
3010.5A03876019O2143J03164J32597J18982Q6093O3229N2619M9925L1554N567O402
$$ 103876019 103938162 104041326 104173923 104292905 104378998 104442227 104494846 104544771 104576325 104581892 104588294
3032.9A04588294L0887M3798J7166r680j597K4449M0806K8276J7905K2185K0004K3710
$$ 104588294 104619181 104662979 104680145 104670465 104668868 104693317 104734123 104762399 104780304 104802489 104822493 104846203
3057.4A04846203K5535J0490q154j6450P796M7433M4501M268k7216l6728j1373K5797
$$ 104846203 104871738 104882228 104874074 104857624 104865420 104912853 104957354 104961622 104934406 104897678 104886305 104912102
3081.9A04912102L2366K9075J9550O235K1743L6717J3304k1160k0349Q357J0204k3163
$$ 104912102 104944468 104973543 104993093 104999328 105021071 105057788 105071092 105049932 105029583 105037940 105048144 105024981
3106.4A05024981l0720N448R453l4844m1020P224N8102P9632O0618K6727R513J3911
$$ 105024981 104994261 104999709 105009162 104974318 104933298 104940522 104998624 105078256 105138874 105165601 105175114 105189025
3130.8A05189025K0099M447k1625j2457L9243O2347L1388m840l8100n4121j0550M5336
$$ 105189025 105209124 105213571 105191946 105179489 105218732 105281079 105312467 105307627 105269527 105215406 105204856 105250192
3155.3A05250192M2474J1516R739K5940J8275J716L648M900m912j5998j2457N639J2350
$$ 105250192 105292666 105304182 105313921 105339861 105358136 105359852 105363500 105368400 105363488 105347490 105335033 105340672 105353022
3181.8A05353022M220j943n007o366l10J3316J9550J0014j288K39P712M959J479J0347
$$ 105353022 105357242 105355299 105350292 105343926 105343616 105356932 105376482 105386496 105385208 105385447 105393159 105398118 105399597 105409944
3210.4A05409944J6773R763m351j4103r334o31k170k527r144l9506l9494K0671N4181
$$ 105409944 105426717 105436480 105432129 105418026 105408692 105408061 105405891 105403364 105394220 105354714 105315220 105335891 105390072
3236.9A05390072K7263K539j2553m0555l4582J6105L9661J9026l040L481J5819R215
$$ 105390072 105417335 105419874 105407321 105366766 105332184 105348289 105387950 105406976 105403936 105407417 105423236 105432451
3261.4A05432451j741j2862m1008o7354k6464L4583L7980K6321K2411J2684J633j216
$$ 105432451 105430710 105417848 105376840 105309486 105283022 105317605 105355585 105381906 105404317 105417001 105418634 105417418
3285.8A05417418n936l8660n9616k9826J2886L9911K8825l1984q1455n4074K2531O9439
$$ 105417418 105411482 105372822 105313206 105283380 105296266 105336177 105365002 105333018 105251563 105197489 105220020 105289459
3310.3A05289459O5196M0591J9300M839j2660l8659l9566P725M4990K6059j1683l4415
$$ 105289459 105354655 105395246 105414546 105419385 105406725 105368066 105328500 105336225 105381215 105407274 105395591 105361176
3334.8A05361176l8946j1516J6177J4222K1624J6582k5427k5213K2125M1461K4498
$$ 105361176 105322230 105310714 105326891 105341113 105362737 105379319 105353892 105328679 105350804 105392265 105416763
3357.2A05416763M709K980j1003n7650p5030j6713O6137Q4281L8564j514j2171p75
$$ 105416763 105421472 105424452 105413449 105355799 105280769 105264056 105330193 105414474 105453038 105451524 105439353 105438578
3381.7A05438578J6487J5485j6594n8484m2105K4200L5226k2435m5788K1422Q1372
$$ 105438578 105455065 105470550 105453956 105395472 105353367 105377567 105412793 105390358 105344570 105365992 105447364
3404.1A05447364M5562k826l707Q321K5606L0649J1706O831J8429J3710j9491m1843
$$ 105447364 105492926 105490100 105486393 105494714 105520320 105550969 105562675 105569506 105587935 105601645 105582154 105540311
3428.6A05540311j2731J740k4676j204N7387O0475K3282o938j4425P320K8503L0160
$$ 105540311 105527580 105529320 105504644 105503440 105560827 105621302 105644584 105637646 105623221 105630541 105659044 105689204
3453.1A05689204K0849k86j4329m315j788l3224n3894J943P0977N5635N376k5153j8287
$$ 105689204 105710053 105709767 105695438 105691123 105689335 105656111 105602217 105604160 105675137 105730772 105736148 105710995 105692708
3479.6A05692708L0697M6122J3006L33J4925K3366P045j7536j5986j7655k9456J0907
$$ 105692708 105723405 105769527 105782533 105782866 105797791 105821157 105828202 105810666 105794680 105777025 105747569 105758476
3504.1A05758476O2037M8399N84k8658k587M6826M3571o867m6599k5225J9324K3139
$$ 105758476 105820513 105868912 105869496 105840838 105838251 105885077 105928648 105921781 105875182 105849957 105869281 105892420
3528.5A05892420J9276N078k5677j1599K6392J0193k9719k8849R859M3869L3140J5485
$$ 105892420 105911696 105916774 105891097 105879498 105905890 105916083 105886364 105857515 105867374 105911243 105944383 105959868
3553A05959868K5106J5438j5152j7786J383n126l1972j6964K4176K5141j275j0872
$$ 105959868 105984974 106000412 105985260 105967474 105968857 105963731 105931759 105914795 105938971 105964112 105962837 105951965
3577.5A05951965j2195k4009l6788l6180o652K9552K2841N9l111j359j717P642K3698
$$ 105951965 105939770 105915761 105878973 105842793 105836141 105865693 105888534 105888593 105885482 105884123 105882406 105890048 105913746
3604A05913746K4784R620P165j860k1231k3520l4535k2769L0005N5396K4927n5790
$$ 105913746 105938530 105948150 105955315 105953455 105932224 105908704 105874169 105851400 105881405 105936801 105961728 105905938
3628.5A05905938o5636K312K1291J7488L779j1051j013N197k7978q0788j7583R4139
$$ 105905938 105840302 105842614 105863905 105881393 105885172 105874121 105873108 105878305 105850327 105769539 105751956 105846095
3653A05846095O9857p499o949K4437M0341M6992K0838k9743j7726J1647l9411m4000
$$ 105846095 105915952 105908453 105901504 105925941 105966282 106013274 106034112 106004369 105986643 105998290 105958879 105914879
3677.4A05914879N96k611k670j6761q3554r0098l207K2292J3388J9764R144j5283k193
$$ 105914879 105915475 105912864 105910194 105893433 105809879 105719781 105716574 105738866 105752254 105772018 105781162 105765879 105763686
3703.9A05763686L1960K5582j2767k5487N579K7275L2604K8252J0896R453K7120M3011
$$ 105763686 105795646 105821228 105808461 105782974 105788553 105815828 105848432 105876684 105887580 105897033 105924153 105967164
3728.4A05967164L8230k0957r3317o2680L0053P6449L6955m3154j9419R107n2261p1216
$$ 105967164 106005394 105984437 105891120 105828440 105858493 105934942 105971897 105928743 105909324 105918431 105866170 105794954
3752.9A05794954k1374j0216k9576k897K1565n448m756K0194L2198L9709K2495r203
$$ 105794954 105773580 105763364 105733788 105730891 105752456 105747008 105742252 105762446 105794644 105834353 105856848 105847645
3777.4A05847645q118M3761O8021L9625J1111l910K777K4581L4022M4239K8396j9050
$$ 105847645 105839527 105883288 105951309 105990934 106002045 105998135 106000912 106025493 106059515 106103754 106132150 106113100
3801.8A06113100n329K718r799L4655N9723J0515m8352k9719k1755l4201j264K9171
$$ 106113100 106107771 106110489 106100690 106135345 106195068 106205583 106157231 106127512 106105757 106071556 106070292 106099463
3826.3A06099463M2998K4796J79o068k5821m3118j3625J3315J3435L8409Q1086O3897
$$ 106099463 106142461 106167257 106167436 106161368 106135547 106092429 106078804 106092119 106105554 106143963 106225049 106288946
3850.8A06288946n6720r8622J8585O1822K3603k8419k4486K3091J5438o581J824k301
$$ 106288946 106232226 106133604 106152189 106214011 106237614 106209195 106184709 106207800 106223238 106216657 106218481 106216180
3875.3A06216180l93j431L910L148j6416J4246L0565j6725j4663L5573K4783k4617
$$ 106216180 106215787 106214356 106218266 106221414 106204998 106219244 106249809 106233084 106218421 106253994 106278777 106254160
3899.7A06254160k7418m947r608j1313J2219L2568K5129p27j7917p546N710n448r179
$$ 106254160 106226742 106221795 106212187 106200874 106213093 106245661 106270790 106270063 106252146 106244600 106250310 106244862 106235683
3926.3A06235683M423j3447l4988J323L7217K3377n114k6786k3580K063J4245J2744
$$ 106235683 106240106 106226659 106191671 106192994 106230211 106253588 106248474 106221688 106198108 106200171 106214416 106227160
3950.7A06227160J370p498L803J2112Q785J419o926j8609k0933n925n793j514J8287
$$ 106227160 106228530 106221032 106224835 106236947 106245732 106247151 106240225 106221616 106200683 106194758 106188965 106187451 106205738
3977.2A06205738J1134j9169k8598o032M804n853r895j0681j5116q821
$$ 106205738 106216872 106197703 106169105 106163073 106167877 106162024 106152129 106141448 106126332 106117511
3997.6A06117511
$$ 106117511
##END=$$ End of the data block
