##TITLE=Silicone 17 $$ Begin of the data block
##JCAMP-DX=5.00 $$ ACD/SpecManager v 10.08
##SPECTROMETER/DATA SYSTEM=Alpha
##DATE=14 Dec 2016 11:33:10
##DATA TYPE=INFRARED SPECTRUM
##DATA CLASS=XYDATA
##ORIGIN=
##OWNER=
##NPOINTS=1667
##FIRSTX=599.65820312
##LASTX=3997.72216797
##MAXX=3997.72216797
##MINX=599.65820312
##MAXY=1.05987692
##MINY=0.44219676
##XFACTOR=1.0000000000
##YFACTOR=0.000000010000000
##FIRSTY=0.98120475
##DELTAX=2.03965425
##XUNITS=1/CM
##YUNITS=ARBITRARY UNITS
##XYDATA=(X++(Y..Y))
599.7I8120475j6684N883J6237J4168J8930L9053M1390M7576Q1688Q2082L4129j2552
$$ 98120475 98103791 98109674 98125911 98140079 98159009 98198062 98239452 98287028 98368716 98450798 98484927 98472375
624.1I8472375k0188K68L975r334N120N9176Q8417O5661M5496J2589n5564j31315k27314
$$ 98472375 98452187 98452455 98456430 98447096 98452216 98511392 98599809 98665470 98710966 98723555 98667991 98536676 98309362
650.7I8309362l83115p28035j251149j434737q75879j14226J57523N0759K8742J15931
$$ 98309362 97926247 97198212 95947063 94512326 93636447 93522221 93679744 93730503 93759245 93875176
671I3875176L7193j03939k13593k98977l66699l65621k64585j09095J0914J4096n6183
$$ 93875176 93912369 93808430 93594837 93295860 92929161 92563540 92298955 92189860 92200774 92214870 92158687
693.5I2158687j22708j83415k04599j39201J6314K81900O21450R01711R87458Q57109
$$ 92158687 92035979 91852564 91647965 91508764 91525078 91806978 92428428 93330139 94317597 95174706
713.9I5174706O02883L19988J15513O1948R0003R9891P1835K7848j2982o3068j25783
$$ 95174706 95777589 96097577 96213090 96275038 96365041 96464932 96536767 96564615 96551633 96488565 96362782
736.3I6362782j52857j24859q5611p6347r7484j35856j88262k36255k73984l17222
$$ 96362782 96209925 96085066 95999455 95923108 95825624 95689768 95501506 95265251 94991267 94674045
756.7I4674045l92664n13440o35636p43878q84545j083105j351166j708085k152252
$$ 94674045 94281381 93767941 93132305 92388427 91503882 90420777 89069611 87361526 85209274
775.1H5209274k673822l267527l879279m420984m806131m899716m605770l969437l170836
$$ 85209274 82535452 79267925 75388646 70967662 66161531 61261815 56656045 52686608 49515772
793.4D9515772k383670j664839r70748k76839L78433R71168J450515J744383J810253
$$ 49515772 47132102 45467263 44496515 44219676 44598109 45569277 47019792 48764175 50574428
811.8E0574428J668238J440162J396316J763934K539736L451336M064440M125482L736466
$$ 50574428 52242666 53682828 55079144 56843078 59382814 62834150 66898590 71024072 74760538
830.1G4760538L145898K539551K017516J608890J286978J003402P65121N54502L06678
$$ 74760538 77906436 80445987 82463503 84072393 85359371 86362773 87127894 87682396 87989074
848.5H7989074K4730k59221n30541p37792p96896o89793m43250j15120J76221L56865
$$ 87989074 88013804 87754583 87224042 86486250 85689354 84999561 84556311 84441191 84617412 84974277
868.9H4974277M63396N79000P43627R36830J110316J227456J247680J141650R68504
$$ 84974277 85437673 86016673 86760300 87697130 88807446 90034902 91282582 92424232 93392736
887.3I3392736Q17007O94417N79846M83394L98696L15856K39391J67602R2578K0033
$$ 93392736 94209743 94904160 95484006 95967400 96366096 96681952 96921343 97088945 97181523 97201556
907.6I7201556l6895p8780j06770j29711j39731j13386o9791l6538p451J1719J5014
$$ 97201556 97164661 97085881 96979111 96849400 96709669 96596283 96526492 96489954 96482503 96494222 96509236
930.1I6509236K7758N4777P6544Q4865P6634N7441M2540K5934o038n7805j28460j95080
$$ 96509236 96536994 96591771 96668315 96753180 96829814 96887255 96929795 96955729 96949691 96891886 96763426 96568346
954.6I6568346k50393l07441l54558l80463l88711l88736m02218m39960n02538n95653
$$ 96568346 96317953 96010512 95655954 95275491 94886780 94498044 94095826 93655866 93153328 92557675
975I2557675p06780q10159r07921j020736j162183j343584j559460j801503k070665
$$ 92557675 91850895 91040736 90132815 89112079 87949896 86606312 85046852 83245349 81174684
993.3H1174684k370656k701676l039163l361094l630251l778088l744936l476745k958989
$$ 81174684 78804028 76102352 73063189 69702095 66071844 62293756 58548820 55072075 52113086
1011.7E2113086k266312j523766q53255l29566M7994K93964M36187N20140N66127N84200
$$ 52113086 49846774 48323008 47469753 47140187 47188181 47482145 47918332 48438472 49004599 49588799
1032.1D9588799N71675N36090M98432M54896M08638L72457L26211K66218K03305J36435
$$ 49588799 50160474 50696564 51194996 51649892 52058530 52430987 52757198 53023416 53226721 53363156
1052.5E3363156P3898J8120l5781r7835j68055k39390l05343l62110m10604m61078
$$ 53363156 53437054 53455174 53419393 53321558 53153503 52914113 52608770 52246660 51836056 51374978
1072.9E1374978n15521n60784n99337o22874o24588o11002n78963n11057l99443k60910
$$ 51374978 50859457 50298673 49699336 49076462 48451874 47840872 47261909 46750852 46351409 46090499
1093.3D6090499j01522R0006L09092N37410P68972R92754J200357J385253J535953
$$ 46090499 45988977 46078983 46388075 46925485 47694457 48687211 49887568 51272821 52808774
1111.6E2808774J646667J720739J757508J749408J706767J638741J550174J453191
$$ 52808774 54455441 56176180 57933688 59683096 61389863 63028604 64578778 66031969
1127.9F6031969J364463J285446J206869J134872J069737R99719R27156Q68875Q26209
$$ 66031969 67396432 68681878 69888747 71023619 72093356 73093075 74020231 74889106 75715315
1146.3G5715315P85894P43931P09713O80822O50006O26987O04582N73600N41716N10473
$$ 75715315 76501209 77245140 77954853 78635675 79285681 79912668 80517250 81090850 81632566 82143039
1166.7H2143039M93270N02443N20158N24652N09590M81975M53716M23730L92878L72857
$$ 82143039 82636309 83138752 83658910 84183562 84693152 85175127 85628843 86052573 86445451 86818308
1187.1H6818308L57514L39192L23862L07316K93451K91479K84445K70766K66654K64406
$$ 86818308 87175822 87515014 87838876 88146192 88439643 88731122 89015567 89286333 89552987 89817393
1207.5H9817393K55602K50251K49862K48474K46978K38210K19256K00802J89477J85132
$$ 89817393 90072995 90323246 90573108 90821582 91068560 91306770 91526026 91726828 91916305 92101437
1227.9I2101437J80369J52451Q0788l2919j81061l77590o70230j123512j779735k698088
$$ 92101437 92281806 92434257 92515045 92482126 92301065 91923475 91253245 90129733 88349998 85651910
1248.3H5651910m139477o291538q398235q853549o800145k866119J760525N923229
$$ 85651910 81512433 75220895 66822660 57969111 51168966 48302847 50063372 55986601
1264.6E5986601Q519673Q888394P467586N448550L748304K595025J853609J368707
$$ 55986601 64506274 73394668 80862254 86310804 90059108 92654133 94507742 95876449
1280.9I5876449J033444P88605O22886N16021M29613L57824L01332K61259K40564K26510
$$ 95876449 96909893 97698498 98321384 98837405 99267018 99624842 99926174 100187433 100427997 100654507
1301.3A00654507K10225J87600J67787J51968J26863J16753J16170J01113J12152J30427
$$ 100654507 100864732 101052332 101220119 101372087 101498950 101615703 101731873 101832986 101945138 102075565
1321.7A02075565J01042N4371K4116J2982k003o5088j68753k04682m8411J42741J31679
$$ 102075565 102176607 102230978 102255094 102268076 102266073 102200985 102032232 101827550 101779139 101921880 102053559
1344.1A02053559K4950k7394k8467l0911m3726n2416j50049l54421m24600k49207j09291
$$ 102053559 102078509 102051115 102022648 101991737 101948011 101895595 101745546 101391125 100966525 100717318 100608027
1366.6A00608027p1323j62613n04089p38531n06991r42M90475O43456M13334J89483
$$ 100608027 100536704 100374091 99870002 99131471 98624480 98623538 99114013 99757469 100170803 100360286
1387A00360286J23155j07050n38802p33548n14126k02918R608o3002k09898k14880
$$ 100360286 100483441 100376391 99837589 99104041 98589915 98386997 98396605 98333603 98123705 97908825
1407.4I7908825k48236j89352M4888J99473L19833P35181R22478O52128M11117J69075
$$ 97908825 97660589 97471237 97516125 97715598 98035431 98770612 99693090 100345218 100756335 100925410
1427.8A00925410l4309q8334k92814n72091l70580j25479l11101n10961n64909m33367
$$ 100925410 100891101 100802767 100509953 99937862 99567282 99441803 99130702 98619741 98054832 97621465
1448.2I7621465k13266l05932p18374j066428m01312M48573L06147Q8364M26996Q09550
$$ 97621465 97408199 97102267 96383893 95317465 94916153 95364726 95670873 95759237 96186233 96995783
1468.6I6995783Q99875J082838J225471J024556O84071L70920J95658Q380k45642j98317
$$ 96995783 97895658 98978496 100203967 101228523 101912594 102283514 102479172 102487552 102241910 102043593
1489A02043593K79665M14991L7885j33526J51813K56860j06180p30967n44727N55718
$$ 102043593 102323258 102738249 102776134 102642608 102794421 103051281 102945101 102214134 101669407 102225125
1509.4A02225125O29985J46270k46608k93041k18474j17279K14983K99000K74384K02406
$$ 102225125 102855110 103001380 102754772 102461731 102243257 102125978 102340961 102639961 102914345 103116751
1529.7A03116751j10555j47641L3534l57711p27320J2123O06776N59640K44903j6796
$$ 103116751 103006196 102858555 102892089 102534378 101807058 101819181 102425957 102985597 103230500 103213704
1550.1A03213704q2791k31993n63038o85036L98207Q76176L67236j4245j68681J5652
$$ 103213704 103130913 102898920 102335882 101650846 102049053 102925229 103292465 103278220 103109539 103125191
1570.5A03125191J70004j12891j41144K61450K65706O8926k825j4055l2699m1127m0281
$$ 103125191 103295195 103182304 103041160 103302610 103568316 103637242 103634417 103620362 103587663 103546536 103506255
1593A03506255j5950K4033Q845l1674j2088J3209r311J2112N1963p1013k77090r9993
$$ 103506255 103490305 103514338 103523183 103491509 103479421 103492630 103483319 103495431 103547394 103476381 103199291 103099298
1617.5A03099298J93573K539j21796P0834J49607J43791m054l88932m09293K51997
$$ 103099298 103292871 103295410 103173614 103244448 103394055 103537846 103533792 103144860 102735567 102987564
1637.9A02987564M35960J34802k54083m96089j05977R8586l74997j2505P97570N02968
$$ 102987564 103423524 103558326 103304243 102808154 102702177 102800763 102425766 102413261 103210831 103713799
1658.2A03713799k027j53935O4659Q476l17407j86598J12522O9201J43909J51563j87326
$$ 103713799 103711772 103557837 103622496 103630972 103313565 103126967 103239489 103308690 103452599 103604162 103416836
1680.7A03416836n22589j58930N16212M33337K02918n8352m29202m51529k10845J63972
$$ 103416836 102894247 102735317 103251529 103684866 103887784 103829432 103400230 102948701 102737856 102901828
1701.1A02901828M11630K41697K21121K59996L8337k85673m93693k11334M50182N20527
$$ 102901828 103313458 103555155 103776276 104036272 104074609 103788936 103295243 103083909 103534091 104054618
1721.5A04054618K18868N6255o9737k40422l76332k99346K08473K94352L8600Q821
$$ 104054618 104273486 104329741 104260004 104019582 103643250 103343904 103552377 103846729 103885329 103894150
1741.9A03894150L7182o8689j99437j04237K41316K90358N1248m0507n5445k837J34301
$$ 103894150 103931332 103862643 103663206 103558969 103800285 104090643 104141891 104101384 104045939 104043102 104177403
1764.3A04177403l528k27571k72774q9348K52927K94256Q3101k6131J6630N6564O3956
$$ 104177403 104173875 103946304 103673530 103584182 103837109 104131365 104214466 104188335 104204965 104261529 104325485
1786.7A04325485p1847k65193r6619K23803J63543l7872k3806J49023J71113M0150
$$ 104325485 104253638 103988445 103891826 104115629 104279172 104241300 104217494 104366517 104537630 104577780
1807.1A04577780n3895m697J04022Q9097K7073K5904k8646j44350j28878o2108k8026
$$ 104577780 104523885 104519188 104623210 104712307 104739380 104765284 104736638 104592288 104463410 104401302 104373276
1829.6A04373276J52123K10333O5911M709j6892j70148k33853M1604K28477J65129
$$ 104373276 104525399 104735732 104801643 104806352 104789460 104619312 104385459 104427063 104655540 104820669
1850A04820669P7271K1601p951k0326j4615j3542p3969k09618k01452R5404K57587
$$ 104820669 104897940 104919541 104911590 104891264 104876649 104863107 104789138 104579520 104378068 104473472 104731059
1872.4A04731059J35839K0278m828p308r894j8537o6364j02580j79P7594L1662K9456
$$ 104731059 104866898 104887176 104882348 104875040 104865146 104846609 104780245 104677665 104677486 104755080 104786742 104816198
1896.9A04816198M5491J5044r155k4522n9616o5220o532J2028p6437j31774m3094J4186
$$ 104816198 104861689 104876733 104867578 104843056 104783440 104718220 104711688 104723716 104647279 104515505 104472411 104486597
1921.4A04486597K4056Q0073O2060r298m0090m4596m6897o4433j17540j43576l0196
$$ 104486597 104510653 104590726 104652786 104643488 104603398 104558802 104511905 104447472 104329932 104186356 104156160
1943.8A04156160R6548R9158N8854L7408L0422L1435K7895K0385K2841N197q917M8662
$$ 104156160 104252708 104351866 104410720 104448128 104478550 104509985 104537880 104558265 104581106 104586303 104577386 104626048
1968.3A04626048J02686P9775M6289L8815L4702K9909K5511J2374p975l0458m4596
$$ 104626048 104728734 104808509 104854798 104893613 104928315 104958224 104983735 104996109 104988134 104957676 104913080
1990.7A04913080N150P0536N6684K9278L1650L0243K5475K3460K3175K0659M434k1994
$$ 104913080 104918230 104988766 105045450 105074728 105106378 105136621 105162096 105185556 105208731 105229390 105233824 105211830
2015.2A05211830j6951K4175L7468J9777R167q4o425n531r239j7750l3331n1165m6778
$$ 105211830 105194879 105219054 105256522 105276299 105285466 105285382 105278957 105273426 105264187 105246437 105213106 105161941 105115163
2041.7A05115163k5463j6689j7893j0968J526M864Q786J7392J3113l81j872J8311L0041
$$ 105115163 105089700 105073011 105055118 105044150 105045676 105050540 105059326 105076718 105089831 105089450 105087578 105105889 105135930
2068.2A05135930K0265J5283J2839P045P903J0753J2577J5235J2040J0800J8323J7488
$$ 105135930 105156195 105171478 105184317 105191362 105199265 105210018 105222595 105237830 105249870 105260670 105278993 105296481
2092.7A05296481O973L469P332P403O616J0764R883K563l457o855p319p916p188j764
$$ 105296481 105303454 105306923 105314255 105321658 105328274 105339038 105348921 105351484 105348027 105341172 105333853 105325937 105318749 105316985
2121.2A05316985K920K158R42L445M530O926J1074R084Q559J2792J2743R596R334J1492
$$ 105316985 105319905 105322063 105323005 105326450 105330980 105337906 105348980 105358064 105366623 105379415 105392158 105401754 105411088 105422580
2149.8A05422580Q035K909Q857J4233Q595K575J216N830J1027P391J633J371K396K289
$$ 105422580 105430615 105433524 105442381 105456614 105465209 105467784 105469000 105474830 105485857 105493248 105494881 105496252 105498648 105500937
2178.4A05500937K563M196N495L314J812K396L088N555L314J67K623K503J764J228
$$ 105500937 105503500 105507696 105513191 105516505 105518317 105520713 105523801 105529356 105532670 105532837 105535460 105537963 105539727 105540955
2206.9A05540955q22K336P081Q798J1480Q559j383m17O115K15n49J3614J9980J5676
$$ 105540955 105540133 105542469 105549550 105558348 105569828 105578387 105577004 105576587 105582702 105582917 105582368 105595982 105615962 105631638
2235.5A05631638J3792J6093K0147K4199K6000K2840J8060J6153J7715K0385K2637
$$ 105631638 105645430 105661523 105681670 105705869 105731869 105754709 105772769 105788922 105806637 105827022 105849659
2257.9A05849659J8776J3602K0599K4843J8990J7047J3507O878L791j884l135r54j4579
$$ 105849659 105868435 105882037 105902636 105927479 105946469 105963516 105977023 105983901 105987692 105985808 105982673 105981719 105967140
2284.4A05967140l5870m9293n0366m0829l2234l3486m9114o5124n8663m3965m9758
$$ 105967140 105931270 105881977 105831611 105790782 105758548 105725062 105675948 105610824 105552161 105508196 105458438
2306.8A05458438o9832p2480m1532j7440l0935m8185m9388l9923j8037m613l2544n5456
$$ 105458438 105388606 105316126 105274594 105257154 105226219 105178034 105128646 105088723 105070686 105066073 105033529 104978073
2331.3A04978073p403L8349J9002j8894l7456l0804J0550O5887O7139k694q4829j00899
$$ 104978073 104970670 105009019 105028021 105009127 104971671 104940867 104951417 105017304 105084443 105081749 104996920 104896021
2355.8A04896021o6757k6083l6Q607J3947J0932K5999O3646Q4841Q4162Q5938J03796
$$ 104896021 104829264 104803181 104803145 104811752 104825699 104836631 104862630 104926276 105011117 105095279 105181217 105285013
2380.3A05285013J13165R1791N4634K3687N316j168k050j228K789L398Q46L565P248
$$ 105285013 105398178 105489969 105544603 105568290 105573606 105572438 105570388 105569160 105571949 105575347 105576193 105579758 105587006
2406.8A05587006J692k884N36r42m375j108J514j657J549O116j276k992J132q58K551
$$ 105587006 105588698 105585814 105586350 105585408 105581033 105579925 105581439 105579782 105581331 105587447 105586171 105583179 105584311 105583453 105586004
2437.4A05586004Q679L755n353o044j239j32k121p75K169J860q11q70L58L183Q976
$$ 105586004 105594683 105598438 105593085 105587041 105585802 105585670 105583549 105582774 105584943 105586803 105585992 105585122 105585480 105588663 105597639
2468A05597639M733n818o723m602p665r775q213o712n174p844j6188k2483k6262k3222
$$ 105597639 105602372 105596554 105589831 105585229 105577564 105567789 105559576 105552864 105547690 105539846 105523658 105501175 105474913 105451691
2496.5A05451691o234K0897M4799O1893P4685O8545N0152L7980K7048J2469l016n459
$$ 105451691 105445457 105466354 105511153 105573046 105647731 105716276 105766428 105804408 105831456 105843925 105840909 105835450
2521A05835450L93n853k0504l6013m2784l7086l4738l7158l3021k8348k8860k6572
$$ 105835450 105835843 105829990 105809486 105773473 105730689 105693603 105658865 105621707 105588686 105560338 105531478 105504906
2545.5A05504906k1732j6713j2648j1682n162J061l529q702j2732j1682j681j168r620
$$ 105504906 105483174 105466461 105453813 105442131 105436969 105438030 105434501 105425799 105413067 105401385 105399704 105398536 105388916
2572A05388916j4437j5723j2982r716j1337j3792j5176j5318j2350j0145p581p451
$$ 105388916 105374479 105358756 105345774 105336058 105324721 105310929 105295753 105280435 105268085 105257940 105250359 105242908
2596.5A05242908j0848p296j788n913j3649j0204J78n96o604k694O44n710j0038r262
$$ 105242908 105232060 105224764 105222976 105217063 105203414 105193210 105193388 105192792 105186188 105183494 105184138 105178428 105168390 105159128
2625A05159128j1087j2183p975o485r930j0741r191j2207j5509j6630k0361k2411k4712
$$ 105159128 105148041 105135858 105127883 105121398 105111468 105100727 105091536 105079329 105063820 105047190 105026829 105004418 104979706
2651.5A04979706k9206k7860j5270n329p296j0538j0562j025J2505J6225J2326K694
$$ 104979706 104950500 104922640 104907370 104902041 104894745 104884207 104873645 104872620 104885125 104901350 104913676 104916370
2676A04916370k647J1909K9636K8014J6856P856l242j2613q690J383P987O068j288
$$ 104916370 104913723 104925632 104955268 104983282 105000138 105007994 105004752 104992139 104983449 104984832 104992819 104998887 104997599
2702.5A04997599o652j0395o378p808k2483k7906j9515k0373k4426j5354j4615j5438
$$ 104997599 104990947 104980552 104974174 104966366 104943883 104915977 104896462 104876089 104851663 104836309 104821694 104806256
2727A04806256j931J0932K2459K6118J7524J2815Q905J764m255n246M089J2219Q393
$$ 104806256 104804325 104815257 104837716 104863834 104881358 104894173 104903078 104904842 104900587 104895341 104899430 104911649 104920042
2753.5A04920042m828j5212j8596j9419k0850k6774l7122n1213o2918o9440o2239n3358
$$ 104920042 104915214 104900002 104881406 104861987 104841137 104814363 104777241 104726028 104663110 104593670 104531431 104478073
2778A04478073p0310r2482r4211r7776j11830j02019p3850o1608o7305p0036n6267
$$ 104478073 104407763 104315281 104221070 104123294 104011464 103909445 103835595 103773987 103706682 103636646 103580379
2800.4A03580379m8339n6040o5041p7212q0001p0000q2266j11496j24717j34456j61255
$$ 103580379 103532040 103476000 103410959 103333747 103253746 103183746 103101480 102989984 102865267 102730811 102569556
2822.9A02569556k01130k52402l23390m28892n62894p12621r03517j136369j375431
$$ 102569556 102368426 102116024 101792634 101363742 100800848 100088227 99184710 98048341 96672910
2841.2I6672910j589167j760149j912003k012587j883805j359731n28866K86287Q34078
$$ 96672910 95083743 93323594 91411591 89399004 87515199 86155468 85626602 85912889 86746967
2859.6H6746967J083922J060331P90227L97032O1590m9276J54370N46152Q05044P39127
$$ 86746967 87830889 88891220 89681447 90078479 90140069 90090793 90245163 90791315 91596359 92335486
2880I2335486M50188R6625k54798n64813q04639r63926j062554j129115j160991j153523
$$ 92335486 92785674 92882299 92627501 92062688 91258049 90294123 89231569 88102454 86941463 85787940
2900.4H5787940j106119j013833r03839q44771q96668j060409j282930j509613j672488
$$ 85787940 84681821 83667988 82764149 81919378 81022710 79962301 78679371 77169758 75497270
2918.7G5497270j645840j322001p18498L0458P41982J271725J606619J796711J840568
$$ 75497270 73851430 72529429 71810931 71841389 72583371 73855096 75461715 77258426 79098994
2937.1G9098994J702678J353395P78305K0182q19307j630396k313024k761441k879500
$$ 79098994 80801672 82155067 82933372 82953554 82134247 80503851 78190827 75429386 72549886
2955.4G2549886k611995j930213q09229O59365K191782L427136M111463M223650L911215
$$ 72549886 69937891 68007678 67198449 67857814 70049596 73476732 77588195 81811845 85723060
2973.8H5723060L374428K789146K252507J810175J460153J165539R26983P41184N95474
$$ 85723060 89097488 91886634 94139141 95949316 97409469 98575008 99501991 100243175 100838649
2992.1A00838649N06127M38047L66449L13687K67256K22945J79386J24919Q1849Q2160
$$ 100838649 101344776 101782823 102149272 102462959 102730215 102953160 103132546 103257465 103339314 103421474
3012.5A03421474J15406J36566J22190R2840P1442N7566N1475L8266J9622K0051L5703
$$ 103421474 103536880 103673446 103795636 103888476 103959918 104017484 104068959 104107225 104126847 104146898 104182601
3035A04182601M6909K9790M959O938K3794L0590J7082J3864K5964K2292J7989K5237
$$ 104182601 104229510 104259300 104264259 104271197 104294991 104325581 104342663 104356527 104382491 104404783 104422772 104448009
3059.4A04448009J9383M89o151J8572N1475M7696J6868j3841l1161q976K8324L5298
$$ 104448009 104467392 104467881 104461730 104480302 104531777 104579473 104596341 104582500 104551339 104542363 104570687 104605985
3083.9A04605985L5584L2282J0824N030J3566Q345q070n198K3329K8897j681j7643
$$ 104605985 104641569 104673851 104684675 104689705 104703271 104711616 104703546 104698348 104721677 104750574 104748893 104731250
3108.4A04731250M792J2600j9824k4271J5414M9746O4182N4646L2758K2757K4295K7371
$$ 104731250 104736042 104748642 104728818 104704547 104719961 104769707 104833889 104888535 104921293 104944050 104968345 104995716
3132.9A04995716K2673L302m089K5154M7803L5786J2911j4115k8622k217L7729M2212
$$ 104995716 105018389 105021691 105017602 105042756 105090559 105126345 105139256 105125141 105096519 105094302 105132031 105174243
3157.3A05174243K0075Q464J0801J3458J3232R990R179R048m625j3483P248K2006J0670
$$ 105174243 105194318 105202782 105213583 105227041 105240273 105250263 105259442 105268490 105263865 105250382 105257630 105279636 105290306
3183.9A05290306J1718J6487N650L6J931M673P510J2267J9002J6570M327L207J6332
$$ 105290306 105302024 105318511 105324161 105324197 105326128 105330801 105338311 105350578 105369580 105386150 105390477 105393684 105410016
3210.4A05410016J9645Q297k253q905j621J7571J6666J91j0121k2936k0349K0301M4739
$$ 105410016 105429661 105437958 105435705 105426800 105425179 105442750 105459416 105459607 105449486 105426550 105406201 105426502 105471241
3236.9A05471241K5023O985n972k6727j7810K1863L4952J2839o831K015J9908J7357
$$ 105471241 105496264 105503249 105497277 105470550 105452740 105474603 105509555 105522394 105515563 105517578 105537486 105554843
3261.4A05554843J0109R024j1313m8983l8564N448K0790K5773K7239J7452P785O795
$$ 105554843 105564952 105573976 105562663 105513680 105475116 105480564 105501354 105527127 105554366 105571818 105579603 105586398
3285.8A05586398K956k6715m2951j2660J5783K7526L0124j1110o4731m8792J5354N2166
$$ 105586398 105589354 105562639 105519688 105507028 105522811 105550337 105580461 105569351 105504620 105455828 105471182 105523348
3310.3A05523348N6767M5753K4795J1349L10k5868l7647m720K7108J8728n389k0837
$$ 105523348 105580115 105625868 105650663 105662012 105662322 105636454 105598807 105594087 105621195 105639923 105634534 105613697
3334.8A05613697k7037j1742J8346K8062K4557P582l1364l0029J8477L5286J5533k336
$$ 105613697 105586660 105574918 105593264 105621326 105645883 105653465 105622101 105592072 105610549 105645835 105661368 105659032
3359.3A05659032j657j562l6859o2347j4686O3324P7402L6490Q917q762k0337j287
$$ 105659032 105657375 105655813 105618954 105556607 105541921 105605245 105682647 105719137 105728054 105719292 105698955 105697668
3383.7A05697668K1469m65n5837n3525K1577M3332q547l0339J4710O6293N4085L827
$$ 105697668 105719137 105718672 105662835 105609310 105630887 105674219 105665672 105635333 105650043 105716336 105770421 105774248
3408.2A05774248k4319j8835Q869K3663n424k3997J0741L3760K027l1710j4806L123
$$ 105774248 105749929 105731094 105739963 105763626 105758202 105734205 105744946 105778706 105780733 105749023 105734217 105737340
3432.7A05737340j8239j1897K8658K8932k98k9730l4953K6107O6662L2938P557m124
$$ 105737340 105719101 105707204 105735862 105764794 105764496 105734766 105699813 105725920 105792582 105825520 105833077 105828953
3457.2A05828953l0768k5749L123j3304m5383j1968M5609M7731J2172m0615p0679j0741
$$ 105828953 105798185 105772436 105775559 105762255 105716872 105704904 105750513 105798244 105810416 105769801 105699122 105688381
3481.6A05688381N6744L0768n663J4544L2484J4007j4603k7990o0940r2768p844Q1539
$$ 105688381 105745125 105775893 105770230 105784774 105817258 105831265 105816662 105788672 105727732 105634964 105627120 105708659
3506.1A05708659K7311k0624J5700M5562M3559P629o3765j20687q3113P570N9021Q2445
$$ 105708659 105735970 105715346 105731046 105776608 105820167 105827796 105764031 105643344 105560231 105567801 105626822 105709267
3530.6A05709267N3394k3842k6811L7122R30j27482j66953k7764J11163O6543K5343
$$ 105709267 105762661 105738819 105712008 105749130 105750060 105622578 105455625 105427861 105539024 105605567 105630910
3553A05630910Q4579N5373n7483j24037j89233k90370j53279K29192L23212J33145
$$ 105630910 105715489 105770862 105713379 105589342 105400109 105109739 104956460 105185652 105508864 105642009
3573.4A05642009j0658m3952m1330m9686j53697l07691j81782J85418K08747l218l4046
$$ 105642009 105631351 105587399 105546069 105496383 105342686 105034995 104853213 105038631 105247378 105244160 105210114
3595.8A05210114L5405L4082M9197K4224j31369k10893r9158k5237p868j6880p3290
$$ 105210114 105245519 105279601 105328798 105353022 105221653 105010760 104911602 104886365 104878497 104861617 104788327
3618.3A04788327Q1682K63560J00231k66289m16756N2786L65460K23100J02317L6645
$$ 104788327 104870009 105133569 105233800 104967511 104550755 104603541 104969001 105192101 105294418 105331063
3638.7A05331063l0553r3746k76721n50103m73928K07936N63825K96401R8849J77479
$$ 105331063 105300510 105206764 104930043 104379940 103906012 104113948 104677773 104974174 105073023 105250502
3659.1A05250502J52516N5873n1701k74467m26543k04408r9742j72949K14016M59528
$$ 105250502 105403018 105458891 105407190 105132723 104706180 104501772 104402030 104229081 104443097 104902625
3679.5A04902625K93136P9441j71042m41944l27123J88029L63386J98662K4534j02449
$$ 104902625 105195761 105275202 105104160 104662216 104335093 104523122 104886508 105085170 105109704 105007255
3699.9A05007255j08147N6446O2442j82808l32784p2027L09694K91097M7946j26457
$$ 105007255 104899108 104955554 105017996 104835188 104502404 104430377 104740071 105031168 105079114 104952657
3720.3A04952657j54555o3312P8738J28543j01339m50409m17781Q3614L94487K10524
$$ 104952657 104798102 104734790 104813528 104942071 104840732 104390323 103972542 104056156 104450643 104661167
3740.7A04661167k10774l55029q560L672j06752K31624L66843J27387Q34J44231J47033
$$ 104661167 104450393 104095364 104086804 104090476 103983724 104215348 104582191 104709578 104710412 104854643 105001676
3763.1A05001676l9935p8797O43J39451K19572Q2481j09160j06549Q6450J33252O6185
$$ 105001676 104961741 104882944 104883587 105023038 105242610 105325091 105215931 105109382 105195832 105329084 105395269
3785.5A05395269Q5056Q0204J1564r0242j77586j36220j53864j52314J10996J64402
$$ 105395269 105480325 105560529 105572093 105481851 105304265 105168045 105014181 104861867 104972863 105137265
3805.9A05137265J40273K33722J11067j91259l36850k03216j54590N3560L22116K15947
$$ 105137265 105277538 105511260 105622327 105431068 105094218 104891002 104736412 104789972 105112088 105328035
3826.3A05328035P1574l6395j48201j82116k28035j47331J40142K95615K77162J80030
$$ 105328035 105399609 105363214 105215013 105032897 104804862 104657531 104797673 105093288 105370450 105550480
3846.7A05550480k8682l63684n77759j9253N23484L55518J597k01690j12462L588q6581
$$ 105550480 105521798 105158114 104580355 104561102 105084586 105440104 105441701 105240011 105127549 105131137 105044556
3869.1A05044556j6857J75858K10500J11782j18148j25849J0621O485J18888R1803
$$ 105044556 105027699 105203557 105414057 105525839 105407691 105281842 105292463 105298948 105417836 105509639
3889.5A05509639n3120P5698J15871j53529l40450k14350N5122L06785L59679K06887
$$ 105509639 105456519 105532217 105648088 105494559 105154109 104939759 104994881 105301666 105661345 105868232
3909.9A05868232M5002p9179j63782r9587L0887M8661J5605M8220L9410o3228m3094
$$ 105868232 105913234 105834055 105670273 105570686 105601573 105650234 105665839 105714059 105753469 105690241 105647147
3932.4A05647147J09374J31893K7919o7258j00565m1282l207l469O2633J00350M8721
$$ 105647147 105756521 105888414 105916333 105849075 105748510 105707228 105704021 105700552 105763185 105863535 105912256
3954.8A05912256L70n210p27L672R227n174k7061k3019n638J0335J9312Q976P236K0707
$$ 105912256 105912626 105907416 105906689 105910361 105919588 105914414 105887353 105864334 105858696 105869031 105888343 105897319 105904555 105925262
3983.4A05925262J1039j9968l0899j4543m387n687P034
$$ 105925262 105936301 105916333 105885434 105870891 105866504 105860817 105867851
3997.6A05867851
$$ 105867851
##END=$$ End of the data block
