##TITLE=Silicone 12 $$ Begin of the data block
##JCAMP-DX=5.00 $$ ACD/SpecManager v 10.08
##SPECTROMETER/DATA SYSTEM=Alpha
##DATE=14 Dec 2016 11:33:10
##DATA TYPE=INFRARED SPECTRUM
##DATA CLASS=XYDATA
##ORIGIN=
##OWNER=
##NPOINTS=1667
##FIRSTX=599.65820312
##LASTX=3997.72216797
##MAXX=3997.72216797
##MINX=599.65820312
##MAXY=0.78093183
##MINY=0.05868622
##XFACTOR=1.0000000000
##YFACTOR=1.000000000000000e-9
##FIRSTY=0.26073289
##DELTAX=2.03965425
##XUNITS=1/CM
##YUNITS=ARBITRARY UNITS
##XYDATA=(X++(Y..Y))
$$ plain form
599.7 260732889 248915583 238172933 230339915 225606278 222646222 220349237 217887685 213866368
616 213866368 209111422 207007095 208345696 211022213 213692233 215970591 217172861 216936901 216002315
634.3 216002315 216394842 219805658 225947157 233339816 240703061 247542843 253817648 259286553 263759196
652.7 263759196 267367721 270033956 271913975 273432404 274569243 275000066 274031550 271022707 267722636
671 267722636 264367193 260333598 255508512 249024943 238848418 222123593 199227199 177713022
687.4 177713022 167930022 173785627 190555885 209821567 225244313 235387713 241915330 246634215
703.7 246634215 250001639 250293255 246552959 244658962 252073228 264458477 270909071 268278956
720 268278956 260736138 252908111 247237071 244721308 245788425 250788927 259883761 272440225 286926001
$$ packed form
599.7B60732889j1817306j0742650p833018m733637k960056k296985k461552m021317
616B13866368m754946k104327J338601K676517K670020K278358J202270k35960r34586
634.3B16002315L92527L410816O141499P392659P363245O839782O274805N468905M472643
652.7B63759196L608525K666235J880019J518429J136839M30823r68516l008843l300071
671B67722636l355443m033595m825086o483569j0176525j6724825k2896394k1514177
687.4A77713022r783000N855605J6770258J9265682J5422746J0143400O527617M718885
703.7B46634215L367424K91616l740296j893997P414266J2385249O450594k630115
720B68278956p542818p828027n671040k515763J067117N000502R094834J2556464J4485776
$$ plain form
738.4 286926001 301587820 315278649 327587068 338520288 348152280 356412053 362926364 366725862
754.7 366725862 366419256 360751301 349091321 331854314 310336322 286800176 264523447 246568725
771 246568725 234633207 229614183 232745647 245554715 268622696 300778985 339056224 378985375
787.3 378985375 415672332 445214123 466140866 480041116 490086287 498464286 505364835 509704053
803.6 509704053 509973526 505162537 495385110 482178330 467921853 454382598 441602826 428398967
819.9 428398967 414498478 401928782 393411547 390279055 392042428 396532118 400660872 401267946
836.3 401267946 395608187 381451517 357238770 322823346 281145692 238162011 198608756 164732739
852.6 164732739 138524249 120861478 110764638 106620662 107097544 111610189 119922496 131765872
$$ packed form
738.4B86926001J4661819J3690829J2308419J0933220R631992Q259773O514311L799498
754.7C66725862l06606n667955j1659980j7237007k1517992k3536146k2276729j7954722
771B46568725j1935518n019024L131464J2809068K3067981L2156289L8277239L9929151
787.3C78985375L6686957K9541791K0926743J3900250J0045171Q377999O900549M339218
803.6E09704053K69473m810989r777427j3206780j4256477j3539255j2779772j3203859
819.9D28398967j3900489j2569696q517235l132492J763373M489690M128754O07074
836.3D01267946n659759j4156670k4212747l4415424m1677654m2983681l9553255l3876017
852.6A64732739k6208490j7662771j0096840m143976M76882M512645Q312307J1843376
$$ plain form
868.9 131765872 147334144 167542711 193734527 226682276 264786720 304659188 344835699
883.2 344835699 384999096 421209455 448387831 465510339 474076569 475358874 470201015 458993405
899.5 458993405 441731602 419270575 395218462 375752032 366048962 366672248 373775035 382165462
915.8 382165462 388209075 390962839 391429693 391147524 391390443 392764270 395221293 398693740 403318405
934.2 403318405 409318924 417094946 427046984 438914925 451285958 461797953 467778414 467517734
950.5 467517734 461743385 453370750 445510030 439722687 435937196 433663160 432873160 434060514 437972188
968.8 437972188 445050925 454920769 466370106 477806062 487851590 495679379 501075387 503986120
985.2 503986120 503939033 500336170 493154705 483202845 471824348 460198760 448542863 435767382
$$ packed form
868.9A31765872J5568272K0208567K6191816L2947749L8104444L9872468M0176511
883.2C44835699M0163397L6210359K7178376J7122508Q566230J282305n157859j1207610
899.5D58993405j7261803k2461027k4052113j9466430r703070O23286P102787Q390427
915.8C82165462O043613K753764M66854k82169K42919J373827K457023L472447M624665
934.2D03318405O000519P776022R952038J1867941J2371033J0511995N980461k60680
950.5D67517734n774349q372635p860720n787343l785491k274036p90000J187354L911674
968.8D37972188P078737R869844J1449337J1435956J0045528P827789N396008K910733
985.2E03986120m7087l602863p181465r951860j1378497j1625588j1655897j2775481
$$ plain form
1001.5 435767382 421016157 405812740 391888380 378727049 366025746 354248881 343348265
1015.8 343348265 334457308 328904927 326520771 330377132 345981091 370523900 392516822 403787732
1032.1 403787732 404330015 397680879 387100726 374659896 361331344 347330660 332544297 316977680
1048.4 316977680 300901741 284786254 268909454 253024817 236815408 220287636 203454480
1062.7 203454480 186254427 168938458 152603924 139084995 129330188 122073650 115155727 107713953
1079 107713953 100240193 93312278 87146237 81811294 77286065 73467471 70229955 67466907 65049186
1097.3 65049186 62885210 61046042 59683193 58896914 58686215 59043199 60013935 61559025 63597493
1115.7 63597493 66141903 69219925 72772026 76508008 79981364 82800150 84634677 85157081 83968095
$$ packed form
1001.5D35767382j4751225j5203417j3924360j3161331j2701303j1776865j0900616
1015.8C43348265q890957n552381k384156L856361J5603959K4542809K1992922J1270910
1032.1D03787732N42283o649136j0580153j2440830j3328552j4000684j4786363j5566617
1048.4C16977680j6075939j6115487j5876800j5884637j6209409j6527772j6833156
1062.7B03454480j7200053j7315969j6334534j3518929r754807p256538o917923p441774
1079A07713953p473760o927915o166041n334943m525229l818594l237516k763048k417721
1097.3F5049186k163976j839168j362849p86279k10699L56984R70736J545090K038468
1115.7F3597493K544410L078022L552101L735982L473356K818786J834527N22404j188986
$$ plain form
1134.1 83968095 80702491 75377531 68903290 63184611 60294818 61592244 67445830 76891758
1150.4 76891758 87517157 96803792 103947505 109496176 113586679 115911223 116936333 118428044
1166.7 118428044 122921325 132208988 145732760 160521716 172940090 180933550 184613362 184739813
1183 184739813 181485072 175145537 167712092 162819937 163951516 172583640 187446862 205139756
1199.3 205139756 221765384 235032827 245001614 252444237 256668776 255633235 247998402 234387815
1215.6 234387815 217025846 198888525 182856545 170941338 164188206 163002700 166900069 174030647
1232 174030647 181932583 188963428 194794521 199812189 204239056 207814395 210139498 210818470 209374264
1250.3 209374264 206375003 205010504 208892196 217687309 228417903 239656389 251500398 263568789
$$ packed form
1134.1H3968095l265604n324960o474241n718679k889793J297426N853586R445928
1150.4G6891758J0625399R286635P143713N548671M090503K324544J025110J491711
1166.7A18428044M493281R287663J3523772J4788956J2418374P993460L679812J26451
1183A84739813l254741o339535p433445m892155J131579Q632124J4863222J7692894
1199.3B05139756J6625628J3267443R968787P442623M224539j035541p634833j3610587
1215.6B34387815j7361969j8137321j6031980j1915207o753132j185506L897369P130578
1232A74030647P901936P030845N831093N017668M426867L575339K325103O78972j444206
1250.3B09374264k999261j364499L881692Q795113J0730594J1238486J1844009J2068391
$$ plain form
1266.6 263568789 274603277 283201724 288712531 292007804 294995338 299020261 303908199 308362871
1282.9 308362871 310717076 309383154 303401411 293284029 281190246 269693673 260260314 252855182
1299.3 252855182 246610954 240794823 235485733 231567606 229903683 230285496 231423706 231855854 230950400
1317.6 230950400 228906423 225666463 220642179 213558897 204728425 194507241 183166578 171255186
1333.9 171255186 159514144 148398936 138496697 130672082 124930441 121007882 119044498 119135931
1350.3 119135931 121197239 124562562 127768293 129157111 127808928 123718604 117825180 111056477
1366.6 111056477 104069203 98478504 96104458 98563343 106603257 119979054 138198957 159595668
1382.9 159595668 182228968 205774501 228252143 246245563 259923071 270392448 277647346
$$ packed form
1266.6B63568789J1034488Q598447N510807L295273K987534M024923M887938M454672
1282.9C08362871K354205j333922n981743j0117382j2093783j1496573r433359p405132
1299.3B52855182o244228n816131n309090l918127j663923L81813J138210M32148r05454
1317.6B30950400k043977l239960n024284p083282q830472j0221184j1340663j1911392
1333.9A71255186j1741042j1115208r902239p824615n741641l922559j963384R1433
1350.3A19135931K061308L365323L205731J388818j348183m090324n893424o768703
1366.6A11056477o987274n590699k374046K458885Q039914J3375797J8219903K1396711
1382.9A59595668K2633300K3545533K2477642J7993420J3677508J0469377P254898
$$ plain form
1397.2 277647346 282171249 284213603 283158302 278531551 270536929 259694487 248522937 241660640
1413.5 241660640 240586996 241883501 240201965 231759265 217669755 206461787 205409005 207883269
1429.8 207883269 204740897 197428510 191683248 191303894 193736419 194447905 191846803 186237112 178805962
1448.2 178805962 171156511 163480058 155756563 150416359 151791573 156719834 160621941 164252609
1464.5 164252609 171029150 183127984 200780362 221776351 237229124 243520468 243002236 233786464
1480.8 233786464 211589515 177106857 143763065 140246168 180560112 235030338 281825334
1495.1 281825334 318953633 342964500 355675429 360750198 358290374 347999126 337202787 327457190
1511.4 327457190 317123264 307092607 298427105 291180551 283351213 276279509 270251781 264411956
$$ packed form
1397.2B77647346M523903K042354j055301m626751p994622j0842442j1171550o862297
1413.5B41660640j073644J296505j681536q442700j4089510j1207968j052782K474264
1429.8B07883269l142372p312387n745262l79354K432525P11486k601102n609691p431150
1448.2A78805962p649451p676453p723495n340204J375214M928261L902107L630668
1464.5A64252609O776541J2098834J7652378K0995989J5452773O291344n18232r215772
1480.8B33786464k2196949l4482658l3343792l516897M0313944N4470226M6794996
1495.1B81825334L7128299K4010867J2710929N074769k459824j0291248j0796339r745597
1511.4C27457190j0333926j0030657q665502p246554p829338p071704o027728n839825
$$ plain form
1527.7 264411956 259665459 255983680 254335076 256042987 260658294 271184832 289204180 310502738
1544 310502738 333920091 357922465 382747442 406847149 428253025 445793539 463657439 484779716
1560.3 484779716 499458045 509086967 516026676 519524634 519763350 516903698 508566558 493558198
1576.7 493558198 476681828 455460370 424014032 386540979 355247080 340278774 339432806 340080857
1593 340080857 335600972 334179282 346665204 372241497 401560515 427123547 446896046 461059362
1609.3 461059362 469835490 474559784 478516638 486607403 499098033 514672816 534697473 555219650
1625.6 555219650 572203159 585467398 594376624 599607289 604233682 610323429 615976155 620037496
1641.9 620037496 622376204 623750329 626774430 630226374 631812036 635382831 641773760 646535575
$$ packed form
1527.7B64411956m746497l681779j648604J707911M615307J0526538J8019348K1298558
1544C10502738K3417353K4002374K4824977K4099707K1405876J7540514J7863900K1122277
1560.3D84779716J4678329R628922O939709L497958K38716k859652q337140j5008360
1576.7D93558198j6876370k1221458l1446338l7473053l1293899j4968306q45968O48051
1593C40080857m479885j421690J2485922K5576293K9319018K5563032J9772499J4163316
1609.3D61059362Q776128M724294L956854Q090765J2490630J5574783K0024657K0522177
1625.6E55219650J6983509J3264239Q909226N230665M626393O089747N652726M061341
1641.9F20037496K338708J374125L024101L451944J585662L570795O390929M761815
$$ plain form
1658.2 646535575 648918629 650260985 652066469 653293490 652622402 651955187 652285755 651747108 650652885
1676.6 650652885 649392128 646544933 641283095 635697722 633139610 630730748 626589537 621027887
1692.9 621027887 612144232 601230979 589777052 576278508 564369678 551308334 535222590
1707.2 535222590 518873215 501127124 480207890 453800231 419028819 383371562 352997333
1721.5 352997333 323665679 297565520 279924393 271857798 274449587 292272359 323906213 359834731
1737.8 359834731 404407054 454855591 502692223 546074092 583825827 617168546 645476043
1752.1 645476043 666133940 681203783 693312943 702587485 710454762 717256486 721924067 724674165
1768.4 724674165 726275444 727480412 729126036 730418921 730658293 730936229 732217371 733931124 734060287
$$ packed form
1658.2F46535575K383054J342356J805484J227021o71088o67215L30568n38647j094223
1676.6F50652885j260757k847195n261838n585373k558112k408862m141211n561650
1692.9F21027887q883655j0913253j1453927j3498544j1908830j3061344j6085744
1707.2E35222590j6349375j7746091k0919234k6407659l4771412l5657257l0374229
1721.5C52997333k9331654k6100159j7641127q066595K591789J7822772L1633854L5928518
1737.8C59834731M4572323N0448537M7836632M3381869L7751735L3342719K8307497
1752.1F45476043K0657897J5069843J2109160R274542P867277O801724M667581K750098
1768.4G24674165J601279J204968J645624J292885K39372K77936J281142J713753J29163
$$ plain form
1786.7 734060287 729585826 718983829 707656860 702480078 701174259 702139676 708099127 718441308
1803.1 718441308 728462279 735706508 740566969 744425416 748031616 751114905 753602982 755887032
1819.4 755887032 757740736 758852959 759946406 761223078 762429059 764291406 766397178 767697334
1835.7 767697334 768584132 769278228 769040585 768195033 768626213 770058870 771007836 771290183 771061242
1854.1 771061242 770504117 769699812 768686295 767422497 765812218 763665676 761692524 761593759 762889206
1872.4 762889206 763996720 764814496 765781283 766790986 767621160 768180430 768326938 768046916 768043578 768402517
1892.8 768402517 768574119 768878818 769392908 769772291 770016193 770231128 770262480 770160556 770265996 770469129
1913.2 770469129 770181656 769404471 769047618 769130707 769303143 769738734 770066798 769909680 769366562 768524408
$$ packed form
1786.7G34060287m474461j0601997j1326969n176782j305819R65417N959451J0342181
1803.1G18441308J0020971P244229M860461L858447L606200L083289K488077K284050
1819.4G55887032J853704J112223J093447J276672J205981J862347K105772J300156
1835.7G67697334Q86798O94096k37643q45552M31180J432657R48966K82347k28941
1854.1G71061242n57125q04305j013517j263798j610279k146542j973152r8765J295447
1872.4G62889206J107514Q17776R66787J009703Q30174N59270J46508k80022l338L58939
1892.8G68402517J71602L04699N14090L79383K43902K14935L1352j01924J05440K03133
1913.2G70469129k87473p77185l56853Q3089J72436M35591L28064j57118n43118q42154
$$ plain form
1933.6 768524408 767427742 766178489 764761627 763352036 762768686 763197720 763902962 764625549 765426517
1952 765426517 766205907 766809702 767168164 767396212 767663658 767841280 767847657 768133163 768833220 769523025
1972.4 769523025 770046294 770522714 770957410 771279812 771455348 771466911 771298230 770950973 770499110 770281672
1992.8 770281672 770420492 770516396 770447433 770336628 770227790 770192802 770259142 770406425 770626068 770878136
2013.2 770878136 771052420 771267891 771722198 772233307 772602141 772881329 773152709 773498416 773937821 774392962
2033.5 774392962 774823844 775211930 775521517 775837779 776251972 776665747 776999116 777256131 777450740 777599514
2053.9 777599514 777733624 777914941 778120518 778262854 778377652 778572619 778810799 779011309 779229283 779539526
2074.3 779539526 779901624 780206859 780426979 780639350 780831099 780909359 780919015 780931830 780878544 780727923
$$ packed form
1933.6G68524408j096666j249253j416862j409591n83350M29034P05242P22587Q00968
1952G65426517P79390O03795L58462K28048K67446J77622O377K85506P00057O89805
1972.4G69523025N23269M76420M34696L22402J75536J1563j68681l47257m51863k17438
1992.8G70281672J38820R5904o8963j10805j08838l4988O6340J47283K19643K52068
2013.2G70878136J74284K15471M54307N11109L68834K79188K71380L45707M39405M55141
2033.5G74392962M30882L88086L09587L16262M14193M13775L33369K57015J94609J48774
2053.9G77599514J34110J81317K05577J42336J14798J94967K38180K00510K17974L10243
2074.3G79539526L62098L05235K20120K12371J91749P8260R656J2815n3286j50621
$$ plain form
2094.7 780727923 780593514 780546010 780489981 780351281 780156910 779918730 779646218 779315948 778890491 778400421
2115.1 778400421 777903080 777398884 776832342 776170135 775413752 774595201 773766637 772939563 772078037 771118581
2135.5 771118581 770045459 768972099 767959595 766973436 766031206 765162468 764330268 763486922 762700140
2153.9 762700140 762027204 761345208 760512233 759520888 758394718 757225513 756067097 754768848 753266394
2172.2 753266394 751697659 750174105 748667240 747079730 745394826 743684590 741945565 740124881
2188.6 740124881 738181412 736154318 734097719 731913626 729596317 727210283 724679649 721937001
2204.9 721937001 718981862 715825140 712516844 709048808 705445886 701827228 698095500 694044828
2221.2 694044828 689644158 684822679 679291308 672762692 664938807 655451715 644022644 630437732
$$ packed form
2094.7G80727923j34409m7504n6029j38700j94371k38180k72512l30270m25457m90070
2115.1G78400421m97341n04196n66542o62207p56383q18551q28564q27074q61526r59456
2135.5G71118581j073122j073360j012504r86159r42230q68738q32200q43346p86782
2153.9G62700140o72936o81996q32975r91345j126170j169205j158416j298249j502454
2172.2G53266394j568735j523554j506865j587510j684904j710236j739025j820684
2188.6G40124881j943469k027094k056599k184093k317309k386034k530634k742648
2204.9G21937001k955139l156722l308296l468036l602922l618658l731728m050672
2221.2F94044828m400670m821479n531371o528616p823885r487092j1429071j3584912
$$ plain form
2237.5 630437732 614460766 595774829 574077129 549280524 521577716 491484195 460051477
2251.8 460051477 428768009 399112582 372278363 349010110 329511255 313512832 300513625
2266.1 300513625 290059090 282107979 277159333 276046544 279641300 288617611 303227812 323186219
2282.4 323186219 347744644 375812829 406028330 436911553 467204303 495953172 522502244
2296.7 522502244 546494484 567894578 586833715 603400588 617774308 630249202 641097844
2310.9 641097844 650581717 658905804 666269720 672893226 678714395 683617294 687869132 691810906
2327.2 691810906 695347071 698267102 700861037 703464925 706137180 708695948 710714579 712029696
2343.6 712029696 712991416 714339852 716460824 719063878 721668065 724094629 726269782 728128254
$$ packed form
2237.5F30437732j5976966j8685937k1697700k4796605k7702808l0093521l1432718
2251.8D60051477l1283468k9655427k6834219k3268253j9498855j5998423j2999207
2266.1C00513625j0454535p951111m948646j112789L594756Q976311J4610201J9958407
2282.4C23186219K4558425K8068185L0215501L0883223L0292750K8748869K6549072
2296.7E22502244K3992240K1400094J8939137J6566873J4373720J2474894J0848642
2310.9F41097844R483873Q324087P363916O623506N821169M902899M251838L941774
2327.2F91810906L536165K920031K593935K603888K672255K558768K018631J315117
2343.6G12029696R61720J348436K120972K603054K604187K426564K175153J858472
$$ plain form
2359.9 728128254 729871690 731553435 732886136 733712018 734274983 734891474 735700428 736670136 737765133
2378.2 737765133 738993406 740319490 741687000 743004322 744180799 745230138 746238530 747238159
2394.5 747238159 748217404 749183178 750131786 751042128 751872599 752578497 753150582 753607631 753968894 754266202
2414.9 754266202 754484236 754625678 754777730 754898846 754931927 754895091 754757047 754585564 754421949 754181921
2435.3 754181921 753911555 753663719 753357351 752962887 752550423 752164841 751801491 751487494 751195133 750832856
2455.7 750832856 750392318 749925494 749448180 748900533 748247862 747509956 746652901 745680511 744597971
2474.1 744597971 743368149 742100477 740894139 739699244 738448918 737070143 735448956 733427525
2490.4 733427525 730879605 727882981 724665642 721355796 718018055 714790344 711907506 709585249
$$ packed form
2359.9G28128254J743436J681745J332701Q25882N62965O16491Q08954R69708J094997
2378.2G37765133J228273J326084J367510J317322J176477J049339J008392R99629
2394.5G47238159R79245R65774R48608R10342Q30471P05898N72085M57049L61263K97308
2414.9G54266202K18034J41442J52052J21116L3081l6836j38044j71483j63615k40028
2435.3G54181921k70366k47836l06368l94464m12464l85582l63350l13997k92361l62277
2455.7G50832856m40538m66824m77314n47647o52671p37906q57055r72390j082540
2474.1G44597971j229822j267672j206338j194895j250326j378775j621187k021431
2490.4G33427525k547920k996624l217339l309846l337741l227711k882838k322257
$$ plain form
2506.7 709585249 707984507 707323849 707578540 708367884 709402740 710610867 712098479 714012504 716265678
2525.1 716265678 718730569 721330047 723882079 726228654 728318453 730014324 731007934 731198430 730946898
2543.4 730946898 730651498 730366051 730008483 729609907 729233682 728820145 728319705 727766335 727117360 726327538
2563.8 726327538 725413263 724347830 723104358 721751928 720372081 718999505 717663229 716444075
2580.1 716444075 715452671 714746177 714239955 713802218 713460982 713220179 713055909 713032424 713123858 713262916
2600.5 713262916 713417828 713564694 713718414 713921845 714170277 714349926 714331686 714131773 713751376 713053167
2620.9 713053167 712062418 711007416 709984720 708974183 707993090 707038403 706159115 705425739 704846263
2639.3 704846263 704394817 703974605 703543723 703145146 702746749 702244401 701607883 700771332 699620068
$$ packed form
2506.7G09585249j600742o60658K54691P89344J034856J208127J487612J914025K253174
2525.1G16265678K464891K599478K552032K346575K089799J695871R93610J90496k51532
2543.4G30946898k95400k85447l57568l98576l76225m13537n00440n53370o48975p89822
2563.8G26327538r14275j065433j243472j352430j379847j372576j336276j219154
2580.1G16444075r91404p06494n06222m37737l41236k40803j64270k3485R1434J39058
2600.5G13262916J54912J46866J53720K03431K48432J79649j8240j99913l80397o98209
2620.9G13053167r90749j055002j022696j010537r81093r54687q79288p33376n79476
2639.3G04846263m51446m20212m30882l98577l98397n02348o36518q36551j151264
$$ plain form
2657.7 699620068 698266208 696908116 695564449 694186628 692837059 691590130 690476418 689539671
2674 689539671 688733697 688050210 687683463 687676787 687712491 687553108 687187374 686601639 685810566 684873104
2694.4 684873104 683843136 682795644 681785643 680821240 679835916 678597927 676963985 675088644 673033834
2712.7 673033834 670634985 667869389 664758742 661290526 657620549 653992236 650821805 648275733
2729 648275733 646031797 643989861 642187774 640617311 639287353 637958348 636380851 634404302 632126033
2747.4 632126033 629950523 627940059 625718892 623057783 620153427 617194891 614138067 610971808
2763.7 610971808 607747018 604496300 601146936 597536266 593760610 590215445 586835146 583177984
2780 583177984 579224646 575178742 571023583 566843629 563066721 559822917 556757152 553641319 550649643
$$ packed form
2657.7F99620068j353860j358092j343667j377821j349569j246929j113712r36747
2674F89539671q05974o83487l66747o676L5704j59383l65734n85735p91073r37462
2694.4F84873104j029968j047492j010001r64403r85324j237989j633942j875341k054810
2712.7F73033834k398849k765596l110647l468216l669977l628313l170431k546072
2729F48275733k243936k041936j802087j570463j329958j329005j577497j976549k278269
2747.4F32126033k175510k010464k221167k661109k904356k958536l056824l166259
2763.7F10971808l224790l250718l349364l610670l775656l545165l380299l657162
2780E83177984l953338m045904m155159m179954l776908l243804l065765l115833k991676
$$ plain form
2798.4 550649643 547900438 544994593 541485250 537124038 531627953 525068879 517912865 510616302
2814.7 510616302 503558874 496692419 489343643 480588555 469612271 455785006 438572854 417524993
2831 417524993 392493546 363833457 332232237 298642546 264195234 230173931 198220745 170005873
2847.3 170005873 146644965 128701553 116312630 109020747 105880864 105683558 107068747 108827680
2863.6 108827680 110133678 110739939 111247934 112718426 115882561 120707177 126295462 131358534 134993315
2882 134993315 136822805 136807755 135179669 132353753 128778964 124758460 120571539 116528146 112742111
2900.4 112742111 109209016 105950795 102899835 99892385 96734472 93266137 89413598 85172661
2916.7 85172661 80703400 76356508 72592571 69838658 68423159 68515383 70155323 73567390 79028897
$$ packed form
2798.4E50649643k749205k905845l509343m361212n496085o559074p156014p296563
2814.7E10616302p057428o866455p348776q755088j0976284j3827265j7212152k1047861
2831D17524993k5031447k8660089l1601220l3589691l4447312l4021303l1953186k8214872
2847.3A70005873k3360908j7943412j2388923p291883l139883j97306J385189J758933
2863.6A08827680J305998O06261N07995J470492L164135M824616N588285N063072L634781
2882A34993315J829490j5050j628086k825916l574789m020504m186921m043393l786035
2900.4A12742111l533095l258221l050960l007450l157913l468335l852539m240937
2916.7H5172661m469261m346892l763937k753913j415499R2224J639940L412067N461507
$$ plain form
2935 79028897 86523853 95737912 106047668 116338931 125222519 131659567 135263801 136343196
2951.3 136343196 135814711 134550050 132750794 130074918 126074657 120797023 115344748 111577392
2967.7 111577392 111087829 114501648 121523850 131556064 144196332 159345105 177278101 198389739
2984 198389739 222891316 250829637 281887442 315245092 349753797 383805335 415850222 444908738
3000.3 444908738 470188856 491479635 508979261 522592485 532502711 539703071 545544207 550983608
3016.6 550983608 556209326 560857534 564378738 566706240 568576336 570633769 572967887 575244367
3032.9 575244367 576977968 577579379 576640010 575462282 576237857 579436421 583506107 586429656 587504208
3051.3 587504208 586925566 584783435 581921756 579568088 578211963 577783644 578047097 579077363 580978632
$$ packed form
2935G9028897P494956R214059J0309756J0291263Q883588O437048L604234J079395
2951.3A36343196n28485j264661j799256k675876m000261n277634n452275l767356
2967.7A11577392m89563L413819P022202J0032214J2640268J5148773J7932996K1111638
2984A98389739K4501577K7938321L1057805L3357650L4508705L4051538L2044887K9058516
3000.3D44908738K5280118K1290779J7499626J3613224R910226P200360N841136N439401
3016.6E50983608N225718M648208L521204K327502J870096K057433K334118K276480
3032.9E75244367J733601O01411r39369j177728P75575L198564M069686K923549J074552
3051.3E87504208n78642k142131k861679k353668j356125m28319K63453J030266J901269
$$ plain form
3069.6 580978632 583330631 585680306 587955892 590740085 594941437 600360990 605721712 610135615
3086 610135615 613144398 614684701 615447283 615964174 616441846 617146552 618314147 620041490 621771693
3104.3 621771693 622823417 623512745 624490678 625360131 625462770 625247955 625380158 626019001 627061367
3122.7 627061367 628104329 628875434 629652739 630832374 632321477 633705914 634744287 635707736 637035131
3141 637035131 638502002 639607906 640223265 640312076 640052557 640122294 640715241 641138911 641061902 640793562
3161.4 640793562 640499651 640058637 639435947 638655603 637641907 636383832 634972155 633503616 632040203
3179.8 632040203 630559862 629091203 627886713 627126217 626822233 626946747 627408385 628031671 628626287
3198.1 628626287 629136741 629570961 629920661 630101323 630119979 630094647 629915476 629475772 628893852 628251314
$$ packed form
3069.6E80978632K351999K349675K275586K784193M201352N419553N360722M413903
3086F10135615L008783J540303P62582N16891M77672P04706J167595J727343J730203
3104.3F21771693J051724O89328R77933Q69453J02639k14815J32203O38843J042366
3122.7F27061367J042962P71105P77305J179635J489103J384437J038373R63449J327395
3141F37035131J466871J105904O15359Q8811k59519O9737N92947M23670p7009k68340
3161.4F40793562k93911m41014o22690p80344j013696j258075j411677j468539j463413
3179.8F32040203j480341j468659j204490p60496l03984J24514M61638O23286N94616
3198.1F28626287N10454M34220L49700J80662J8656k5332j79171m39704n81920o42538
$$ plain form
3218.5 628251314 627573550 626817584 625859261 624694586 623335123 621662378 619867861 618459046 617305756
3236.9 617305756 615919352 614246488 612214983 609762311 607315540 605291128 603425860 601306200
3253.2 601306200 599011540 596829653 594780743 592694342 590600610 588549316 586388409 584095418
3269.5 584095418 581995070 580202758 578483105 576757610 574955702 573005974 571058273 569282949
3285.8 569282949 567667365 566086650 564634204 563560724 562898576 562542260 562303424 561988711 561727643
3304.2 561727643 561809659 562381327 563358724 564527929 565734386 566914797 568047583 569073677 569901109
3322.5 569901109 570635200 571610034 572811306 573864162 574717343 575687826 576929569 578248203 579520345
3340.9 579520345 580880642 582391322 583831906 585001230 586088061 587359548 588720620 589895785
$$ packed form
3218.5F28251314o77764p55966r58323j164675j359463j672745j794517j408815j153290
3236.9F17305756j386404j672864k031505k452672k446771k024412j865268k119660
3253.2F01306200k294660k181887k048910k086401k093732k051294k160907k292991
3269.5E84095418k100348j792312j719653j725495j801908j949728j947701j775324
3285.8E69282949j615584j580715j452446j073480o62148l56316k38836l14713k61068
3304.2E61727643Q2016N71668R77397J169205J206457J180411J132786J026094Q27432
3322.5E69901109P34091R74834J201272J052856Q53181R70483J241743J318634J272142
3340.9E79520345J360297J510680J440584J169324J086831J271487J361072J175165
$$ plain form
3357.2 589895785 590841472 591798961 592811465 593644381 594339550 595304906 596751511 598398030 599949658
3375.6 599949658 601430178 602918088 604407370 606002033 607716322 609248757 610482216 611826181
3391.9 611826181 613604486 615410268 616747081 617913961 619499564 621284485 622553170 623292208
3408.2 623292208 624007463 624900818 625920713 626803875 627290666 627686501 628263831 628832877 629040718
3426.6 629040718 628791153 628523111 628255785 627727747 627513766 628052533 628704369 628836274 628501832 628235221
3447 628235221 628573239 629263163 629797578 630181491 630396664 630365372 630475283 630650878 630139589 629227817
3467.4 629227817 629179955 630120575 630792260 630488753 629392505 628125846 627503872 627207458 626439631
3485.7 626439631 625499487 624840200 624244332 623345256 622153223 621094286 620204628 619216204 618569791
$$ packed form
3357.2E89895785R45687R57489J012504Q32916O95169R65356J446605J646519J551628
3375.6E99949658J480520J487910J489282J594663J714289J532435J233459J343965
3391.9F11826181J778305J805782J336813J166880J585603J784921J268685P39038
3408.2F23292208P15255Q93355J019895Q83162M86791L95835N77330N69046K07841
3426.6F29040718k49565k68042k67326n28038k13981N38767O51836J31905l34442k66611
3447F28235221L38018O89924N34415L83913K15173l1292J09911J75595n11289r11772
3467.4F29227817m7862R40620O71685l03507j096248j266659o21974k96414p67827
3485.7F26439631r40144o59287n95868q99076j192033j058937q89658r88424o46413
$$ plain form
3504.1 618569791 618421078 618037403 617371738 617007673 616972208 616977334 616917014 616657972 616128325 615754545
3524.5 615754545 615791678 616095543 616734982 617411554 617679000 617858469 618312836 618652523 618465722 618009925
3544.9 618009925 618028939 618678987 619205296 619487941 619850099 619950175 619610786 619226217 618727803 617461979
3565.3 617461979 616386950 617170274 618546307 619066656 619036317 618935108 618890107 618870735 618508995 617474318
3585.6 617474318 616782248 617730439 618992686 619348526 619503140 619894147 620187700 620572805 621072054
3604 621072054 620914638 620183527 619942307 620024085 620126903 620236874 619839668 619995296 621283948 622030854
3624.4 622030854 620764077 617808163 616631985 617117703 616272271 613765776 610223830 606675863 604897857
3642.8 604897857 605706215 608615279 613173544 619014204 624171197 626674354 627395809 628442824 629573524
$$ packed form
3504.1F18569791j48713l83675o65665l64065l5465N126o0320k59042n29647l73780
3524.5F15754545L7133L03865O39439O76572K67446J79469M54367L39687j86801m55797
3544.9F18009925J9014O50048N26309K82645L62158J00076l39389l84569m98414j265824
3565.3F17461979j075029P83324J376033N20349l0339j01209m5001j9372l61740j034677
3585.6F17474318o92070R48191J262247L55840J54614L91007K93553L85105M99249
3604F21072054j57416p31111k41220Q1778J02818J09971l97206J55628J288652P46906
3624.4F22030854j266777k955914j176178M85718q45432k506495l541946l547967j778006
3642.8F04897857Q08358K909064M558265N840660N156993K503157P21455J047015J130700
$$ plain form
3661.1 629573524 630414546 631123245 630843997 629315794 628796279 629049540 628391206 629421771 632179022
3679.5 632179022 634365380 635728002 636190295 635506034 635065317 636697054 639272869 641207516 642140448
3697.8 642140448 642116606 641712427 641960144 642389953 641875982 640406251 639434576 640432537 641970575
3716.2 641970575 642385483 641726375 640815198 640244782 640310407 641027510 640994132 638946295 636361063 635933459
3736.6 635933459 637431979 638514459 637394369 635073364 634875119 635091424 634141028 634578168 636188567
3754.9 636188567 636778414 636310756 636395395 636803806 636341453 635595977 635138571 635204196 635717988 635821342
3775.3 635821342 635180712 634375691 634301901 634456158 634262204 634226441 634247959 633982539 633266985 632069647
3795.7 632069647 631268501 630511940 629419267 629683912 630173206 630196393 630982816 631643236 630799055 628987074
$$ packed form
3661.1F29573524Q41022P08699k79248j528203n19515K53261o58334J030565K757251
3679.5F32179022K186358J362622M62293o84261m40717J631737K575815J934647R32932
3697.8F42140448k3842m04179K47717M29809n13971j469731r71675R97961J538038
3716.2F41970575M14908o59108r11177n70416O5625P17103l3378k047837k585232m27604
3736.6F35933459J498520J082480j120090k321005j98245K16305r50396M37140J610399
3754.9F36188567N89847m67658Q4639M08411m62353p45476m57406O5625N13792J03354
3775.3F35821342o40630q05021p3790J54257j93954l5763K1518k65420p15554j197338
3795.7F32069647q01146p56561j092673K64645M89294K3187P86423O60420q44181j811981
$$ plain form
3816.1 628987074 628041208 627179921 626859426 628086329 628959239 629123390 628772914 627954841 627203107
3834.5 627203107 625928044 624427915 624419153 625392139 626330614 627139032 627397835 626100481 622674048
3852.8 622674048 621094882 623141766 624941945 624908090 623652756 622785389 622718990 622109830 621623397
3871.2 621623397 622186661 623068273 623617470 622846603 621923149 621848285 621487439 621669590 621972919 621312082
3891.6 621312082 621241808 621748328 621032238 619202912 617802322 617537737 618512571 619987547 620791852
3909.9 620791852 620818377 620251715 619036913 617939770 617638946 617501080 617000341 616685033 616580844
3928.3 616580844 615928352 615079403 614995241 615318418 615171671 614323795 613184452 612452507 611918628 611222684
3948.7 611222684 610855877 610776842 610431492 609835505 609310091 608846664 608373523 607952595 607421994 606652021
$$ packed form
3816.1F28987074r45866q61287l20495J226903Q72910J64151l50476q18073p51734
3834.5F27203107j275063j500129q762R72986R38475Q08418K58803j297354l426433
3852.8F22674048j579166K046884J800179l3855j255334q67367o6399o09160m86433
3871.2F21623397N63264Q81612N49197p70867r23454p4864l60846J82151L03329o60837
3891.6F21312082p0274N06520p16090j829326j400590k64585R74834J474976Q04305
3909.9F20791852K6525n66662j214802j097143l00824j37866n00739l15308j04189
3928.3F16580844o52492q48949q4162L23177j46747q47876j139343p31945n33879o95944
3948.7F11222684l66807p9035l45350n95987n25414m63427m73141m20928n30601p69973
$$ plain form
3969.1 606652021 605872512 605291486 604847431 604416907 603880763 603258073 602763534 602360427 601830304 601217628
3989.5 601217628 600640118 600100040 599638939 599343538
3997.6 599343538
$$ packed form
3969.1F06652021p79509n81026m44055m30524n36144o22690m94539m03107n30123o12676
3989.5F01217628n77510n40078m61101k95401
3997.6E99343538
##END=$$ End of the data block
