##TITLE=Silicone 11 $$ Begin of the data block
##JCAMP-DX=5.00 $$ ACD/SpecManager v 10.08
##SPECTROMETER/DATA SYSTEM=Alpha
##DATE=14 Dec 2016 11:33:10
##DATA TYPE=INFRARED SPECTRUM
##DATA CLASS=XYDATA
##ORIGIN=
##OWNER=
##NPOINTS=1667
##FIRSTX=599.65820312
##LASTX=3997.72216797
##MAXX=3997.72216797
##MINX=599.65820312
##MAXY=1.00735223
##MINY=0.10390396
##XFACTOR=1.0000000000
##YFACTOR=0.000000010000000
##FIRSTY=0.71070886
##DELTAX=2.03965425
##XUNITS=1/CM
##YUNITS=ARBITRARY UNITS
##XYDATA=(X++(Y..Y))
599.7 71070886 71004272 70968717 70942676 70885581 70791900 70705080 70646179 70598787 70541179 70454282 70351839 70282745
624.1 70282745 70259321 70243675 70210856 70176512 70155954 70146990 70149046 70171326 70216548 70247519 70239246 70209318
648.6 70209318 70199007 70231992 70275730 70289671 70292610 70327228 70405960 70517987 70521826 70373493 70407629 70557630
673.1 70557630 70662373 70716918 70742077 70752519 70757180 70754653 70725954 70629913 70361203 69682044 68217432
695.5 68217432 65816730 63173449 61610216 61968410 63973725 66624492 68994272 70678824 71707374
713.9 71707374 72278905 72581965 72744703 72839773 72878522 72831285 72673666 72385293 71944469 71385723
734.3 71385723 70868391 70606345 70646489 70829779 70953923 70892119 70620775 70181942 69650614 69107902
754.7 69107902 68634921 68301374 68161786 68304765 68803108 69620115 70641667 71735501 72787011
773 72787011 73744583 74611652 75383520 76049393 76614040 77088171 77488512 77838814 78145033 78380191
793.4 78380191 78516120 78543520 78481960 78381753 78298706 78293329 78414243 78653067 78953022 79250407 79489350
815.9 79489350 79675758 79870969 80076051 80255002 80395019 80454910 80357915 80030334 79441249 78675300
836.3 78675300 77932978 77421612 77288270 77585804 78230810 79052007 79902905 80702746 81425190 82081652
856.7 82081652 82683134 83221281 83701181 84151131 84575844 84955478 85276288 85547006 85792083 86011845
877.1 86011845 86206836 86406684 86619103 86829937 87030017 87204391 87343270 87440079 87481588 87461263
897.5 87461263 87402689 87348282 87311131 87276208 87255520 87279171 87349617 87452859 87537450 87532276 87426388 87229609
921.9 87229609 86919558 86482191 85913420 85214967 84426260 83601582 82798290 82105649 81633651 81448334
942.3 81448334 81522316 81751668 82012546 82217681 82316405 82268584 82054454 81717998 81401998 81291527
962.7 81291527 81492317 81960452 82526183 82981664 83181697 83084822 82726127 82190531 81578964 80966473
983.1 80966473 80391407 79890895 79558420 79519510 79839253 80480325 81335026 82268578 83146948 83873820
1003.5 83873820 84388304 84640509 84610367 84328216 83866018 83316821 82777345 82331979 82019067 81800371
1023.9 81800371 81604463 81418538 81321996 81406224 81653345 81943852 82187915 82371253 82496327 82563424
1044.3 82563424 82554656 82404691 82006788 81234014 80027062 78489041 76861274 75422883 74379629
1062.7 74379629 73799556 73646408 73844934 74313670 74953943 75650436 76312912 76858741 77206248 77329928
1083.1 77329928 77281272 77150309 77003455 76852357 76653636 76350921 75909173 75294882 74467158 73389494
1103.5 73389494 72050482 70482695 68734598 66836184 64834881 62887561 61270046 60169518
1119.8 60169518 59497565 58982795 58362705 57477468 56295741 54922712 53556597 52353334 51300877
1138.1 51300877 50235021 48983756 47523260 45987430 44505617 43020329 41325733 39324948
1154.4 39324948 37162399 35122398 33476639 32362646 31751803 31543267 31642401 32003233 32658020
1172.8 32658020 33668706 35052174 36747617 38618639 40486029 42190725 43648100 44876039
1189.1 44876039 45977026 47067666 48206353 49379179 50533146 51600409 52518463 53247333 53770906
1207.5 53770906 54097784 54255688 54271561 54163045 53948605 53649747 53283721 52868247 52429616 51989716
1227.9 51989716 51556224 51143205 50784892 50521034 50401914 50492138 50824958 51367033 52024806 52686107
1248.3 52686107 53276289 53774834 54194272 54572457 54964763 55424178 55961972 56518292 57038319 57565498
1268.7 57565498 58236617 59194213 60477650 62000757 63617390 65178478 66576403 67767519 68761861
1287 68761861 69583410 70240355 70742667 71110725 71385026 71638513 71950215 72357297 72858310 73465729
1307.4 73465729 74183816 74963659 75743526 76446491 76981896 77330184 77530295 77634698 77725315 77860719
1327.8 77860719 78027642 78178734 78260744 78231150 78156137 78252167 78588057 78961134 79226756 79371405
1348.2 79371405 79400450 79316491 79156357 78996617 78818887 78535986 78265744 78193432 78119218 77827871
1368.6 77827871 77348429 76653343 75800151 74935764 74023753 73107255 72336435 71782428 71628243 72047108
1389 72047108 72649229 73004836 73245347 73722506 74601638 75853145 77266550 78842080 80484140
1407.4 80484140 81899333 83004832 83779085 84081787 83878553 83469737 82913494 81700140 79646194
1425.7 79646194 76810020 73266590 69940096 67608321 66147453 65552217 65218717 64243883 62558013
1444.1 62558013 60573757 58744252 57515931 56862122 56658381 57132792 58616984 60219401 61125314
1462.4 61125314 61379206 61643112 62328458 63341784 65014261 67538959 70493442 73501664 76342273
1480.8 76342273 78873867 80844343 82164776 82969129 83411711 83586895 83950526 85287511 87315112
1499.2 87315112 88846737 89388704 88955033 88546830 89202195 89910460 90101290 89854676 89522249 89229918
1519.6 89229918 88980293 89030135 89162838 89250094 89239991 88851309 88342780 88057613 87372816 86118132
1539.9 86118132 85581458 85793889 86014020 85945445 85618025 85247272 84780765 84031647 83139974 83420551
1560.3 83420551 84395134 84933531 85116094 85180247 85473961 85929906 86083269 86218804 86723810 87140387
1580.7 87140387 87321621 87512153 87758446 87905473 87885809 87724501 87446570 87043917 86484700 85880935
1601.1 85880935 85523176 85467279 85449058 85305667 85055095 84613055 83818388 83038378 82702178 82265085
1621.5 82265085 81586802 81113338 80792773 80528712 80251628 79612291 78806567 78755158 79111785 79242170
1641.9 79242170 79006344 78483385 78364265 78590399 78315991 78267610 79172099 79884070 80070740 80043197
1662.3 80043197 80201215 80342770 80128205 79964179 80086058 80085766 80020177 79929739 79464453 78449792
1682.7 78449792 77420533 77144742 76982427 76557195 75898921 74659586 73064238 71298862 69143546
1701.1 69143546 67206389 64906460 61931580 58820683 55370766 51277572 46147805 39493826
1717.4 39493826 32870904 27504292 22488855 17967419 14589466 12265406 10889360 10390396 11047641
1735.8 11047641 12895015 16448091 22162251 29823512 39032876 49023616 59198409 68230927
1752.1 68230927 74722093 79303277 82765555 85211921 87158179 88743222 89802140 90454501 90911806
1770.4 90911806 91479754 92308629 93052989 93511260 93839246 94173175 94528580 94849056 94967270 94852847
1790.8 94852847 94953042 95384216 95706749 95806485 95928329 96241963 96565765 96741468 96809071 96945566
1811.2 96945566 97199845 97431731 97588921 97735178 97814178 97760725 97720671 97732389 97798520 98082155 98411942
1833.7 98411942 98562700 98650849 98701233 98557353 98363006 98495197 98817092 99049401 99176329 99236166
1854.1 99236166 99271435 99288321 99301612 99309105 99235857 98998713 98789293 98934472 99242377 99406135 99446422
1876.5 99446422 99463755 99476844 99485731 99484217 99426401 99329531 99350595 99450076 99489868 99537110 99609172 99651313
1901 99651313 99666589 99661046 99617350 99583244 99627858 99687940 99635953 99518842 99501920 99535620 99572361 99660522
1925.4 99660522 99725175 99722302 99692625 99655789 99615687 99558538 99429625 99257714 99205261 99276817 99326903
1947.9 99326903 99324208 99302995 99278629 99260920 99253720 99251187 99245632 99206907 99149841 99165171 99239022 99279159
1972.4 99279159 99281245 99281251 99284887 99287206 99287891 99279994 99251485 99196506 99130762 99125379 99191397 99238598 99246997 99243200
2000.9 99243200 99229115 99210960 99194640 99183989 99177051 99157065 99108559 99069041 99084002 99117374 99128896 99126124
2025.4 99126124 99110961 99090511 99079216 99068385 99052805 99034566 99007833 98987871 98990190 98998308 98999369 98996609
2049.9 98996609 98990273 98980922 98970699 98958141 98945719 98930448 98910624 98901188 98901755 98893040 98876309 98862529 98847920
2076.4 98847920 98829716 98812616 98798454 98783016 98762268 98743552 98740321 98741943 98732805 98722899 98718619 98713380 98709446
2102.9 98709446 98713332 98718029 98718792 98720586 98724002 98725075 98729694 98747605 98770791 98788583 98803765 98820806 98838019
2129.4 98838019 98855889 98878413 98901474 98913848 98920506 98935461 98959190 98986495 99009728 99026465 99040735 99052364
2153.9 99052364 99064910 99079508 99087602 99092299 99097604 99104756 99120790 99139559 99152321 99161601 99173403 99190265 99208009
2180.4 99208009 99223483 99242264 99264318 99280453 99292785 99316192 99349618 99374586 99394184 99419779 99443299 99461132
2204.9 99461132 99477130 99491435 99512881 99542886 99571514 99601018 99629915 99649596 99665308 99684691 99703211 99719876
2229.3 99719876 99739748 99762684 99783283 99799734 99816501 99831361 99841499 99852288 99864006 99872941 99884647 99900037
2253.8 99900037 99915802 99936444 99957085 99970323 99977231 99980003 99982089 99984378 99986291 99987233 99986976 99988019 99988019 99982572 99976081
2284.4 99976081 99969423 99957639 99947071 99941868 99936265 99930000 99924827 99919802 99915177 99910784 99902672 99886274 99874854
2310.9 99874854 99897230 99952739 100012672 100062585 100097775 100116658 100141132 100191247 100234210 100243151 100262403 100309658
2335.4 100309658 100348222 100365722 100367808 100347710 100285292 100231183 100267327 100384605 100520289 100635684 100708532
2357.8 100708532 100735223 100726449 100674975 100600266 100520492 100429606 100338328 100263941 100205362 100159454 100136006 100139034
2382.3 100139034 100156057 100172400 100176322 100162208 100142419 100129151 100126672 100134516 100143361 100153172 100166857 100177991
2406.8 100177991 100181603 100183237 100188458 100194812 100201190 100208819 100220668 100234497 100249791 100266409 100274873 100282347 100299680
2433.3 100299680 100315320 100324309 100331593 100334048 100334013 100342047 100357747 100367367 100367761 100371289 100382900 100393200 100396109 100398493
2461.9 100398493 100401580 100401103 100399017 100392008 100384235 100384951 100382006 100366271 100347710 100333107 100319207 100305140 100294733
2488.4 100294733 100283253 100262678 100239491 100222957 100206506 100181878 100155914 100143039 100137985 100119174 100088418 100060976
2512.8 100060976 100035858 100009072 99979484 99950916 99933445 99927878 99921894 99901956 99879706 99870348 99862522 99852234
2537.3 99852234 99845052 99834406 99817425 99802804 99791777 99777114 99757552 99733686 99707747 99687028 99670345 99647456
2561.8 99647456 99616671 99588460 99566215 99540287 99510664 99484283 99463087 99442393 99410206 99368840 99336016 99317080
2586.3 99317080 99302530 99284780 99264073 99246395 99234682 99224669 99216133 99211270 99203539 99191338 99188781 99198008 99202949
2612.8 99202949 99202484 99203587 99198258 99178094 99151176 99130571 99113053 99092633 99070382 99045080 99019361 98998445
2637.3 98998445 98986626 98977816 98960572 98940694 98922092 98898935 98870105 98833454 98786479 98733938 98684818 98645186
2661.7 98645186 98613298 98586386 98567736 98552704 98532403 98508626 98480856 98445755 98412246 98390120 98372984 98348033
2686.2 98348033 98312384 98267251 98217225 98176575 98147631 98118365 98080754 98039991 98005980 97969157 97919488 97863597
2710.7 97863597 97806954 97748679 97685677 97608685 97517329 97422683 97327036 97242618 97172409 97097242 97020155 96954620
2735.2 96954620 96904397 96875203 96866530 96858621 96829295 96789694 96769601 96768719 96760625 96733868 96697313 96651047 96595442
2761.7 96595442 96536267 96473575 96405733 96321738 96217167 96110189 96031761 95976895 95900989 95797259 95693195
2784.1 95693195 95580697 95443738 95320255 95229292 95125753 94984508 94838291 94714600 94588673 94435799
2804.5 94435799 94255447 94050390 93839717 93631154 93393779 93116796 92828184 92530465 92201799 91833508
2824.9 91833508 91410893 90910983 90314656 89603609 88763732 87799340 86770874 85762089 84823376
2843.3 84823376 84000850 83338195 82815182 82320517 81709415 80860108 79696423 78234953 76573730
2861.6 76573730 74827856 73081744 71342415 69587708 67999023 67088002 67340392 68713218 70612884
2880 70612884 72365391 73585165 74174517 74209934 73849440 73254853 72563678 71878457 71223348 70545292
2900.4 70545292 69781131 68894166 67872119 66726702 65506500 64288157 63123971 61994421 60827601
2918.7 60827601 59568954 58212566 56769311 55270934 53816909 52546388 51592016 51055342 50926149
2937.1 50926149 51001942 50951898 50482559 49467242 47991490 46279556 44545522 42914301 41532120
2955.4 41532120 40666655 40586960 41406396 43046081 45320961 48017362 50897342 53741211 56384528
2973.8 56384528 58723140 60746694 62498355 64012891 65343225 66559416 67716038 68837434
2990.1 68837434 69925046 70978177 71991599 72961485 73891717 74791485 75677377 76541013 77331072
3008.5 77331072 77996689 78518498 78886575 79082423 79096401 78934449 78634077 78305680 78107774 78155220
3028.8 78155220 78456801 78936285 79480016 79970920 80334806 80569732 80713421 80788511 80788660 80711466 80574775
3051.3 80574775 80384469 80138028 79856968 79587150 79385465 79287392 79286808 79348743 79414243 79426664 79367971
3073.7 79367971 79240924 79048067 78808689 78560835 78348225 78212625 78163588 78160405 78144711 78080714 77971917
3096.2 77971917 77826673 77643788 77447915 77258646 77073449 76903582 76753056 76601893 76431197 76244509
3116.6 76244509 76064438 75898403 75719744 75509298 75289452 75076258 74851203 74605995 74358684 74115783
3136.9 74115783 73870170 73617482 73353088 73080516 72803533 72521162 72241694 71969056 71689719 71396792
3157.3 71396792 71094978 70797199 70513707 70231110 69944358 69662350 69381881 69096160 68796253 68484259
3177.7 68484259 68189526 67915088 67631102 67345566 67078984 66813058 66534817 66258025 65984821 65718257
3198.1 65718257 65470636 65233129 64998978 64772373 64540690 64299333 64059037 63822877 63595533 63378537
3218.5 63378537 63174886 62985408 62788039 62580484 62393796 62237579 62091017 61927152 61743420 61562276
3238.9 61562276 61399275 61255586 61122900 60993665 60855633 60714644 60594535 60483629 60358495 60223716
3259.3 60223716 60099679 59991670 59888393 59794778 59715563 59626335 59513324 59395951 59288710 59191573
3279.7 59191573 59095693 58996117 58907038 58833039 58760816 58679533 58586538 58486199 58385146 58288872 58200562
3302.1 58200562 58122140 58039212 57931024 57806194 57683861 57572156 57472289 57373077 57266045 57160008
3322.5 57160008 57063770 56960469 56835848 56709099 56590885 56481445 56389499 56301540 56197870 56077141
3342.9 56077141 55938125 55803931 55704832 55609083 55479413 55337894 55220979 55127352 55026531 54915130
3363.3 54915130 54822195 54747170 54659045 54544127 54422659 54323846 54241019 54153538 54052031 53946012 53861791
3385.8 53861791 53811258 53779483 53729624 53659254 53605598 53578711 53554082 53512853 53466719 53432810 53406775 53374267
3410.2 53374267 53337944 53318542 53310102 53290176 53269529 53270209 53291178 53299129 53284538 53283006 53289133 53287065 53322375
3436.8 53322375 53423762 53548467 53659570 53744912 53819036 53960782 54171032 54364771 54528016 54666919
3457.2 54666919 54786032 54923320 55067033 55145741 55186993 55329955 55588257 55820870 55956298 56030566
3477.6 56030566 56097394 56218863 56381077 56510371 56611222 56733650 56874430 56985378 57062674 57155514
3497.9 57155514 57263571 57336020 57421005 57582569 57749116 57895792 58094299 58322060 58511585 58677393
3518.3 58677393 58843547 58992732 59129447 59282845 59473586 59732008 60031122 60301155 60534930 60787129
3538.7 60787129 61073875 61326540 61503613 61686885 61988032 62335432 62660092 63040024 63452232 63809222
3559.1 63809222 64129978 64423490 64573747 64717579 65239096 65971631 66551363 66984946 67399698 67831302
3579.5 67831302 68281126 68683881 68886858 68999028 69447398 70088941 70549530 70924020 71372104 71818078
3599.9 71818078 72267973 72741216 73075551 73252302 73507792 73885310 74316829 74765986 75104576 75546110
3620.3 75546110 76274699 76958144 77258211 77227157 77642316 78571385 79423946 80125064 80758089 81340474
3640.7 81340474 81887180 82277870 82361788 82441103 83229512 84471393 85454345 86217272 87097389 87969130
3661.1 87969130 88696682 89289021 89640468 89822835 90238774 90740842 91148722 91953486 93002290 93855745
3681.5 93855745 94439775 94711411 94693810 94833887 95517582 96333587 96918833 97270042 97439629 97586185
3701.9 97586185 97871464 98093295 98005611 97758043 97839487 98346651 98792970 98934329 98882741 98819399
3722.3 98819399 98843849 98989743 99142724 99020505 98554111 98168039 98347586 98833376 99042839 98803735
3742.7 98803735 98509234 98546666 98534930 98503023 98875535 99319100 99478960 99525857 99714667 99873161
3763.1 99873161 99831474 99745822 99759281 99948037 100197041 100254095 100105393 99995297 100084543 100200248 100264478
3785.5 100264478 100359583 100436759 100425541 100283504 100046778 99843895 99630255 99504280 99651933 99810237
3805.9 99810237 99987108 100261581 100337636 100061965 99674195 99443406 99302047 99446803 99808514 100004625
3826.3 100004625 100057626 100007725 99851131 99637395 99370891 99234951 99401629 99723899 100042319 100217557
3846.7 100217557 100088429 99572724 98978835 99133104 99748623 100078738 100015175 99783254 99680829 99662930
3867.1 99662930 99569976 99590284 99796462 100030124 100115478 99960202 99832875 99825722 99838334 99969280 100035107
3889.5 100035107 99999416 100118494 100204384 99975234 99589539 99374098 99466413 99834555 100237954 100457025
3909.9 100457025 100483632 100362945 100162911 100055909 100100327 100143588 100129116 100152910 100167429 100081193 100045180
3932.4 100045180 100184131 100338793 100356209 100252759 100145102 100124192 100127935 100131798 100203991 100301552 100350690
3954.8 100350690 100356662 100345170 100333464 100347650 100379241 100376689 100336564 100298417 100273681 100273514 100295842 100298715
3979.3 100298715 100275064 100259995 100265527 100254118 100217366 100195062 100187206 100182867 100195098
3997.6 100195098
##END=$$ End of the data block
