##TITLE=Silicone 10 $$ Begin of the data block
##JCAMP-DX=5.00 $$ ACD/SpecManager v 10.08
##DATE=14 Dec 2016 11:32:56
##DATA TYPE=INFRARED SPECTRUM
##DATA CLASS=XYDATA
##ORIGIN=Marcelo Quint
##OWNER=
##NPOINTS=1667
##FIRSTX=599.65820312
##LASTX=3997.72216797
##MAXX=3997.72216797
##MINX=599.65820312
##MAXY=0.62288862
##MINY=0.18775174
##XFACTOR=1.0000000000
##YFACTOR=1.000000000000000e-9
##FIRSTY=0.54273981
##DELTAX=2.03965425
##XUNITS=1/CM
##YUNITS=ARBITRARY UNITS
##XYDATA=(X++(Y..Y))
$$ plain form
599.7 542739809 541447043 540413380 539324284 538223147 537329257 536415100 535291076 534326732 533655226
618 533655226 532669783 531018674 529192984 527846396 526826322 525632322 524351537 523167551 522000432
636.4 522000432 520966589 520041525 518936276 517692804 516511381 515376627 514158249 512959003 511796355
654.7 511796355 510439575 509043455 507893085 506817102 505682826 504809678 503963709 502536774 501082659
673.1 501082659 499781281 498365194 496887565 495466292 493904352 492038012 489962876 487684727
689.4 487684727 485018134 481967390 478392363 473687112 467193842 457869619 443847865 422293931
705.7 422293931 389596641 349696726 324388295 337388784 385181367 441025615 482613862
720 482613862 504043937 511420965 512407839 511137784 509276569 507157922 504615664 502028346 500506520
$$ packed form
599.7E42739809j292766j033663j089096j101137q93890r14157j124024r64344o71506
618E33655226r85443j651109j825690j346588j020074j194000j280785j183986j167119
636.4E22000432j033843r25064j105249j243472j181423j134754j218378j199246j162648
654.7E11796355j356780j396120j150370j075983j134276q73148q45969j426935j454115
673.1E01082659j301378j416087j477629j421273j561940j866340k075136k278149
689.4D87684727k666593l050744l575027m705251o493270r324223j4021754k1553934
705.7D22293931l2697290l9899915k5308431J3000489M7792583N5844248M1588247
720D82613862K1430075P377028R86874j270055j861215k118647k542258k587318j521826
$$ plain form
738.4 500506520 500582278 501547217 502515256 503155231 503267944 502935290 502667069 502699435 502886176 503084481
758.8 503084481 503288627 503592432 503977239 504364967 504806101 505283058 505513370 505354166 505089283 504882157
779.1 504882157 504655659 504374325 504036129 503759027 503759205 503952563 503955424 503531754 502673030 501504958
799.5 501504958 500235856 499022692 497897208 497030109 496498317 496043831 495389640 494344354 492856950
817.9 492856950 490992635 488700300 485873997 482518286 478551358 473939717 468568236 462339520
834.2 462339520 455712706 449533939 444053888 438083351 428326786 415713608 410649270 415116966
850.5 415116966 417184830 412088931 403191298 391495585 375974685 355533987 329516470 298374712
866.9 298374712 266029954 240420640 227531523 226477444 233409151 245406181 261185884 286763370
$$ packed form
738.4E00506520P5758R64939R68039O39975J12713l32654k68221L2366J86741J98305
758.8E03084481K04146L03805L84807L87728M41134M76957K30312j59204k64883k07126
779.1E04882157k26498k81334l38196k77102J78J93358K861m23670q58724j168072
799.5E01504958j269102j213164j125484q67099n31792m54486o54191j045286j487404
817.9D92856950j864315k292335k826303l355711l966928m611641n371481o228716
834.2D62339520o626814o178767n480051n970537r756565j2613178n064338M467696
850.5D15116966K067864n095899q897633j1695713j5520900k0440698k6017517l1141758
866.9B98374712l2344758k5609314j2889117j054079O931707J1997030J5779703K5577486
$$ plain form
883.2 286763370 332662463 391252339 437496781 461095572 471001267 475808591 478349835 479514301
899.5 479514301 479925722 479952484 479462475 478333592 476770163 474905074 472721696 470085084 466982067
917.8 466982067 463633478 460351795 457304806 454356372 451267630 447843522 444114774 440358460
934.2 440358460 436910212 434058517 431963623 430641085 430058002 430081964 430486649 431123525 431892157
952.5 431892157 432547331 432764411 432448149 431867778 431611210 432121396 433263421 434582293 435689300
970.9 435689300 436309904 436305463 435703844 434551388 432836950 430523038 427604914 424228430 420775175
989.2 420775175 417687327 415129542 412900269 410727084 408387870 405623466 402321905 398516774
1005.6 398516774 394214243 389360219 383915275 378013134 371976763 366280288 361498177 357916623
$$ packed form
883.2B86763370M5899093N8589876M6244442K3598791R905695M807324K541244J164466
899.5D79514301M11421K6762m90009j128883j563429j865089k183378k636612l103017
917.8D66982067l348589l281683l046989k948434l088742l424108l728748l756314
934.2D40358460l448248k851695k094894j322538n83083K3962M04685O36876P68632
952.5D31892157O55174K17080l16262n80371k56568N10186J142025J318872J107007
970.9D35689300O20604m441o01619j152456j714438k313912k918124l376484l453255
989.2D20775175l087848k557785k229273k173185k339214k764404l301561l805131
1005.6C98516774m302531m854024n444944n902141o036371n696475m782111l581554
$$ plain form
1021.9 357916623 355327308 353421807 351968914 350783736 349734366 348587394 347175658 345697910
1038.2 345697910 344446421 343465090 342686027 342027664 341340363 340375304 338747203 336186826 332891494
1056.5 332891494 329454631 326430380 324047774 322373927 321449637 321208179 321494371 322008461 322352707
1074.9 322352707 322251707 321500093 320074230 318352520 316823959 315559149 314161450 312290579 310030729
1093.3 310030729 307861835 306264609 305266827 304495573 303577602 302373230 300915450 299340427 297804981
1111.6 297804981 296434700 295543134 295577168 296662718 298487395 300483197 302198023 303426266 303931952
1130 303931952 303519279 302192837 300021321 296940386 292714506 287186623 280495912 273033381 265357912
1148.3 265357912 257958740 251093894 244968265 239911720 236316293 234274596 233487114 233528972 234067187
$$ packed form
1021.9C57916623k589315j905501j452893j185178j049370j146972j411736j477748
1038.2C45697910j251489r81331p79063o58363o87301r65059j628101k560377l295332
1056.5C32891494l436863l024251k382606j673847r24290k41458K86192N14090L44246
1074.9C22352707j01000p51614j425863j721710j528561j264810j397699j870871k259850
1093.3C10030729k168894j597226r97782p71254r17971j204372j457780j575023j535446
1111.6B97804981j370281q91566L4034J085550J824677J995802J714826J228243N05686
1130C03931952m12673j326442k171516l080935m225880n527883o690711p462531p675469
1148.3B65357912p399172o864846o125629n056545l595427k041697p87482M1858N38215
$$ plain form
1166.7 234067187 234856755 235664442 236458868 237528265 239139944 241297603 243958965 247054026 250314325
1185 250314325 253482223 256508827 259317786 261728615 263682812 265197843 266218513 266726643 266797751
1203.4 266797751 266554683 266081840 265357077 264403135 263307810 262128860 260875285 259533256 258101642
1221.8 258101642 256629229 255166590 253708363 252330899 251150101 250179619 249339640 248549268 247747615
1240.1 247747615 246944308 246242449 245650157 245099455 244532064 243902802 243294388 242821991 242489263 242335826
1260.5 242335826 242354617 242432967 242517769 242598906 242759556 243126512 243709445 244399861 245064646 245585203
1280.9 245585203 245842397 245770767 245422632 244876087 244079292 242961615 241663352 240376681 239192501
1299.3 239192501 238181338 237345159 236618876 235919714 235155791 234275535 233361930 232481793 231566414
$$ packed form
1166.7B34067187P89568Q07687P94426J069397J611679K157659K661362L095061L260299
1185B50314325L167898L026604K808959K410829J954197J515031J020670N08130P1108
1203.4B66797751k43068m72843p24763r53942j095325j178950j253575j342029j431614
1221.8B58101642j472413j462639j458227j377464j180798r70482q39979p90372q01653
1240.1B47747615q03307p01859n92292n50702n67391o29262o08414m72397l32728j53437
1260.5B42335826J8791P8350Q4802Q1137J60650L66956N82933O90416O64785N20557
1280.9B45585203K57194p1630l48135n46545p96795j117677j298263j286671j184180
1299.3B39192501j011163q36179p26283o99162p63923q80256r13605q80137r15379
$$ plain form
1317.6 231566414 230607599 229584634 228437975 227238595 226074338 224953488 223871902 222774684
1333.9 222774684 221516013 220151290 219046757 218180224 217197120 216108859 215058684 214021847 212941036
1352.3 212941036 211859077 210733280 209276825 207475752 205902308 204798713 203834087 203008547 202189550
1370.7 202189550 201194957 200347409 199591056 198672742 197776705 196877271 195798427 194891602 194290251
1389 194290251 193292171 191957280 191132769 190868229 190817609 190673351 190132767 189683467 189443246 189086899
1409.4 189086899 188840955 188660771 188143954 187751740 188579738 189644098 190095380 190452218 190672860
1427.8 190672860 191003427 191400066 191201970 191263765 192504853 193384603 193572432 193627253 193705380 194257528
1448.2 194257528 195035830 195179120 194491625 194614813 197033823 198708341 198813915 199264333 200539008
$$ packed form
1317.6B31566414r58815j022965j146659j199380j164257j120850j081586j097218
1333.9B22774684j258671j364723j104533q66533r83104j088261j050175j036837j080811
1352.3B12941036j081959j125797j456455j801073j573444j103595r64626q25540q18997
1370.7B02189550r94593q47548p56353r18314q96037q99434j078844r06825o01351
1389A94290251r98080j334891q24511k64540n0620j44258n40584m49300k40221l56347
1409.4A89086899k45944j80184n16817l92214Q27998J064360M51282L56838K20642
1427.8A90672860L30567L96639j98096O1795J241088Q79750J87829N4821P8127N52148
1448.2A94257528P78302J43290o87495J23188K419010J674518J05574M50418J274675
$$ plain form
1466.5 200539008 201051995 200772181 201495856 203495964 205270544 206546813 207645074 208757222 209467396
1484.9 209467396 209882841 211208433 213683829 215397447 216320872 218346760 221145600 222981662 223235726
1503.2 223235726 223527983 227438003 232218385 235125676 237390280 239736885 242616802 245863244
1519.6 245863244 250592679 256068319 260778487 265907854 270409644 274435818 280017376 284633040
1535.9 284633040 287402391 294109046 304910034 314264238 322480768 329712301 336863279 343638450
1552.2 343638450 348931253 352123648 357366592 367212206 372719586 375294060 377716601 380504429
1568.5 380504429 384508640 387432843 389395088 393878758 399164796 403250307 407396704 411737055
1584.8 411737055 416055769 420713425 425960064 431609422 437356919 442666560 447168291 451075047
$$ packed form
1466.5B00539008N12987k79814P23675K000108J774580J276269J098261J112148P10174
1484.9B09467396M15445J325592K475396J713618R23425K025888K798840J836062K54064
1503.2B23235726K92257L910020M780382K907291K264604K346605K879917L246442
1519.6B45863244M729435N475640M710168N129367M501790M026174N581558M615664
1535.9B84633040K769351O706655J0800988R354204Q216530P231533P150978O775171
1552.2C43638450N292803L192395N242944R845614N507380K574474K422541K787828
1568.5C80504429M004211K924203J962245M483670N286038M085511M146397M340351
1584.8D11737055M318714M657656N246639N649358N747497N309641M501731L906756
$$ plain form
1601.1 451075047 454729199 457995832 460918486 463839412 466395140 467750043 468896121 471759528
1617.5 471759528 474193424 475065231 476441532 478634149 480728894 482632160 483319163 482953757 484362632
1635.8 484362632 487779617 490254581 491288513 491134197 491339087 493269742 494031459 494059682 498101592
1654.2 498101592 502658904 504608870 505215466 506016433 507491052 507921696 507385254 507719874 508167207
1672.5 508167207 508053720 507988930 506793201 503502190 498979807 495912760 494577914 492532670 489766866
1690.9 489766866 486170918 481203377 475604504 469103664 461211145 452571929 441474646 427628160
1707.2 427628160 412437350 395375729 376074791 354275733 329968601 307109565 287581861
1721.5 287581861 269391000 253612906 241812035 233497739 228468895 228409946 233306646 240272075
$$ packed form
1601.1D51075047L654152L266633K922654K920926K555728J354903J146078K863407
1617.5D71759528K433896Q71807J376301K192617K094745J903266O87003l65406J408875
1635.8D84362632L416985K474964J033932j54316K04890J930655P61717K8223M041910
1654.2D98101592M557312J949966O06596Q00967J474619M30644n36442L34620M47333
1672.5E08167207j13487o4790j195729l291011m522383l067047j334846k045244k765804
1690.9D89766866l595948m967541n598873o500840p892519q639216j1097283j3846486
1707.2D27628160j5190810j7061621j9300938k1799058k4307132k2859036j9527704
1721.5B87581861j8190861j5778094j1800871q314296n028844n8949M896700O965429
$$ plain form
1737.8 240272075 253316998 275159448 304624379 341524720 384317964 431341499 474973917
1752.1 474973917 506228447 528325915 545320868 557394981 567211807 574821830 579428673 582256496
1768.4 582256496 584122837 585987270 587698579 587599576 584826827 579137325 569999754 556146443
1784.7 556146443 536147714 510048032 480084240 455605477 445466042 446286649 456909716 481011033
1801 481011033 514717162 547188103 572011948 588541627 599126101 605914772 610142529 612940550
1817.3 612940550 615061462 616361260 616903007 617487967 618062079 618850052 620432913 621783555 622298360
1835.7 622298360 622606099 622540057 621585786 620821536 621458709 622388601 622810006 622888625 622714460 622451127
1856.1 622451127 622154891 621879220 621527731 620752454 619279921 618107259 618458807 619246602 619318008
$$ packed form
1737.8B40272075J3044923K1842450K9464931L6900341M2793244M7023535M3632418
1752.1D74973917L1254530K2097468J6994953J2074113R816826P610023M606843K827823
1768.4E82256496J866341J864433J711309r9003k772749n689502r137571j3853311
1784.7E56146443j9998729k6099682k9963792k4478763j0139435Q20607J0623067K4101317
1801D81011033L3706129L2470941K4823845J6529679J0584474O788671M227757K798021
1817.3F12940550K120912J299798N41747N84960N74112P87973J582861J350642N14805
1835.7F22298360L07739o6042r54271p64250O37173R29892M21405P8619j74165k63333
1856.1F22451127k96236k75671l51489p75277j472533j172662L51548P87795P1406
$$ plain form
1874.5 619318008 618908405 618422329 617893279 617357135 616788566 615996301 615143299 614773214 614585400 614193797
1894.9 614193797 613911867 613688588 613338292 612925470 612474859 611851692 611263514 611030221 610837579 610163927
1915.2 610163927 609320164 608890057 608556867 608314693 608284056 608051836 607593536 607088566 606533170 605953693
1935.6 605953693 605318189 604403317 603404164 602924049 602794290 602472961 601939380 601281404 600497961 599628329
1956 599628329 598745644 597985148 597507536 597209871 596982837 596944809 596895337 596595824 596185505 595771730
1976.4 595771730 595334172 594841421 594269872 593663275 593031347 592288017 591491640 591004550 590757787 590287387
1996.8 590287387 589635134 589020371 588453054 587840796 587147355 586496651 585953832 585371971 584672630 584105492
2017.2 584105492 583776534 583446622 583035350 582623005 582190335 581750572 581358254 580983043 580607653 580222011
$$ packed form
1874.5F19318008m09603m86076n29050n36144n68569p92265q53002l70085j87814l91603
1894.9F14193797k81930k23279l50296m12822m50611o23167n88178k33293j92642o73652
1915.2F10163927q43763m30107l33190k42174l0637k32220m58300n04970n55396n79477
1935.6F05953693o35504r14872r99153m80115j29759l21329n33581o57976p83443q69632
1956E99628329q82685p60496m77612k97665k27034l8028m9472k99513m10319m13775
1976.4E95771730m37558m92751n71549o06597o31928p43330p96377m87090k46763m70400
1996.8E90287387o52253o14763n67317o12258o93441o50704n42819n81861o99341n67138
2017.2E84105492l28958l29912m11272m12345m32670m39763l92318l75211l75390l85642
$$ plain form
2037.6 580222011 579793513 579394937 579085171 578816891 578563094 578306794 577989817 577590585 577197313 576837838
2058 576837838 576417565 575917006 575437605 575040519 574660003 574221969 573767424 573325574 572811663 572260678
2078.4 572260678 571785510 571362138 570954084 570541561 570105612 569698393 569315493 568885326 568407536 567938507
2098.8 567938507 567473173 567000985 566553473 566089094 565577090 565016985 564390957 563722730 563059986 562392235
2119.2 562392235 561667740 560898483 560137510 559390306 558633924 557899952 557261527 556762278 556342959 555947959
2139.6 555947959 555620611 555410326 555344701 555417001 555565298 555725396 555897832 556066155 556149602 556096315
2160 556096315 555927753 555704951 555495083 555311084 555113614 554856300 554524720 554177046 553885460 553665459
2180.4 553665459 553446889 553159058 552821100 552523792 552291691 552056193 551778316 551457345 551122010 550829411
$$ packed form
2037.6E80222011m28498l98576l09766k68280k53797k56300l16977l99232l93272l59475
2058E76837838m20273n00559m79401l97086l80516m38034m54545m41850n13911n50985
2078.4E72260678m75168m23372m08054m12523m35949m07219l82900m30167m77790m69029
2098.8E67938507m65334m72188m47512m64379n12004n60105o26028o68227o62744o67751
2119.2E62392235p24495p69257p60973p47204p56382p33972o38425m99249m19319l95000
2139.6E55947959l27348k10285o5625P2300J48297J60098J72436J68323Q3447n3287
2160E56096315j68562k22802k09868j83999j97470k57314l31580l47674k91586k20001
2180.4E53665459k18570k87831l37958k97308k32101k35498k77877l20971l35335k92599
$$ plain form
2200.8 550829411 550570726 550253928 549902141 549580574 549265563 548947692 548673034 548463523 548230052 547937572
2221.2 547937572 547632992 547337949 547072947 546806395 546505868 546229661 546001434 545774937 545539141 545299649
2241.6 545299649 545049131 544779658 544498682 544222355 543962061 543733537 543537259 543345571 543113232 542831719
2262 542831719 542533994 542252481 542002738 541753113 541471004 541164756 540845871 540530801 540249884 539986253
2282.4 539986253 539676666 539338827 538999736 538649023 538317859 538021326 537708938 537317276 536893666 536506236
2302.8 536506236 536123812 535730422 535389602 535181642 535080791 534921229 534662068 534468114 534387529 534291685
2323.2 534291685 534094036 533926010 533856869 533670306 533296227 532876492 532572925 532571554 532782555 532905102
2343.6 532905102 532601178 531562805 530370414 530011773 530655384 531517446 532057405 532329679 532454491
$$ packed form
2200.8E50829411k58685l16798l51787l21567l15011l17871k74658k09511k33471k92480
2221.2E47937572l04580k95043k65002k66552l00527k76207k28227k26497k35796k39492
2241.6E45299649k50518k69473k80976k76327k60294k28524j96278j91688k32339k81513
2262E42831719k97725k81513k49743k49625k82109l06248l18885l15070k80917k63631
2282.4E39986253l09587l37839l39091l50713l31164k96533l12388l91662m23610l87430
2302.8E36506236l82424l93390l40820k07960j00851j59562k59161j93954q0585r5844
2323.2E34291685j97649j68026o9141j86563l74079m19735l03567j371K11001J22547
2343.6E32905102l03924j038373j192391l58641O43611Q62062N39959K72274J24812
$$ plain form
2361.9 532454491 532254279 531589150 530647397 529760480 528930545 528063178 527289450 526630938 525964677 525271893
2382.3 525271893 524677038 524207652 523757160 523315310 522938430 522612691 522306502 522003472 521712124 521460354
2402.7 521460354 521206737 520894766 520532489 520168126 519825518 519471586 519083321 518687129 518294930 517877579
2423.1 517877579 517443061 517033398 516635120 516219735 515805960 515392840 514925599 514336944 513694704 513130188
2443.5 513130188 512592673 512000322 511340559 510568380 509717941 508890271 508058786 507147074 506170988 505092800
2463.9 505092800 503811359 502332211 500617206 498565465 496179014 493474483 490480095 487252116
2480.2 487252116 483787060 480011821 475938827 471694350 467227906 462328613 456894308 450907141
2496.5 450907141 444430172 437652111 430854648 424524933 419201076 415284783 413095891 412676722
$$ packed form
2361.9E32454491k00212o65129r41753q86917q29935q67367p73728o58512o66261o92784
2382.3E25271893n94855m69386m50492m41850l76880l25739l06189l03030k91348k51770
2402.7E21460354k53617l11971l62277l64363l42608l53932l88265l96192l92199m17351
2423.1E17877579m34518m09663l98278m15385m13775m13120m67241n88655o42240n64516
2443.5E13130188n37515n92351o59763p72179q50439q27670q31485r11712r76086j078188
2463.9E05092800j281441j479148j715005k051741k386451k704531k994388l227979
2480.2D87252116l465056l775239m072994m244477m466444m899293n434305n987167
2496.5D50907141o476969o778061o797463o329715n323857l916293k188892m19169
$$ plain form
2512.8 412676722 413722545 415818840 418660194 422222257 426658720 432018101 438146234 444768935
2529.2 444768935 451577067 458234727 464443803 469896615 474130213 476802349 478214383 479057252
2545.5 479057252 479731590 480330527 480859369 481306612 481650651 481878072 482018232 482110977 482157350 482137740
2565.9 482137740 482109606 482122391 482186586 482294500 482343018 482284278 482195407 482100606 482020855 482047111 482183456
2588.3 482183456 482361674 482578665 482859582 483170092 483523339 484050155 484812587 485733569 486749500
2606.7 486749500 487908930 489181787 490399599 491574973 492795497 493909717 494764745 495474845 496229649
2625 496229649 497024477 497773826 498450935 499038249 499557167 499989212 500283301 500423014 500370741 500173092
2645.4 500173092 499930501 499697924 499456435 499134094 498736203 498311937 497909933 497526556 497113466 496744156
$$ packed form
2512.8D12676722J045823K096295K841354L562063M436463N359381O128133O622701
2529.2D44768935O808132O657660O209076N452812M233598K672136J412034Q42869
2545.5D79057252O74338N98937N28842M47243L44039K27421J40160R2745M6373j9610
2565.9D82137740k8134J2785O4195J07914M8518n8740q8871r4801p9751K6256J36345
2588.3D82183456J78218K16991K80917L10510L53247N26816P62432R20982J015931
2606.7D86749500J159430J272857J217812J175374J220524J114220Q55028P10100P54804
2625D96229649P94828P49349O77109N87314N18918M32045K94089J39713n2273j97649
2645.4E00173092k42591k32577k41489l22341l97891m24266m02004l83377m13090l69310
$$ plain form
2665.8 496744156 496487141 496220738 495879859 495556295 495213151 494766623 494397789 494298130 494293332 494154066
2686.2 494154066 493877262 493473709 492964804 492470622 492068976 491779476 491526783 491157919 490629107 489956945
2706.6 489956945 489261776 488710344 488256872 487830013 487451643 486975849 486301005 485558480 484837323 484313101
2727 484313101 484033495 483719617 483357221 483026177 482709378 482584417 482614845 482519865 482221127 481910765
2747.4 481910765 481815100 481909633 481953740 481755555 481424570 481095463 480695069 480179250 479593933 478948474
2767.8 478948474 478220940 477417678 476611346 476082027 475824803 475418776 474761933 474002242 473049909 471881509
2788.2 471881509 470854640 470075041 469187915 467973024 466710359 465753645 464872658 463727534 462298840
2806.5 462298840 460659176 459117740 457812697 456345707 454537690 452595204 450573832 448321790
$$ packed form
2665.8D96744156k57015k66403l40879l23564l43144m46528l68834r9659m798j39266
2686.2D94154066k76804m03553n08905m94182m01646k89500k52693l68864n28812o72162
2706.6D89956945o95169n51432m53472m26859l78370m75794o74844p42525p21157n24222
2727D84313101k79606l13878l62396l31044l16799j24961L0428r4980k98738l10362
2747.4D81910765r5665R4533M4107j98185l30985l29107m00394n15819n85317o45459
2767.8D78948474p27534q03262q06332n29319k57224m06027o56843p59691r52333j168400
2788.2D71881509j026869p79599q87126j214891j262665r56714q80987j145124j428694
2806.5D62298840j639664j541436j305043j466990j808017j942486k021372k252042
$$ plain form
2822.9 448321790 445727050 442793250 439557910 435894668 431584030 426581293 420930028 414986312
2839.2 414986312 408941627 402116269 394205660 386588782 381257921 378348976 375955880 372340351
2855.5 372340351 366931051 360062271 352501333 344810009 337280899 330169231 323564142 317812502
2871.8 317812502 314261556 314206660 317299068 322022110 326917797 330918342 333416224 334221065 333513081
2890.2 333513081 331794024 329608053 327536136 325961530 324650198 323177814 321534514 319803506
2906.5 319803506 317598552 314518124 310873628 307554960 305211723 303726286 302525908 301005185
2922.8 301005185 298820585 295910567 292640656 289870501 288078576 287104934 286780655 286958039 287109047
2941.1 287109047 286588609 285179913 282979518 279995382 276217341 272137225 268485457 265776426
$$ packed form
2822.9D48321790k594740k933800l235340l663242m310638n002737n651265n943716
2839.2D14986312o044685o825358p910609p616878n330861k908945k393096l615529
2855.5C72340351n409300o868780p560938p691324p529110p111668o605089n751640
2871.8C17812502l550946n4896L092408M723042M895687M000545K497882Q04841p07984
2890.2C33513081j719057k185971k071917j574606j311332j472384j643300j731008
2906.5C19803506k204954l080428l644496l318668k343237j485437j200378j520723
2922.8C01005185k184600k910018l269911k770155j791925r73642l24279J77384J51008
2941.1B87109047n20438j408696k200395k984136l778041m080116l651768k709031
$$ plain form
2957.5 265776426 264461935 264773846 266691029 269999921 274211347 278807670 283399314 287850827
2973.8 287850827 292215675 296460867 300783426 305660576 311201811 317184359 323616207 330672950
2990.1 330672950 338642150 347649485 357061565 366388023 375622630 384381086 392346323 399425328
3006.4 399425328 405355483 410125017 414242744 418237180 422074795 425395668 428060532 430094659
3022.7 430094659 431748778 433278918 434434742 435077131 435550749 436285377 437194079 437607884 437510997
3041.1 437510997 437581837 438080400 438655674 438848943 438851953 439042479 439248413 439447016 439660430 439592123
3061.5 439592123 439213723 438714713 438464940 438708335 438988894 438752919 437911689 436865449 436270893
3079.8 436270893 436219603 436282754 436345488 436303526 436046541 435923517 435987681 435842901 435354173 434818655
$$ packed form
2957.5B65776426j314491L11911J917183L308892M211426M596323M591644M451513
2973.8B87850827M364848M245192M322559M877150N541235N982548O431848P056743
2990.1C30672950P969200R007335R412080R326458R234607Q758456P965237P079005
3006.4C99425328N930155M769534M117727L994436L837615L320873K664864K034127
3022.7D30094659J654119J530140J155824O42389M73618P34628R08702M13805r6887
3041.1D37510997P0840M98563N75274J93269L010J90526K05934J98603K13414o8307
3061.5D39592123l78400m99010k49773K43395K80559k35975q41230j046240n94556
3079.8D36270893n1290O3151O2734m1962k56985j23024O4164j44780m88728n35518
$$ plain form
3100.2 434818655 434545189 434267581 433661699 433082819 432833552 432386994 431384444 430401564 429877788
3118.6 429877788 429810375 430076063 430215180 429875255 429226160 428642422 428190261 427627653 426842302 426086009
3139 426086009 425690681 425482571 425142646 424623668 423834234 422902256 422279418 421995074 421608239 421030998
3159.4 421030998 420509726 420012355 419395000 418750793 418168157 417608738 417007953 416290045 415552318 414929301
3179.8 414929301 414317787 413650423 413071603 412616998 412104249 411433280 410748035 410223395 409789056 409243375
3200.2 409243375 408591658 407976866 407385826 406733960 406073272 405480206 404925793 404357523 403793991 403354317
3220.6 403354317 402999490 402522415 401962250 401434660 400821269 400166243 399748117 399490684 399131387 398691505
3241 398691505 398262650 397785366 397287428 396915972 396578610 396170855 395799726 395532042 395232022 394790858
$$ packed form
3100.2D34818655k73466k77608o05882n78880k49267m46558j002550r82880n23776
3118.6D29877788o7413K65688J39117l39925o49095n83738m52161n62608p85351p56293
3139D26086009l95328k08110l39925n18978p89434r31978o22838k84344l86835n77241
3159.4D21030998n21272m97371o17355o44207n82636n59419o00785p17908p37727o23017
3179.8D14929301o11514o67364n78820m54605n12749o70969o85245n24640m34339n45681
3200.2D09243375o51717o14792n91040o51866o60688n93066n54413n68270n63532m39674
3220.6D03354317l54827m77075n60165n27590o13391o55026m18126k57433l59297m39882
3241C98691505m28855m77284m97938l71456l37362m07755l71129k67684l00020m41164
$$ plain form
3261.4 394790858 394363672 394036233 393668026 393149853 392613858 392251432 392050862 391887605 391657650 391306967
3281.8 391306967 390904307 390598446 390331596 389921457 389420509 388988554 388683468 388529927 388352126 387931257
3302.1 387931257 387332410 386750400 386411369 386290133 386175454 386011034 385761887 385448515 385086507 384606689
3322.5 384606689 384129822 383830905 383635908 383341461 382904440 382455230 382006764 381578118 381258786 380973428
3342.9 380973428 380713284 380477369 380094260 379627794 379262984 378979236 378668994 378283352 377935201 377622038
3363.3 377622038 377253503 376914352 376662701 376511693 376398742 376191974 375911325 375603169 375249028 374952972
3383.7 374952972 374728113 374368638 373869985 373542994 373520702 373528987 373332858 373012573 372834355 372880846
3404.1 372880846 372900695 372751921 372574180 372565687 372744799 372832149 372690201 372569054 372593075 372611195 372461408
$$ packed form
3261.4C94790858m27186l27439l68207n18173n35995l62426k00570j63257k29955l50683
3281.8C91306967m02660l05861k66850m10139n00948m31955l05086j53541j77801m20869
3302.1C87931257n98847n82010l39031j21236j14679j64420k49147l13372l62008m79818
3322.5C84606689m76867k98917j94997k94447m37021m49210m48466m28646l19332k85358
3342.9C80973428k60144k35915l83109m66466l64810k83748l10242l85642l48151l13163
3363.3C77622038l68535l39151k51651j51008j12951k06768k80649l08156l54141k96056
3383.7C74952972k24859l59475m98653l26991k2292Q285j96129l20285j78218M6491
3404.1C72880846J9849j48774j77741q493J79112Q7350j41948j21147K4021J8120j49787
$$ plain form
3426.6 372461408 372094423 371740103 371548891 371292502 371097028 371352792 371864408 372163713 372229725 372536629
3447 372536629 373240709 373906940 374350935 374707341 374899894 374927610 375122309 375378251 375231236 374955654
3467.4 374955654 375386566 376576304 377578020 377889514 377686143 377459556 377934456 378672630 378810287
3485.7 378810287 378801167 379074156 379207581 379016221 378818452 378783166 378637105 378428847 378641665 378971726
3506.1 378971726 378996521 379085630 379385710 379623175 379780620 379965991 380067915 380159378 380395442 380650938
3526.5 380650938 381069034 381759793 382331461 382657856 383023173 383419275 383599371 383620352 383896738 384616494
3546.9 384616494 385223269 385569483 386270255 387235045 387975246 388492912 388752431 388405114 388015270 389389306
3567.3 389389306 392034292 393717617 394536555 395381063 396331400 397203922 397773653 397721231 397655874 399225205
$$ packed form
3426.6C72461408l66985l54320j91212k56389j95474K55764N11616K99305O6012L06904
3447C72536629P04080O66231M43995L56406J92553K7716J94699K55942j47015k75582
3467.4C74955654M30912J189738J001716L11494k03371k26587M74900P38174J37657
3485.7C78810287r120K72989J33425j91360j97769l5286j46061k08258K12818L30061
3506.1C78971726K4795Q9109L00080K37465J57445J85371J01924R1463K36064K55496
3526.5C80650938M18096O90759N71668L26395L65317L96102J80096K0981K76386P19756
3546.9C84616494O06775L46214P00772R64790P40201N17666K59519l47317l89844J374036
3567.3C89389306K644986J683325Q18938Q44508R50337Q72522N69731n2422o5357J569331
$$ plain form
3587.7 399225205 401521325 402447253 402846962 403724313 404537290 405209422 405993313 406158477 405629963
3606 405629963 405733973 406518430 406997055 407328963 407328010 407622248 409331560 410761833 410408169 409007370
3626.4 409007370 409564942 412556827 414220542 414877623 415601671 416121364 416526645 416506112 415296376
3644.8 415296376 413675904 414601505 418226570 420385122 420980632 422410995 423954606 424572647 424833447
3663.2 424833447 424446732 423211336 422897637 423858553 423619211 424268961 427019686 428658426 429249316
3681.5 429249316 429163456 427994162 426986098 428119689 430235088 431312352 431540281 431348681 431062907
3699.9 431062907 431574851 432389259 431885123 430382669 429663032 431133270 432813436 432695270 431704044
3718.2 431704044 430831820 430191398 429795742 429889560 429657400 428184986 426286280 425827175 427459419
$$ packed form
3587.7C99225205K296120R25928L99709Q77351Q12977O72132P83891J65164n28514
3606D05629963J04010P84457M78625L31908r53K94238J709312J430273l53664j400799
3626.4D09007370N57572K991885J663715O57081P24048N19693M05281k0533j209736
3644.8D15296376j620472R25601L625065K158552N95510J430363J543611O18041K60800
3663.2D24833447l86715j235396l13699R60916k39342O49750K750725J638740N90890
3681.5D29249316q5860j169294j008064J133591K115399J077264K27929j91600k85774
3699.9D31062907N11944Q14408n04136j502454p19637J470238J680166j18166r91226
3718.2D31704044q72224o40422l95656R3818k32160j472414j898706m59105J632244
$$ plain form
3736.6 427459419 428807437 427849472 426206738 427053213 428208172 427559435 428532332 431099892 431944251
3754.9 431944251 431495190 431715429 432577908 432502091 431950688 431818336 432270378 433328688 433780491 433167517
3775.3 433167517 432456553 432666034 433184773 433045536 433001548 433263242 433311492 432943940 431961298 430994838
3795.7 430994838 430241376 429448605 430045277 430816293 430753142 431719959 432379216 431355804 429816842
3814.1 429816842 429356784 429061770 428652972 429984361 430833906 430467397 430119544 429489493 428831041
3832.4 428831041 428177267 427601308 428104281 429116458 429798394 430315524 430031627 428225636 425394416
3850.8 425394416 425012767 428672194 430409551 429532200 428256392 427575648 427552432 427002668 426620543
3869.1 426620543 427600175 428406030 428713471 428273439 427430600 427444637 427349925 427599639 428277403 427841812
$$ packed form
3736.6D27459419J348018r57965j642734Q46475J154959o48737R72897K567560Q44359
3754.9D31944251m49061K20239Q62479p5817n51403j32352M52042J058310M51803o12974
3775.3D33167517p10964K09481N18739j39237m3988K61694M8250l67552r82642r66460
3795.7D30994838p53462p92771N96672P71016o3151R66817O59257j023412j538962
3814.1D29816842m60058k95014m08798J331389Q49545l66509l47853o30051o58452
3832.4D28831041o53774n75959N02973J012177O81936N17130k83897j805991k831220
3850.8D25394416l81649L659427J737357q77351j275808o80744k3216n49764l82125
3869.1D26620543R79632Q05855L07441m40032q42839J4037r4712K49714O77764m35591
$$ plain form
3889.5 427841812 427573085 427972883 427421838 426055700 425131083 425204575 426354140 427916348 428542495
3907.9 428542495 428317696 427856833 427002609 426196486 426198721 426509172 426430434 426345795 426484674 426239759
3928.3 426239759 425751597 425898105 426509798 426715970 426374406 425891966 425751865 425744712 425449908 425322592
3948.7 425322592 425590008 425860614 425915927 425797284 425581485 425366819 425278991 425252080 425197810 425154209
3969.1 425154209 425082386 424945205 424858868 424869090 424939424 425032377 425032943 424861044 424603671 424364835 424103558
3991.5 424103558 423886001 423827767 423879743
3997.6 423879743
$$ packed form
3889.5D27841812k68727L99798n51045j366138r24617P3492J149565J562208O26147
3907.9D28542495k24799m60863q54224q06123K235L10451p8738q4639J38879k44915
3928.3D26239759m88162J46508O11693K06172l41564m82440j40101p153k94804j27316
3948.7D25322592K67416K70606N5313j18643k15799k14666q7828k6911n4270m3601
3969.1D25154209p1823j37181q6337J0222P0334R2953N66j71899k57373k38836k61277
3991.5D24103558k17557n8234N1976
3997.6D23879743
##END=$$ End of the data block
