##TITLE=Silicone 1 $$ Begin of the data block
##JCAMP-DX=5.00 $$ ACD/SpecManager v 10.08
##DATE=14 Dec 2016 11:33:04
##DATA TYPE=INFRARED SPECTRUM
##DATA CLASS=XYDATA
##ORIGIN=Marcelo Quint
##OWNER=
##NPOINTS=1667
##FIRSTX=599.65820312
##LASTX=3997.72216797
##MAXX=3997.72216797
##MINX=599.65820312
##MAXY=1.05601764
##MINY=0.13709536
##XFACTOR=1.0000000000
##YFACTOR=0.000000010000000
##FIRSTY=0.96902126
##DELTAX=2.03965425
##XUNITS=1/CM
##YUNITS=ARBITRARY UNITS
##XYDATA=(X++(Y..Y))
599.7I6902126M1324K7597j7005m1682k5451j770N9l0666p1728q1313n4151l7509l6919
$$ 96902126 96943450 96971047 96954042 96912360 96886909 96885139 96885198 96854532 96782804 96701491 96647340 96609831 96572912
626.2I6572912k6721J1772M7982O3318P7569Q5545O6584K7227k6613j18119k61998
$$ 96572912 96546191 96557963 96605945 96669263 96746832 96832377 96898961 96926188 96899575 96781456 96519458
648.6I6519458m87637q88288j703531k843958l251272k086002l99071L88831L76052
$$ 96519458 96031821 95143533 93440002 90596044 87344772 85258770 84859699 85248530 85624582
667H5624582J84989N6517j04851l03137m92031o89435q29517q20721o14547k78461
$$ 85624582 85809571 85866088 85761237 85458100 84966069 84276634 83447117 82626396 82011849 81733388
687.4H1733388j4520R668j55276l68530n15157n17744l51268n620N53560J288485J949585
$$ 81733388 81718868 81728536 81573260 81204730 80689573 80171829 79820561 79814941 80368501 81656986 83606571
709.8H3606571K202779J938587J342279P16722L22771K22200K58249K71684K12175
$$ 83606571 85809350 87747937 89090216 89806938 90129709 90351909 90610158 90881842 91094017
728.2I1094017J02085k2709j37896k32971k81691k34372j56235j42598j66667k09677
$$ 91094017 91196102 91173393 91035497 90802526 90520835 90286463 90130228 89987630 89820963 89611286
748.6H9611286k86454l81327m91351o11227p30676q62652j042020j289439j595438
$$ 89611286 89324832 88943505 88452154 87840927 87110251 86247599 85205579 83916140 82320702
766.9H2320702j959515k426856l042752l811431m708206n626554o424051o985203p153931
$$ 82320702 80361187 77934331 74891579 71080148 66371942 60745388 54321337 47336134 40182203
785.3D0182203o768015n869383m683527l481664k454461j660839j046709n08069J9828
$$ 40182203 33414188 27544805 22861278 19379614 16925153 15264314 14217605 13709536 13729364
803.6A3729364N20134R52786J304574J488075J465446J329656J327753J780772K852064
$$ 13729364 14249498 15202284 16506858 17994933 19460379 20790035 22117788 23898560 26750624
822B6750624M312769N565920O095723N850547N157170M347718L571546K887928K328092
$$ 26750624 31063393 36629313 42725036 48575583 53732753 58080471 61652017 64539945 66868037
840.3F6868037J837850J355719Q83180M26924o0630o16210j151109j521313j620317
$$ 66868037 68705887 70061606 70944786 71371710 71311080 70694870 69543761 68022448 66402131
858.7F6402131j385986q69340k61551K48712N85192P99209J016456J312053J689959
$$ 66402131 65016145 64146805 63885254 64133966 64719158 65518367 66534823 67846876 69536835
877.1F9536835K073836K328021K373176K219034J945358J657105J411003J213043J058108
$$ 69536835 71610671 73938692 76311868 78530902 80476260 82133365 83544368 84757411 85815519
895.4H5815519R37677Q35657P38209O50561N86104N29963M66877M07297L57377L08913
$$ 85815519 86753196 87588853 88327062 88977623 89563727 90093690 90560567 90967864 91325241 91634154
915.8I1634154K63924K44480K37966K03359J49160R6012L6853r227l0666n5778q8668
$$ 91634154 91898078 92142558 92380524 92583883 92733043 92829055 92865908 92856681 92826015 92770237 92681569
938.2I2681569j15252j40792j66452j85257k04402k41143l06260l86954m77802n83053
$$ 92681569 92566317 92425525 92259073 92073816 91869414 91628271 91322011 90935057 90457255 89874202
958.6H9874202o80685p57337q15004q61776r09859r61214j031303j138276j280451
$$ 89874202 89193517 88436180 87621176 86759400 85849541 84888327 83857024 82718748 81438297
977H1438297j455456j665717j912046k190530k497089k833563l193706l570152l963631
$$ 81438297 79982841 78317124 76405078 74214548 71717459 68883896 65690190 62120038 58156407
995.4E8156407m363048m736465n029062n174732n115092m787856m169427l337096k430948
$$ 58156407 53793359 49056894 44027832 38853100 33738008 28950152 24780725 21443629 19012681
1013.7A9012681j584334q85787l67990q856K26256L78943M78980N34321N61933N70251
$$ 19012681 17428347 16542560 16174570 16165714 16391970 16770913 17249893 17784214 18346147 18916398
1034.1A8916398N65535N48190N19978M87658M44530L91400L46623K99256K33332J59832
$$ 18916398 19481933 20030123 20550101 21037759 21482289 21873689 22220312 22519568 22752900 22912732
1054.5B2912732Q5862J6442n3181j28345k07593k80152l48231m16301m79942n43978
$$ 22912732 22998594 23015036 22961855 22833510 22625917 22345765 21997534 21581233 21101291 20557313
1074.9B0557313n95813o26349o42257o51438o44622o02765n29523m45066l38597j89423
$$ 20557313 19961500 19335151 18692894 18041456 17396834 16794069 16264546 15819480 15480883 15291460
1095.3A5291460j0649J84894M03084O47533R03694J176645J467073J754086K024476
$$ 15291460 15280811 15465705 15868789 16516322 17420016 18596661 20063734 21817820 23842296
1113.7B3842296K262300K446914K568212K624560K618500K569214K483031K369040
$$ 23842296 26104596 28551510 31119722 33744282 36362782 38931996 41415027 43784067
1130D3784067K252305K142292K029851J912284J802349J697606J596570J511502J438612
$$ 43784067 46036372 48178664 50208515 52120799 53923148 55620754 57217324 58728826 60167438
1148.3F0167438J368725J307678J259142J214695J168871J128251J086145J023615
$$ 60167438 61536163 62843841 64102983 65317678 66486549 67614800 68700945 69724560
1164.6F9724560R58484R20904R16427R29791R23967Q84289Q31067P75189P19368O73902
$$ 69724560 70683044 71603948 72520375 73450166 74374133 75258422 76089489 76864678 77584046 78257948
1185G8257948O36202N91338N47081N14144M77016M30900L93527L65437L33368L01659
$$ 78257948 78894150 79485488 80032569 80546713 81023729 81454629 81848156 82213593 82546961 82848620
1205.4H2848620K74623K41792K00713J58322J14703O5028J8460K599K3550M3672L2568
$$ 82848620 83123243 83365035 83565748 83724070 83838773 83903801 83922261 83924860 83948410 83992082 84024650
1227.9H4024650j860p5531k21622m37194p30514j147461j765371k689862l936118n466145
$$ 84024650 84022790 83947259 83725637 83288443 82557929 81410468 79645097 76955235 73019117 67552972
1248.3F7552972p551360j0220120j2059578j1186403p642984l063389J652050O478328
$$ 67552972 60001612 49781492 37721914 26535511 18892527 15829138 17481188 23959516
1264.6B3959516J0632236J2473938J1503282R025169O601214M838467L623962K753401
$$ 23959516 34591752 47065690 58568972 67594141 74195355 79033822 82657784 85411185
1280.9H5411185K112371J640969J304102J067794Q95285P51752O27798N41109M85241
$$ 85411185 87523556 89164525 90468627 91536421 92431706 93183458 93811256 94352365 94837606
1299.3I4837606M39841M14103M00787L75903L49045L28785L08877K83247K50060K15572
$$ 94837606 95277447 95691550 96092337 96468240 96817285 97146070 97454947 97738194 97988254 98203826
1319.7I8203826J79988J42133J03957O4450K2918l1924r9951j49286j71309j56576
$$ 98203826 98383814 98525947 98629904 98694354 98717272 98685348 98585397 98436111 98264802 98108226
1340.1I8108226q8173k9463k5892m6408o2877o6233p5227j20628k29537m52125p90620
$$ 98108226 98020053 97990590 97964698 97918290 97855413 97789180 97713953 97593325 97363788 96911663 96121043
1362.5I6121043r78714q06350n43201n53214r77832j415950j094264N895J087486J429761
$$ 96121043 95142329 94335979 93792778 93239564 92261732 90845782 89751518 89757413 90844899 92274660
1382.9I2274660J183438Q42852L76159j99897p67731j200336j150507p65580l53736
$$ 92274660 93458098 94300950 94677109 94477212 93709481 92509145 91358638 90593058 90239322
1401.2I0239322k17384m40174p03317p63136n00161J30660Q43942J420933J769465
$$ 90239322 90021938 89581764 88878447 88115311 87615150 87745810 88589752 90010685 91780150
1419.6I1780150J531315J097917P65670M28283R0426k01505m75365r24671j256043
$$ 91780150 93311465 94409382 95175052 95603335 95693761 95492256 95016891 94092220 92836177
1438I2836177j185918j242303j308555j164251r11194o39677o09053q17561j122319
$$ 92836177 91650259 90407956 89099401 87935150 87023956 86384279 85775226 84957665 83835346
1456.3H3835346q15070K9617L12782L50213P51883J624053K680028L447807K831965
$$ 83835346 83020276 83049893 83362675 83712888 84464771 86088824 88768852 92216659 95048624
1474.7I5048624J656342J018417O89834N00554L75867K80875K34777K67153K77901
$$ 95048624 96704966 97723383 98413217 98913771 99289638 99570513 99805290 100072443 100350344
1493A00350344J89495J05775J17826J51205J13392l5596j11568J02258J77765R3281
$$ 100350344 100539839 100645614 100763440 100914645 101028037 100992441 100880873 100983131 101160896 101254177
1513.4A01254177m578k6691j811j6630L1447O2621N1355O8641K2733k1159M0161J586
$$ 101254177 101249599 101222908 101221097 101204467 101235914 101298535 101349890 101418531 101441264 101420105 101460266 101461852
1537.9A01461852j43862n2166J03295J15323O9320J8442Q571K730l1102j44804q3398
$$ 101461852 101317990 101265824 101369119 101484442 101553762 101572204 101580775 101583505 101552403 101407599 101324201
1560.3A01324201J22571J02090J6070n8341o3956K2590j2719j15097m5383O735m2343
$$ 101324201 101446772 101548862 101564932 101506591 101442635 101465225 101452506 101337409 101292026 101298761 101256418
1582.8A01256418o8283n3871l8707l8910m7791m2331j8275L910R895J2982K4318K8837
$$ 101256418 101188135 101134264 101095557 101056647 101008856 100966525 100948250 100952160 100962055 100975037 100999355 101028192
1607.3A01028192L4618N4944O3694J6212j0908O4063O8093J9014L6215M9222N0568
$$ 101028192 101062810 101117754 101181448 101197660 101186752 101250815 101318908 101337922 101374137 101423359 101473927
1629.7A01473927O9416J4877p9035N96R3615P5245K3055o1155j9502J00767o687r5678
$$ 101473927 101543343 101558220 101479185 101479781 101573396 101648641 101671696 101610541 101591039 101691806 101685119 101589441
1654.2A01589441J13654J51647N8651m077L7372O8295j0872k7955M9997L1423J5462
$$ 101589441 101703095 101854742 101913393 101909316 101946688 102014983 102004111 101976156 102026153 102057576 102073038
1676.6A02073038N2273K5284p6723j14524L5870P2145K3520J717p3385r6143o5553
$$ 102073038 102125311 102150595 102073872 101959348 101995218 102067363 102090883 102092600 102019215 101923072 101857519
1699A01857519n3179L6383L3319J19K4688J8668k4080q6784j03701K5058J08743O6650
$$ 101857519 101804340 101840723 101874042 101874161 101898849 101917517 101893437 101806653 101702952 101728010 101836753 101903403
1723.5A01903403K3782j2743p1001j46497k96747k71035j48034k04921j91807m6790
$$ 101903403 101927185 101914442 101843441 101696944 101400197 101129162 100981128 100776207 100584400 100537610
1743.9A00537610P6401J54591K37548L61276L95465L11303K10595J24061P6604R0492
$$ 100537610 100614011 100768602 101006150 101367426 101762891 102074194 102284789 102408850 102485454 102575946
1764.3A02575946O3312P522k0564l4034L4011R3674N7864J8406L0339M5157N4895N3025
$$ 102575946 102639258 102646780 102626216 102592182 102626193 102719867 102777731 102796137 102826476 102871633 102926528 102979553
1788.8A02979553J0478J240O3849Q5175N1868L6120O5184Q2910O0641L2139L2497N6362
$$ 102979553 102990031 102991271 103055120 103140295 103192163 103228283 103293467 103376377 103437018 103469157 103501654 103558016
1813.3A03558016N5384L4965L6287L7896J1361L946J8954L696K1934N2798K2304l230
$$ 103558016 103613400 103648365 103684652 103722548 103733909 103737855 103756809 103760505 103782439 103835237 103857541 103854311
1837.7A03854311Q451j0943n6601j5330M5133L0947O830J526l46j0049j8716j9109
$$ 103854311 103862762 103851819 103795218 103779888 103825021 103855968 103862798 103864324 103863978 103853929 103835213 103816104
1862.2A03816104k2376m9472p1716j9002L7170J9085j3804j9420j2207r965j2219j1540
$$ 103816104 103793728 103744256 103672540 103653538 103690708 103709793 103695989 103676569 103664362 103654397 103642178 103630638
1886.7A03630638k1589j3339J0621L553l46L946r060j9169k5415m2296n9437o5685
$$ 103630638 103609049 103595710 103606331 103609884 103609538 103613484 103604424 103585255 103559840 103517544 103458107 103392422
1911.2A03392422o3765p0155q9466p0369l2330k8896k4080j9074l9065p8785j18625
$$ 103392422 103328657 103258502 103169036 103098667 103066337 103037441 103013361 102994287 102955222 102876437 102757812
1933.6A02757812j38140j39713j31309j11080m6086L8910P8702Q6570Q3756O9177N8246
$$ 102757812 102619672 102479959 102348650 102237570 102191484 102230394 102309096 102395666 102479422 102548599 102606845
1956A02606845N6279N4192N7304O7186Q3304J12057J31237J22762J02901Q3685P0608
$$ 102606845 102663124 102717316 102774620 102841806 102925110 103037167 103168404 103291166 103394067 103477752 103548360
1978.5A03548360O2764N5706M5240K7251J2219M685N376J4580K3675M0233O0296O7413
$$ 103548360 103611124 103666830 103712070 103739321 103751540 103756225 103761601 103776181 103799856 103840089 103900385 103967798
2003A03967798O6793O2501N1201L8290K8073J5295Q809J7608K0814R954n138j7310
$$ 103967798 104034591 104097092 104148293 104186583 104214656 104229951 104238760 104256368 104277182 104287136 104281998 104264688
2027.4A04264688j9252k2900l6371m8124n7161p6020j01543j03449p7510m7517j9491
$$ 104264688 104245436 104222536 104186165 104138041 104080880 104004860 103903317 103799868 103722358 103674841 103655350
2049.9A03655350M351J8514K5689L3415M4536M9615L8481K6798K9886L6692L8517L3271
$$ 103655350 103659701 103678215 103703904 103737319 103781855 103831470 103869951 103896749 103926635 103963327 104001844 104035115
2074.3A04035115K4283K0266K3913L0720L6371L4428K2626K0075L0469L4249K8014
$$ 104035115 104059398 104079664 104103577 104134297 104170668 104205096 104227722 104247797 104278266 104312515 104340529
2096.8A04340529K0159J4519J1182R060N961J108k897p033j0919j3793j2171j43M244
$$ 104340529 104360688 104375207 104386389 104395449 104401410 104402518 104399621 104392588 104381669 104367876 104355705 104355562 104359806
2123.3A04359806m769m995M912J4889J9813J6439J4281K0456J9968J5616J8549K0230
$$ 104359806 104355037 104350042 104354954 104369843 104389656 104406095 104420376 104440832 104460800 104476416 104494965 104515195
2147.8A04515195J9526J7941J5617J4281J4114Q214k003j347O020R740J0776J1623
$$ 104515195 104534721 104552662 104568279 104582560 104596674 104604888 104602885 104601538 104607558 104617298 104628074 104639697
2172.2A04639697J2994J1730O580K015j419j299N007P987P15o616j156L838M8L064
$$ 104639697 104652691 104664421 104671001 104673016 104671597 104670298 104675305 104683292 104684007 104677391 104676235 104680073 104680121 104683185
2200.8A04683185R727J0157P009J478m780l981K98j276N13R024J1372P725O342O604
$$ 104683185 104692912 104703069 104710078 104711556 104706776 104702795 104703093 104701817 104702330 104711354 104722726 104730451 104736793 104743397
2229.3A04743397P522Q214R346R894J0300J4591J3042L254J204P844P308R06j08J228
$$ 104743397 104750919 104759133 104768479 104778373 104788673 104803264 104816306 104819560 104820764 104828608 104835916 104836822 104836714 104837942
2257.9A04837942Q4J156P713O246q94L195J0586J1158M577k431J502O938L683J812
$$ 104837942 104838026 104839182 104846895 104853141 104852247 104855442 104866028 104877186 104881763 104879332 104880834 104887772 104891455 104893267
2286.5A04893267Q47n985j3387j9872k3723j6355o581j3983k9957l1805j9491j0884
$$ 104893267 104894114 104888129 104874742 104854870 104831147 104814792 104808211 104794228 104764271 104732466 104712975 104702091
2310.9A04702091j5569j7714j0669r144j2183r227j0299k9326m2081k3198k14k51j0812
$$ 104702091 104686522 104668808 104658139 104648995 104636812 104627585 104617286 104587960 104545879 104522681 104522467 104522216 104511404
2337.4A04511404k2519l3688m4978k6178N0008Q9216M5193j0312j9598k8324m8685
$$ 104511404 104488885 104455197 104410219 104384041 104434049 104523265 104568458 104558146 104538548 104510224 104461539
2359.9A04461539m6540l5953k6488k349J5784K1386K9599L8243M2975N1117N9580N2107
$$ 104461539 104414999 104379046 104352558 104350209 104365993 104387379 104416978 104455221 104498196 104549313 104608893 104661000
2384.4A04661000L0660J0467K730M709M637p87n615n340k122K980P594L850m840n769
$$ 104661000 104691660 104702127 104704857 104709566 104714203 104713416 104707801 104702461 104700339 104703319 104710913 104714763 104709923 104704154
2412.9A04704154m364k145Q344J1039J824k515l970q094m590M494O652M030K729M387
$$ 104704154 104699790 104697645 104705989 104717028 104718852 104716337 104712367 104704273 104699683 104704177 104710829 104714859 104717588 104721975
2441.5A04721975N365N412L254n173p463l576m888k670J311m160j0395n496K933k027
$$ 104721975 104727340 104732752 104736006 104730833 104723370 104719794 104714906 104712236 104713547 104709387 104698992 104693496 104696429 104694402
2470A04694402j1444r811m732q35K813p140k6810l5990m3130n3799o4850p7831p1180
$$ 104694402 104682958 104673147 104668415 104667580 104670393 104663253 104636443 104600453 104557323 104503524 104438674 104360843 104289663
2496.5A04289663k8515M5431J17027J36435J18924J05345Q8107O1536L3021P963j728
$$ 104289663 104261148 104306579 104423606 104560041 104678965 104784310 104872417 104933953 104966974 104974937 104973209
2519A04973209L636L290j1194j8668k1017l7419n3287n1510m5717l8958k8824l0995
$$ 104973209 104976845 104980135 104968941 104950273 104929256 104891837 104838550 104787040 104741323 104702365 104673541 104642546
2543.4A04642546l8516m0031l4010j8752j1682j7012k2554k3687j8322j2994k0492
$$ 104642546 104604030 104563999 104529989 104511237 104499555 104482543 104459989 104436302 104417980 104404986 104384494
2565.9A04384494l6264l7455k2257j2707j7178k9040l5584k8658k1088k3186k5463
$$ 104384494 104348230 104310775 104288518 104275811 104258633 104229593 104194009 104165351 104144263 104121077 104095614
2588.3A04095614k5499k6715k2924j9157k6047l0947k2220r751j395l517j7130k5869
$$ 104095614 104070115 104043400 104020476 104001319 103975272 103944325 103922105 103912354 103910959 103907442 103890312 103864443
2612.8A03864443k1290j2911j1253j4162j6427j4663j2207k1541l0351k4903j9931
$$ 103864443 103843153 103830242 103818989 103804827 103788400 103773737 103761530 103739989 103709638 103684735 103664804
2635.2A03664804k3509k6571l1460m6074n3358m9877n2393n9557o4850o1869m5550
$$ 103664804 103641295 103614724 103583264 103537190 103483832 103433955 103381562 103322005 103257155 103195286 103149736
2657.7A03149736l3939l6991l4868j9443P116L2199L9101L6525L5560M0567N0533N1820
$$ 103149736 103115797 103078806 103043938 103024495 103031611 103063810 103102911 103139436 103174996 103215563 103266096 103317916
2682.1A03317916L6896K0003J7452K0516J6987R120K265O294J2243l612k7025l2043
$$ 103317916 103354812 103374815 103392267 103412783 103429770 103438890 103441155 103447449 103459692 103456080 103429055 103397012
2706.6A03397012k9075l6467m7338m8589m9365n4693n1069m3071m0650k3723J1766
$$ 103397012 103367937 103331470 103284132 103235543 103186178 103131485 103080416 103037345 102996695 102972972 102984738
2729A02984738L9685N1451M6432L3927L2842L6871L1269P939j8847j0192K1803K1291
$$ 102984738 103024423 103075874 103122306 103156233 103189075 103225946 103257215 103265154 103246307 103236115 103257918 103279209
2753.5A03279209j2290l9673n4443o7377p4995p5590p8905r8312j31845j55235j58202
$$ 103279209 103266919 103227246 103172803 103105426 103030431 102954841 102875936 102777624 102645779 102490544 102332342
2775.9A02332342j69492k06149k39837k56860k70844k70748k38609j95992j74308j66464
$$ 102332342 102162850 101956701 101716864 101460004 101189160 100918412 100679803 100483811 100309503 100143039
2796.3A00143039j52313j32901j33055j58024j86605k12788k20853k16317k31749k68829
$$ 100143039 99990726 99857825 99724770 99566746 99380141 99167353 98946500 98730183 98498434 98229605
2816.7I8229605l21960l83276m48257n33682o62792q56274j127458j463628j840478
$$ 98229605 97907645 97524369 97076112 96542430 95879638 95023364 93895906 92432278 90591800
2835.1I0591800k277952k786476l280329l631682l824979l968572m009837l595460
$$ 90591800 88313848 85527372 82247043 78615361 74790382 70821810 66811973 63216513
2851.4F3216513k452081q42398O07740J501483J848430J750677J270628O16151J36167
$$ 63216513 60764432 59922034 60529774 62031257 63879687 65630364 66900992 67517143 67653310
2869.8F7653310J03188N80454J291579J708823J522374Q87663J22219n85592j165491
$$ 67653310 67756498 68336952 69628531 71337354 72859728 73747391 73869610 73284018 72118527
2888.1G2118527j589871j868796k036917k124626k155310k113396j976156j774913
$$ 72118527 70528656 68659860 66622943 64498317 62343007 60229611 58253455 56478542
2904.4E6478542j570588j445449j481098j700669k044973k386853k553809k390334
$$ 56478542 54907954 53462505 51981407 50280738 48235765 45848912 43295103 40904769
2920.8D0904769j823389r14204J61621J155433J865172K329376K642754K759454K576738
$$ 40904769 39081380 38167176 38328797 39484230 41349402 43678778 46321532 49080986 51657724
2939.1E1657724K015686J068628j58173j456624k568978l310615l665539l618980l106719
$$ 51657724 53673410 54742038 54583865 53127241 50558263 47247648 43582109 39963129 36856410
2957.5C6856410k143550p32416J090363L115380M973498O291037O901387O829673O245661
$$ 36856410 34712860 33980444 35070807 38186187 43159685 49450722 56352109 63181782 69427443
2975.8F9427443N410951M526108L708089L020710K456212J983600J605416J322532
$$ 69427443 74838394 79364502 83072591 86093301 88549513 90533113 92138529 93461061
2992.1I3461061J106286R23299P70224O55764N62101M85135M23502L50208K69764K24167
$$ 93461061 94567347 95490646 96260870 96916634 97478735 97963870 98387372 98737580 99007344 99231511
3012.5I9231511K26051K37435K22737J83665J34755J03569J01435R2792O9964N7006
$$ 99231511 99457562 99694997 99917734 100101399 100236154 100339723 100441158 100533950 100603914 100660920
3032.9A00660920P1216R4294P1109K8741K7096M5574M7863L8862M3905M5692L0959
$$ 100660920 100732136 100826430 100897539 100926280 100953376 100998950 101046813 101085675 101129580 101175272 101206231
3055.4A01206231L7992N1642L5202J6379J6034L3879N6398N7483L3176k825j8287k27
$$ 101206231 101244223 101295865 101331067 101347446 101363480 101397359 101453757 101511240 101544416 101541591 101523304 101523077
3079.8A01523077K3723L6109L6752K4831J9729K9826K4009j91j5747j0288J347l183
$$ 101523077 101546800 101582909 101619661 101644492 101664221 101694047 101718056 101717865 101702118 101691830 101693177 101689994
3104.3A01689994j8704j7404J2135J9539r060r334J8894M4513O8438P3207N3823L4177
$$ 101689994 101671290 101653886 101666021 101685560 101676500 101667166 101686060 101730573 101799011 101872218 101926041 101960218
3128.8A01960218L1936M0269L2949J0062Q130L2377M5157L6847J6737j7381k9885J1408
$$ 101960218 101992154 102032423 102065372 102075434 102083564 102115941 102161098 102197945 102214682 102197301 102167416 102178824
3153.3A02178824M8470L7849J7858P677K098M983J0610Q404M220O270O938j2p093m148
$$ 102178824 102227294 102265143 102283001 102290678 102292776 102297759 102308369 102316773 102320993 102327263 102334201 102334189 102327096 102322948
3181.8A02322948K372P904Q786M792J0299K0254J6296K885k587l755m220L064R739
$$ 102322948 102325320 102333224 102342010 102346802 102357101 102377355 102393651 102396536 102393949 102390194 102385974 102389038 102398777
3208.3A02398777J1766J3113J7297J3221m137r394m542n483p463q249j3542j2791R334
$$ 102398777 102410543 102423656 102440953 102454174 102450037 102440643 102436101 102430618 102423155 102414906 102401364 102388573 102397907
3234.8A02397907K6500K7740J9956q572l3390k0671J0789J8990R5r084Q226J9431P748
$$ 102397907 102424407 102452147 102472103 102463531 102430141 102409470 102420259 102439249 102439344 102430260 102438486 102457917 102465665
3261.4A02465665o652q630j9706m7016l0982J0836J3590J1778J8513N328K75J1205
$$ 102465665 102459013 102450383 102430677 102383661 102352679 102363515 102377105 102388883 102407396 102412724 102412999 102424204
3285.8A02424204n149m1640m5097j5235J6189L3807J1385m2498o4195k7716K4915N1057
$$ 102424204 102419055 102377415 102332318 102317083 102333272 102367079 102378464 102335966 102271771 102244055 102268970 102320027
3310.3A02320027M3297K6548J9968N304j3041k4295k6107M101L5679K3759m8j6522
$$ 102320027 102363324 102389872 102409840 102415144 102402103 102377808 102351701 102355802 102391481 102415240 102415192 102398670
3334.8A02398670l5990k2864J9443L7110L0851J4556j8001j8787K6381M4989K3735
$$ 102398670 102362680 102339816 102359259 102396369 102427220 102441776 102423775 102404988 102431369 102476358 102500093
3357.2A02500093J860K622R203j6403l7837K933P1239P5591K2602K122K2864L4845
$$ 102500093 102501953 102504575 102513778 102497375 102459538 102462471 102533710 102609301 102631903 102634025 102656889 102691734
3381.7A02691734K3877J1039p033l6395k1922M2021N5945n663l1018K8610P8071N1045
$$ 102691734 102715611 102726650 102719617 102683222 102661300 102703321 102759266 102753603 102722585 102751195 102829266 102880311
3406.2A02880311J1885J4222K3889L2580M3559K9469O246R788K0504K753j4400M160
$$ 102880311 102892196 102906418 102930307 102962887 103006446 103035915 103042161 103051949 103072453 103075206 103060806 103064966
3430.6A03064966K0099P486K1684O4481N9724L0636K5893J5306J1349K8097L0554J9920
$$ 103064966 103085065 103092551 103114235 103178716 103238440 103269076 103294969 103310275 103321624 103349721 103380275 103400195
3455.1A03400195J1181P213K2268L5703P033k4879P964O6280P2384L8516O831N520
$$ 103400195 103411376 103418589 103440857 103476560 103483593 103458714 103466678 103532958 103605342 103643858 103650689 103656209
3479.6A03656209M0864M9043J7762K5320M7124J3840j4329J0634M1377L2270j91K1923
$$ 103656209 103697073 103746116 103763878 103789198 103836322 103850162 103835833 103846467 103887844 103920114 103919923 103941846
3504.1A03941846O6185M6599R560j204J4520M1354L3259m685k4831L576N0783O0642
$$ 103941846 104008031 104054630 104064190 104062986 104077506 104118860 104152119 104147434 104122603 104126179 104176962 104237604
3528.5A04237604M9722L8040Q571l826J7857J7917j5127l8851k14O4730N1272O116
$$ 104237604 104287326 104325366 104333937 104330111 104347968 104365885 104350758 104311907 104311693 104376423 104427695 104433811
3553A04433811J3554K7573P951p737r822n5480r7823j6368P1681M8554k933k5237m0614
$$ 104433811 104447365 104474938 104482889 104475152 104465330 104409850 104312027 104295659 104367340 104415894 104412961 104387724 104347110
3579.5A04347110l3498j5616m3941o4909Q416N7065K4832L588P462Q583K0290L0136
$$ 104347110 104313612 104297996 104254055 104189146 104197562 104254627 104279459 104283047 104290509 104299092 104319382 104349518
3604A04349518P999k5988j0764J7046L0303M0770k4712n2822M2403Q2922j1039j78241
$$ 104349518 104357517 104331529 104320765 104337811 104368114 104408884 104384172 104331350 104373753 104456675 104445636 104267395
3628.5A04267395j29211L5917L5930P260M983m518J3089K6727m8209j43837j944K00987
$$ 104267395 104138184 104174101 104210031 104217291 104222274 104217756 104230845 104257572 104209363 104065526 104063582 104264569
3653A04264569J26672j6344K8861R2661Q6201P0262J7047q6856n9295j574j25706p4482
$$ 104264569 104391241 104374897 104403758 104496419 104582620 104652882 104669929 104583073 104523778 104522204 104396498 104322016
3677.4A04322016P5758M4512K599m5788k02215k59578o7782M4167L1018K7537Q095
$$ 104322016 104397774 104442286 104444885 104399097 104196882 103937304 103869522 103913689 103944707 103972244 103980339
3699.9A03980339k7407J4294O8748K9611o9296q9646L7098J11044Q1980M7088M1330
$$ 103980339 103952932 103967226 104035974 104065585 103996289 103906643 103943741 104054785 104136765 104183853 104225183
3722.3A04225183L8766M8316J00470Q5234m6563j40882p2348R5833J75512P855k09879
$$ 104225183 104263949 104312265 104412735 104497969 104451406 104310524 104238176 104334009 104509521 104517376 104307497
3744.7A04307497p1741k038j53124p7784P2109L3915m6181j3411M0221J5831m220p415
$$ 104307497 104235756 104233718 104080594 104002810 104074919 104108834 104062653 104049242 104089463 104105294 104101074 104093659
3769.2A04093659K6321R7585J03617M1055K194N1939Q7500P4875Q7572R6118Q4388
$$ 104093659 104119980 104217565 104321182 104362237 104364431 104416370 104503870 104578745 104666317 104762435 104846823
3791.6A04846823N8091K8074N6708K7048n3227M6528P7986J920N4574R2268p630j08957
$$ 104846823 104904914 104932988 104989696 105016744 104963517 105010045 105088031 105089951 105144525 105236793 105229163 105120206
3816.1A05120206m9901m4990o1834M7124N7101K0909K5130K4700J728o4504p5066K1422
$$ 105120206 105070305 105025315 104963481 105010605 105067706 105088615 105113745 105138445 105140173 105075669 105000603 105022025
3840.6A05022025P4983Q5890J16360J28746M3714j78694j81699Q7666J50991P5209
$$ 105022025 105097008 105182898 105299258 105428004 105471718 105293024 105111325 105198991 105349982 105425191
3861A05425191M53J478M7541j5879p2205j0121M5586O6495j2911o3669j6344j5318
$$ 105425191 105425644 105427122 105474663 105458784 105386579 105376458 105422044 105488539 105475628 105411959 105395615 105380297
3885.5A05380297M3463N7638l4344q202O5101L2520l7170o8009n3048K2400R2065P1323
$$ 105380297 105423760 105481398 105447054 105438852 105503953 105536473 105499303 105431294 105378246 105400646 105492711 105564034
3909.9A05564034K8348R382k8324l7074M17R596n090O378K0253p236k1612J0418K6048
$$ 105564034 105592382 105601764 105573440 105536366 105536783 105546379 105541289 105547667 105567920 105560684 105539072 105549490 105575538
3936.4A05575538J4507j764j9765j3244K670p426j5593N436K2042N591j2815j4591
$$ 105575538 105590045 105588281 105568516 105555272 105557942 105550516 105534923 105540359 105562401 105567992 105555177 105540586
3960.9A05540586k659J3793K217k2912j9550L016J5378Q22k1601k0611q237l457j1003
$$ 105540586 105537927 105551720 105553937 105531025 105511475 105514491 105529869 105530691 105509090 105488479 105480242 105476785 105465782
3987.4A05465782j6582j0205q487j0860o736
$$ 105465782 105449200 105438995 105430508 105419648 105412912
3997.6A05412912
$$ 105412912
##END=$$ End of the data block
