##TITLE=Si-3-Pi $$ Begin of the data block
##JCAMP-DX=5.00 $$ ACD/SpecManager v 10.08
##SPECTROMETER/DATA SYSTEM=Alpha
##DATE=16 Dec 2016 08:03:44
##DATA TYPE=INFRARED SPECTRUM
##DATA CLASS=XYDATA
##ORIGIN=
##OWNER=
##NPOINTS=1765
##FIRSTX=399.77209473
##LASTX=3997.72216797
##MAXX=3997.72216797
##MINX=399.77209473
##MAXY=0.78302163
##MINY=0.49755019
##XFACTOR=1.0000000000
##YFACTOR=1.000000000000000e-9
##FIRSTY=0.59728831
##DELTAX=2.03965425
##XUNITS=1/CM
##YUNITS=ARBITRARY UNITS
##XYDATA=(X++(Y..Y))
$$ plain form
399.8 597288311 598171175 598554790 598480344 598073721 597905278 597843707 597670317 597260118 596582353 596244514
420.2 596244514 595847428 595305383 594829738 594332457 594014704 593775332 593647540 593352079 592939734 592594206
440.6 592594206 591946244 591394186 590880573 590431809 590189159 589736342 589315236 588796496 588389933 588400245
461 588400245 588445008 588848948 589577258 590671301 592276633 594195843 596877575 600192487 604206085
479.3 604206085 608964801 614165902 620224953 626848400 634081304 642032743 650218964 658679366
495.6 658679366 666892111 674527109 681459308 687304020 692060173 695495367 698001564 699914098
512 699914098 701270044 702353835 702858210 703078687 703046799 702574909 702027678 701032400 699733615 698298097
532.3 698298097 696660995 695139170 693535745 692061186 690664649 689073801 687605202 686162770
$$ packed form
399.8E97288311Q82864L83615p4446m06623j68443o1571j73390m10199o77765l37839
420.2E96244514l97086n42045m75645m97281l17753k39372j27792k95461m12345l45528
440.6E92594206o47962n52058n13613m48764k42650m52817m21106n18740m06563J0312
461E88400245M4763M03940P28310J094043J605332J919210K681732L314912M013598
479.3F04206085M758716N201101O059051O623447P232904P951439Q186221Q460402
495.6F58679366Q212745P634998O932199N844712M756153L435194K506197J912534
512F99914098J355946J083791N04375K20477l1888m71890n47231r95278j298785j435518
532.3F98298097j637102j521825j603425j474559j396537j590848j468599j442432
$$ plain form
548.7 686162770 684980333 684029818 683032036 682267427 681621432 681303799 681234539 681112528 681284964 681588829
569.1 681588829 682037532 682671070 683389306 684344411 685282767 686380327 687682390 689011037 690499961
587.4 690499961 691845834 693266511 694840848 696281910 697880566 699515998 701128721 702706873
603.7 702706873 704152346 705725491 707249701 708655894 709790111 710482478 711302042 712269902 713109553
622.1 713109553 713579655 713467300 712996900 711946607 710245371 707995415 705174923 702345252 699839354
640.5 699839354 698038459 697213411 697312891 698633790 700677335 702772141 704623699 705701232 706025302
658.8 706025302 705537498 704319000 702449083 698721409 694348335 692188680 690095365 687074482 683568001
677.2 683568001 680110455 676827967 673765421 671133876 668745041 666758478 665153265 663964033
$$ packed form
548.7F86162770j182437r50515r97782p64609o45995l17633o9260j22011J72436L03865
569.1F81588829M48703O33538P18236R55105R38356J097560J302063J328647J488924
587.4F90499961J345873J420677J574337J441062J598656J635432J612723J578152
603.7G02706873J445473J573145J524210J406193J134217O92367Q19564R67860Q39651
622.1G13109553M70102j12355m70400j050293j701236k249956k820492k829671k505898
640.5F99839354j800895q25048R9480J320899K043545K094806J851558J077533L24070
658.8G06025302m87804j218498j869917l727674m373074k159655k093315l020883l506481
677.2F83568001l457546l282488l062546k631545k388835j986563j605213j189232
$$ plain form
693.5 663964033 663575292 664081812 665802300 668714285 672390461 676601291 680932641 685360134 689758778
711.8 689758778 693741202 697252870 700115204 702598095 704810143 706416368 707546353 708196342 708487868
730.2 708487868 708511233 708115578 707394898 706240952 704856813 703515232 702227652 701253951 700455785
748.6 700455785 699727952 699097991 698413193 697859764 697369158 696860373 696371615 695761740 695209205 694645226
769 694645226 693920612 693083942 692077458 691138148 690292180 689468205 688770771 688011289 687166870 686274409
789.3 686274409 685370147 684592485 683913946 683541715 683641732 684256732 685546339 687497139 690257549
807.7 690257549 693900645 698343575 703767121 710207880 717681170 726078033 735019505 744234622
824 744234622 753315270 761775136 769061446 774766266 778960764 781660259 782962143 783021629 781833529
$$ packed form
693.5F63964033l88741N06520J720488K911985L676176M210830M331350M427493M398644
711.8F89758778L982424L511668K862334K482891K212048J606225J129985O49989K91526
730.2G08487868K3365l95655p20680j153946j384139j341581j287580r73701p98166
748.6G00455785p27833o29961o84798n53429m90606n08785m88758o09875n52535n63979
769F94645226p24614q36670j006484r39310q45968q23975o97434p59482q44419q92461
789.3F86274409r04262p77662o78539l72231J00017O15000J289607J950800K760410
807.7F90257549L643096M442930N423546O440759P473290Q396863Q941472R215117
824G44234622R080648Q459866P286310N704820M194498K699495J301884N9486j188100
$$ plain form
842.4 781833529 779476404 775928855 771300614 765810668 759736419 753736496 748283207 743684232
858.7 743684232 740295947 738272905 737887740 739166200 741592050 744214118 745949686 746448934 745826006
877.1 745826006 744369984 742498040 740295529 737877309 735274136 732359469 729285002 726122141
893.4 726122141 722885251 719521642 715903044 712158144 708378136 704865754 702073157 700175464
909.7 700175464 699355423 699531376 700367570 701382935 701999724 702062368 701546490 700548410 699266255 697678089
930.1 697678089 695910752 693984985 691883743 689737201 687437713 685014904 682534993 680016279
946.4 680016279 677577376 675079882 672526538 669986904 667375207 664734066 661996603 659238279
962.7 659238279 656603932 654160261 652155519 650425494 648515940 646003664 642537653 638230622
$$ packed form
842.4G81833529k357125l547549m628241n489946o074249n999923n453289m598975
858.7G43684232l388285k023042l85165J278460K425850K622068J735568M99248o22928
877.1G45826006j456022j871944k202511k418220k603173k914667l074467l162861
893.4G26122141l236890l363609l618598l744900l780008l512382k792597j897693
909.7G00175464q20041J75953Q36194J015365O16789O2644n15878r98080j282155j588166
930.1F97678089j767337j925767k101242k146542k299488k422809k479911k518714
946.4F80016279k438903k497494k553344k539634k611697k641141k737463k758324
962.7F59238279k634347k443671k004742j730025j909554k512276l466011m307031
$$ plain form
979 638230622 633238196 627786696 622256577 616876662 612007558 607843280 604419351 601724267 599418879
997.4 599418879 597261488 594968736 592263460 589219987 585888147 582396328 578831971 575196922
1013.7 575196922 571658254 568258107 565078974 562192976 559538722 557173967 555022001 553060114
1030 553060114 551358640 549882054 548742712 547922194 547381341 547154665 547116995 547289848 547665119 548162758
1050.4 548162758 548770785 549360275 549901187 550342619 550601065 550721705 550664485 550549924 550469160 550322056
1070.8 550322056 550152183 549932480 549680054 549456954 549233615 549079537 548958838 548855245 548815906 548754156
1091.2 548754156 548721731 548740864 548787355 548891008 548929453 548877418 548727036 548475981 548219264 547956169
1111.6 547956169 547784448 547730565 547690153 547683179 547673285 547658324 547656417 547714829 548100889 548764229 549421370
$$ packed form
979F38230622m992426n451500n530119n379915m869104m164278l423929k695084k305388
997.4E99418879k157391k292752k705276l043473l331840l491819l564357l635049
1013.7E75196922l538668l400147l179133k885998k654254k364755k151966j961887
1030E53060114j701474j476586j139342q20518n40853k26676l7670J72853L75271M97639
1050.4E48162758O08027N89490N40912M41432K58446J20640n7220j14561q0764j47104
1070.8E50322056j69873k19703k52426k23100k23339j54078j20699j03593l9339o1750
1091.2E48754156l2425J9133M6491J03653L8445n2035j50382k51055k56717k63095
1111.6E47956169j71721n3883m0412o974r894j4961j907N8412L86060O63340O57141
$$ plain form
1134.1 549421370 550046086 550709009 551532388 552515268 553596675 554820657 556165278 557657838 559276760
1152.4 559276760 560908020 562505543 563929141 565094411 566008687 566716909 567450106 568393767 569691002
1170.8 569691002 571383238 573302209 575348198 577354133 579131126 580589056 581588566 582183301 582539976
1189.1 582539976 582856774 583424091 584290504 585427105 586808681 588315487 589918196 591555238 593241036
1207.5 593241036 595035136 596906841 598923087 601054847 603289664 605697393 608187616 610763729
1223.8 610763729 613395751 615938008 618241489 619989514 621013820 621342897 621216834 621159613 621484697
1242.2 621484697 622311175 623567402 625037253 626696706 628492534 630437732 632597208 634810686
1258.5 634810686 636844397 638170123 638170779 636694968 634212554 631799877 630372107 630359650 631845355
$$ packed form
1134.1E49421370O24716O62923Q23379R82880J081407J223982J344621J492560J618922
1152.4E59276760J631260J597523J423598J165270R14276P08222P33197R43661J297235
1170.8E69691002J692236J918971K045989K005935J776993J457930R99510N94735L56675
1189.1E82539976L16798N67317Q66413J136601J381576J506806J602709J637042J685798
1207.5E93241036J794100J871705K016246K131760K234817K407729K490223K576113
1223.8F10763729K632022K542257K303481J748025J024306L29077j26063n7221L25084
1242.2F21484697Q26478J256227J469851J659453J795828J945198K159476K213478
1258.5F34810686K033711J325726O56j475811k482414k412677j427770j2457J485705
$$ plain form
1276.8 631845355 634440005 637676656 641109467 644383430 647394717 650005281 652204275 654049456
1293.1 654049456 655512631 656690955 657622218 658367157 658928514 659002006 658296704 656712949 654662549
1311.5 654662549 653069019 652759075 654034674 656487286 659378648 662187219 664679766 666887879
1327.8 666887879 668842733 670529544 671958029 672992229 673693717 674301922 674797833 674969137 674655497
1346.2 674655497 674075365 673739910 674041629 675118864 676776767 678606570 680308580 681823313 683192849
1364.5 683192849 684294164 685141087 685879171 686475217 687072098 687759876 688158095 687860906 687236369
1382.9 687236369 687501729 689129829 691080272 692366838 692958474 693211973 693320096 693117440 692561805
1401.2 692561805 691597581 690357745 689267397 688383400 687801778 687831104 688481629 689764798 691968024
$$ packed form
1276.8F31845355K594650L236651L432811L273963L011287K610564K198994J845181
1293.1F54049456J463175J178324R31263P44939N61357P3492p05302j583755k050400
1311.5F54662549j593530l09944J275599K452612K891362K808571K492547K208113
1327.8F66887879J954854J686811J428485J034200P01488O08205M95911J71304l13640
1346.2F74655497n80132l35455L01719J077235J657903J829803J702010J514733J369536
1364.5F83192849J101315Q46923P38084N96046N96881O87778L98219k97189o24537
1382.9F87236369K65360J628100J950443J286566N91636K53499J08123k02656n55635
1401.2F92561805r64224j239836j090348q83997n81622K9326O50525J283169K203226
$$ plain form
1419.6 691968024 694560111 696894944 698894739 700267673 700481117 698947668 695392191 690163612
1435.9 690163612 685847938 684249640 683884501 683913648 684581757 686247885 688553929 690442502 691067874
1454.3 691067874 690190971 689418435 690185010 691688180 693737447 696306586 698655665 700365901 701714456
1472.6 701714456 703025460 704155385 705001950 705670297 706355751 707147539 707988858 709046543 710583448
1491 710583448 712007582 712585032 712132275 710768282 708686888 706109881 703348517 702203691 704005957
1509.4 704005957 706938326 709801972 712199152 714175582 715670228 716943800 718280971 719447196
1525.7 719447196 720488489 721386015 721940160 722418964 722967386 723034799 722763538 723193526 724098146 724910080
1546.1 724910080 725394011 725568295 725622356 725502253 724996567 724236786 724557102 725554705 726003170 725950599
$$ packed form
1419.6F91968024K592087K334833J999795J372934K13444j533449l555477n228579
1435.9F90163612m315674j598298l65139K9147O68109J666128K306044J888573O25372
1454.3F91067874q76903p72536P66575J503170K049267K569139K349079J710236J348555
1472.6G01714456J311004J129925Q46565O68347O85454P91788Q41319J057685J536905
1491G10583448J424134N77450m52757j363993k081394k577007k761364j144826J802266
1509.4G04005957K932369K863646K397180J976430J494646J273572J337171J166225
1525.7G19447196J041293Q97526N54145M78804N48422O7413k71261M29988R04620Q11934
1546.1G24910080M83931J74284N4061j20103n05686p59781L20316R97603M48465n2571
$$ plain form
1566.5 725950599 725588441 725298703 725185215 724676192 723948658 723600388 723154724 722246230 720960319
1584.8 720960319 719271302 717122197 714660823 712284207 710225046 708358228 706340790 703929365
1601.1 703929365 701195002 698251188 695050776 691587269 688033760 684454560 680495799 676660597
1617.5 676660597 674126744 672003269 669622660 667415440 665233970 663055062 661337674 660245180
1633.8 660245180 660517454 662760139 666012466 669621110 673296154 677535355 682472944 686548471
1650.1 686548471 690312922 695534885 700317800 703972876 707258821 710542977 713796318 716469467
1666.4 716469467 718684435 721048534 723320782 725332081 727418423 729282677 730586708 731437027
1682.7 731437027 732693493 734501958 735981882 737162471 737960339 738313437 738681078 739235699 740279496
$$ packed form
1566.5G25950599l62158k89738j13488n09023p27534l48270m45664r08494j285911
1584.8G20960319j689017k149105k461374k376616k059161j866818k017438k411425
1601.1G03929365k734363k943814l200412l463507l553509l579200l958761l835202
1617.5F76660597k533853k123475k380609k207220k181470k178908j717388j092494
1633.8F60245180K72274K242685L252327L608644L675044M239201M937589M075527
1650.1F86548471L764451N221963M782915L655076L285945L284156L253341K673149
1666.4G16469467K214968K364099K272248K011299K086342J864254J304031Q50319
1682.7G31437027J256466J808465J479924J180589P97868L53098L67641N54621J043797
$$ plain form
1701.1 740279496 741544485 742443740 743316710 744191587 744791090 745069325 745078623 745340526 746292710 747300625
1721.5 747300625 747964740 748446643 748791397 748981714 748943090 748946369 749564230 750212073 750556946 750919163
1741.9 750919163 751299322 751537561 751625359 751766801 752230465 752721727 752947569 753107667 753252566 753432512
1762.3 753432512 753756344 753930628 753872991 753745019 753780961 754204035 754646540 754831254 754932821 755063713
1782.7 755063713 755189300 755351841 755375266 755168200 755179226 755532444 755782247 755796134 755838811 756063461
1803.1 756063461 756277502 756340325 756295621 756305635 756435812 756525993 756534278 756540835 756518781 756432295 756368458
1825.5 756368458 756326973 756292939 756477058 756759882 756871521 756924212 756989002 756862879 756678820 756831050
1845.9 756831050 757146895 757371366 757512569 757647455 757788181 757878721 757951856 758040488 758113027 758040428
$$ packed form
1701.1G40279496J264989Q99255Q72970Q74877N99503K78235R298K61903R52184J007915
1721.5G47300625O64115M81903L44754J90317l8624L279O17861O47843L44873L62217
1741.9G50919163L80159K38239Q7798J41442M63664M91262K25842J60098J44899J79946
1762.3G53432512L23832J74284n7637j27972L5942M23074M42505J84714J01567J30892
1782.7G55063713J25587J62541K3425k07066J1026L53218K49803J3887M2677K24650
1803.1G56063461K14041O2823m4704J0014J30177R0181Q285O557k2054q6486o3837
1825.5G56368458m1485l4034J84119K82824J11639N2691O4790j26123j84059J52230
1845.9G56831050L15845K24471J41203J34886J40726R0540P3135Q8632P2539p2599
$$ plain form
1866.3 758040428 757928312 758128703 758495867 758739412 758869648 758938313 758996129 759061038 759138882 759187937
1886.7 759187937 759170711 759256244 759411991 759506285 759612799 759694040 759729445 759775400 759815514 759837449 759855092
1909.1 759855092 759920478 759995878 759960532 759877145 759881496 759930551 759995222 760095298 760198534 760262728 760280311
1931.6 760280311 760296106 760329604 760371685 760322392 760197103 760212541 760331869 760426164 760489285 760518014 760554016
1954 760554016 760592461 760642111 760707796 760743082 760774076 760801136 760876775 761017859 761103630 761155605 761223078 761306107
1978.5 761306107 761394978 761434138 761476934 761539519 761563599 761590660 761670470 761816621 761960208 762062073 762181938
2000.9 762181938 762306154 762427151 762538135 762617350 762711465 762787223 762820125 762842298 762783647 762584805 762158573
2023.3 762158573 761779606 762071967 762803555 763309181 763540506 763695240 763841569 763928950 764000475 764111042
$$ packed form
1866.3G58040428j12116K00391L67164K43545J30236O8665N7816O4909P7844M9055
1886.7G59187937j7226Q5533J55747R4294J06514Q1241L5405M5955M0114K1935J7643
1909.1G59855092O5386P5400l5346q3387M351M9055O4671J00076J03236O4194J7583
1931.6G60280311J5795L3498M2081m9293j25289J5438J19328R4295O3121K8729L6002
1954G60554016L8445M9650O5685L5286L0994K7060P5639J41084Q5771N1975O7473Q3029
1978.5G61306107Q8871L9160M2796O2585K4080K7061P9810J46151J43587J01865J19865
2000.9G62181938J24216J20997J10984P9215R4115P5758L2902K2173n8651j98842m26232
2023.3G62158573l78967K92361P31588N05626K31325J54734J46329Q7381P1525J10567
$$ plain form
2043.7 764111042 764207184 764291644 764371097 764464438 764566839 764642417 764730215 764823139 764900744 764988482 765071988
2066.2 765071988 765145123 765194476 765235364 765302718 765385568 765496373 765610039 765714705 765857041 766007543
2086.6 766007543 766136646 766261041 766409099 766588032 766744137 766879499 767030239 767193794 767379999 767564058
2107 767564058 767736614 767902672 768047750 768208385 768381476 768538058 768699050 768865347 769015789 769132733
2127.4 769132733 769244790 769385695 769531071 769676447 769814968 769936621 770072997 770219564 770364940 770510614
2147.8 770510614 770639777 770765066 770884216 770982504 771086216 771218717 771373808 771506965 771549821 771519482
2168.2 771519482 771586597 771813869 772034109 772167444 772278905 772396207 772503257 772596061 772682190 772770286
2188.6 772770286 772853673 772913694 772968173 773043633 773120403 773164570 773181021 773195922 773213506 773225844 773216844 773185968
$$ packed form
2043.7G64111042R6142Q4460P9453R3341J02401P5578Q7798R2924P7605Q7738Q3506
2066.2G65071988P3135M9353M0888O7354Q2850J10805J13666J04666J42336J50502
2086.6G66007543J29103J24395J48058J78933J56105J35362J50740J63555J86205J84059
2107G67564058J72556J66058J45078J60635J73091J56582J60992J66297J50442J16944
2127.4G69132733J12057J40905J45376TJ38521J21653J36376J46567J45376J45674
2147.8G70510614J29163J25289J19150R8288J03712J32501J55091J33157M2856l0339
2168.2G71519482O7115K27272K20240J33335J11461J17302J07050R2804Q6129Q8096
2188.6G72770286Q3387O0021N4479P5460P6770M4167J6451J4901J7584J2338r000l0876
$$ plain form
2213 773185968 773184836 773233533 773301363 773363888 773413301 773484647 773597598 773737431 773887455 774019897 774143875
2235.5 774143875 774268746 774362803 774437726 774533868 774643540 774733961 774814963 774907351 774975955 775015593 775045097
2257.9 775045097 775055945 775087595 775170028 775258899 775312722 775352895 775406301 775465548 775541842 775631309 775715113
2280.3 775715113 775781989 775769770 775676131 775574028 775452673 775296509 775099516 774845123 774574816 774312556
2300.7 774312556 774049997 773746967 773369193 772965133 772604346 772331655 772073388 771651387 771031976 770374000
2321.1 770374000 769877017 769539297 769131303 768632710 768277943 768056154 767729640 767313123 766961336 766758859
2341.5 766758859 767053127 768237948 769521892 769686520 768571854 766945601 765634060 764842868 764548063
2359.9 764548063 764714479 765269518 766164184 767336190 768621862 769876301 771099448 772325397 773543179
$$ packed form
2213G73185968j132M8697O7830O2525M9413P1346J12951J39833J50024J32442J23978
2235.5G74143875J24871R4057P4923R6142J09672R0421Q1002R2388O8604L9638K9504
2257.9G75045097J0848L1650Q2433Q8871N3823M0173N3406N9247P6294Q9467Q3804
2280.3G75715113O6876j2219r3639j02103j21355j56164j96993k54393k70307k62260
2300.7G74312556k62559l03030l77774m04060l60787k72691k58267m22001o19411o57976
2321.1G70374000m96983l37720m07994m98593l54767k21789l26514m16517l51787k02477
2341.5G66758859K94268J184821J283944J64628j114666j626253j311541p91192k94805
2359.9G64548063J66416N55039Q94666J172006J285672J254439J223147J225949J217782
$$ plain form
2378.2 773543179 774684429 775617063 776275396 776695609 776924491 777024984 777058184 777055264 777044892 777031958
2398.6 777031958 777022481 777018428 777020812 777042389 777043164 777010202 776963472 776891530 776810586 776736557 776656866 776572645
2423.1 776572645 776500583 776460469 776456475 776482105 776534617 776600301 776665568 776726067 776772738 776812613 776852667 776885331
2447.6 776885331 776917815 776932895 776908398 776877582 776868343 776870966 776869059 776861429 776844978 776827216 776824355 776804090
2472.1 776804090 776769042 776744962 776709080 776664078 776627660 776597321 776561260 776510000 776469707 776437461 776400387
2494.5 776400387 776398420 776420474 776429832 776437700 776457489 776466668 776438713 776425600 776467085 776500225 776487350 776461124
2519 776461124 776455402 776450515 776418388 776384354 776348293 776310861 776278675 776228487 776193559 776181817 776149333 776091039
2543.4 776091039 776035130 776003778 775959551 775897324 775864959 775851727 775839508 775826991 775816321 775814235 775790930 775752723
$$ packed form
2378.2G73543179J141250R32634O58333M20213K28882J00493L3200k920j0372j2934
2398.6G77031958r477m053K384K1577P75l2962m6730p1942q0944p4029p9691q4221
2423.1G76572645p2062m0114l994K5630N2512O5684O5267O0499M6671L9875M0054L2664
2447.6G76885331L2484J5080k4497l0816r239K623j907p630j6451j7762k861k0265
2472.1G76804090l5048k4080l5882m5002l6418l0339l6061n1260m0293l2246l7074
2494.5G76400387j967K2054R358P868J9789R179k7955j3113M1485L3140j2875k6226
2519G76461124n722m887l2127l4034l6061l7432l2186n0188l4928j1742l2484n8294
2543.4G76091039n5909l1352m4227o2227l2365j3232j2219j2517j0670k086k3305l8207
$$ plain form
2567.9 775752723 775732279 775706172 775655448 775593936 775543988 775505006 775466621 775439382 775420129 775407970 775395513
2590.3 775395513 775365710 775337338 775306165 775266945 775240779 775209367 775157750 775096416 775047064 775018811 774979055
2612.8 774979055 774930477 774884403 774830997 774794161 774764359 774708927 774644732 774581075 774500430 774419665 774374664
2635.2 774374664 774343014 774286091 774224401 774173200 774102509 773994267 773878992 773796737 773739040 773670614 773599148
2657.7 773599148 773552060 773507893 773442030 773355246 773237109 773090065 772933722 772778988 772617221 772440732
2678 772440732 772251308 772066176 771952689 771927893 771928608 771936357 771966040 772006154 772037208 772038460 771987677 771877587
2702.5 771877587 771731138 771596372 771461964 771276534 771088421 770985484 770972311 770995259 771022022 771049976
2722.9 771049976 771064699 771048069 770993710 770916283 770832121 770731032 770607948 770455301 770262599 770078242
$$ packed form
2567.9G75752723k0444k6107n0724o1512m9948l8982l8385k7239j9253j2159j2457
2590.3G75395513k9803k8372l1173l9220k6166l1412n1617o1334m9352k8253l9756
2612.8G74979055m8578m6074n3406l6836k9802n5432o4195o3657q0645q0765m5001
2635.2G74374664l1650n6923o1690n1201p0691j08242j15275q2255n7697o8426p1466
2657.7G73599148m7088m4167o5863q6784j18137j47044j56343j54734j61767j76489
2678G72440732j89424j85132j13487k4796P15P749K9683M0114L1054J252n0783j10090
2702.5G71877587j46449j34766j34408j85430j88113j02937j3173K2948K6763K7954
2722.9G71049976J4723j6630n4359p7427q4162j01089j23084j52647j92702j84357
$$ plain form
2743.3 770078242 769933641 769784391 769599497 769404054 769234776 769103467 768999219 768909037 768828750 768778682
2763.7 768778682 768745840 768666089 768526495 768374085 768221378 768012702 767704248 767311394 766859174 766381741
2784.1 766381741 765920877 765470028 764974594 764413893 763851583 763359189 762909710 762468338 762091339 761830389
2804.5 761830389 761708200 761704206 761721969 761689246 761626422 761593282 761587977 761545122 761414647 761182129 760854125
2826.9 760854125 760425270 759869933 759141147 758216739 757096648 755632281 753738463 751624405 749445021
2845.3 749445021 747188210 744962096 743096471 741867185 741232336 740963697 740732431 740212023 739314854
2863.6 739314854 738101900 736625969 734955430 733184397 731381714 729675114 728287935 727218390
2880 727218390 726187646 724933743 723361194 721606374 719888091 718372703 717210412 716411054 715876520
$$ packed form
2743.3G70078242j44601j49250j84894j95443j69278j31309j04248r0182q0287n0068
2763.7G68778682l2842p9751j39594j52410j52707k08676l08454l92854m52220m77433
2784.1G66381741m60864m50849m95434n60701n62310m92394m49479m41372l76999k60950
2804.5G61830389j22189l994J7763l2723o2824l3140n305m2855j30475k32518l28004
2826.9G60854125m28855n55337p28786r24408j120091j464367j893818k114058k179384
2845.3G49445021k256811k226114j865625j229286o34849k68639k31266n20408q97169
2863.6G39314854j212954j475931j670539j771033j802683j706600j387179j069545
2880G27218390j030744j253903j572549j754820j718283j515388j162291p99358n34534
$$ plain form
2898.3 715876520 715532899 715223312 714765906 714066625 713141680 712088346 710924149 709623873 708250761
2916.7 708250761 706939459 705780923 704788268 703978002 703307509 702589750 701617956 700405300 699239552
2935 699239552 698374450 697895527 697885454 698229015 698519170 698358953 697560668 696167588 694297671 692288637
2955.4 692288637 690794110 690326095 690994203 692522883 694493175 696614504 698664725 700532973 702210784
2973.8 702210784 703738213 705253184 706740201 708003938 708939552 709569871 709962785 710164666 710219502
2992.1 710219502 710208595 710267663 710495710 710904837 711493850 712212324 713000476 713868856 714744568 715451241
3012.5 715451241 715889096 716098785 716200948 716248572 716281176 716316819 716268003 716174066 716145933 716153145 716065168
3035 716065168 715852618 715703070 715643764 715440810 715034544 714570463 714174747 713823557 713390946 712891698
$$ packed form
2898.3G15876520l43621l09587m57406o99281r24945j053334j164197j300276j373112
2916.7G08250761j311302j158536r92655q10266o70493p17759r71794j212656j165748
2935F99239552q65102m78923j0073L43561K90155j60217p98285j393080j869917k009034
2955.4F92288637j494527m68015O68108J528680J970292K121329K050221J868248J677811
2973.8G02210784J527429J514971J487017J263737R35614O30319L92914K01881N4836
2992.1G10219502j0907N9068K28047M09127N89013P18474P88152Q68380Q75712P06673
3012.5G15451241M37855K09689J02163M7624L2604L5643m8816r3937k8133P212q7977
3035G16065168k12550j49548n9306k02954m06266m64081l95716l51190m32611m99248
$$ plain form
3055.4 712891698 712378025 711864591 711414933 711023748 710657179 710233748 709698915 709198594 708841860 708638012
3075.8 708638012 708499074 708210707 707777083 707337260 706876457 706398368 705929697 705420375 704883575 704456747
3096.2 704456747 704171300 703856409 703447282 703057885 702764273 702492177 702096462 701666594 701374412 701097608
3116.6 701097608 700648844 699966967 699160576 698453307 697896183 697389007 696817815 696162105 695545852 695041299
3136.9 695041299 694519460 693800211 692948103 692159235 691475987 690914810 690438211 689813256 688977122 688124239
3157.3 688124239 687347710 686594129 685820460 685029089 684211552 683383107 682553411 681684196 680770636 679842830
3177.7 679842830 678923488 677992702 677035332 676094413 675167561 674211681 673218429 672181129 671105027
3196.1 671105027 670016229 668945432 667909384 666899145 665917397 664929390 663896978 662858486 661829352
$$ packed form
3055.4G12891698n13673n13434m49658l91185l66569m23431n34833n00321l56734k03848
3075.8G08638012j38938k88367m33624m39823m60803m78089m68671n09322n36800m26828
3096.2G04456747k85447l14891m09127l89397k93612k72096l95715m29868k92182k76804
3116.6G01097608m48764o81877q06391p07269n57124n07176n71192o55710o16253n04553
3136.9F95041299n21839p19249q52108p88868o83248n61177m76599o24955q36134q52883
3157.3F88124239p76529p53581p73669p91371q17537q28445q29696q69215r13560r27806
3177.7F79842830r19342r30786r57370r40919r26852r55880r93252j037300j076102
3196.1F71105027j088798j070797j036048j010239r81748r88007j032412j038492j029134
$$ plain form
3214.4 661829352 660782278 659706712 658623457 657560110 656496108 655436456 654432893 653517127
3230.8 653517127 652632475 651597977 650430143 649336278 648342967 647419691 646550715 645653844 644684613
3249.1 644684613 643723190 642893136 642159700 641385853 640554249 639740586 638996065 638312578 637702227 637168407
3269.5 637168407 636534274 635695100 634785712 633902311 633043706 632181346 631321132 630462110 629566789 628680825
3289.9 628680825 627770960 626713336 625507355 624209523 622915089 621745944 620683730 619482696
3306.2 619482696 617911637 616078734 614234507 612449527 610677481 608880937 607043803 605198681
3322.5 605198681 603326023 601270854 599014461 596749365 594550431 592374623 590216696 587936699
3338.9 587936699 585422456 582794309 580110073 577450156 574909151 572243333 569261432 566176236
$$ packed form
3214.4F61829352j047074j075566j083255j063347j064002j059652j003563r15766
3230.8F53517127q84652j034498j167834j093865r93311r23276q68976q96871r69231
3249.1F44684613r61423q30054p33436p73847q31604q13663p44521o83487o10351n33820
3269.5F37168407o34133q39174r09388q83401q58605q62360q60214q59022q95321q85964
3289.9F28680825r09865j057624j205981j297832j294434j169145j062214j201034
3306.2F19482696j571059j832903j844227j784980j772046j796544j837134j845122
3322.5F05198681j872658k055169k256393k265096k198934k175808k157927k279997
3338.9E87936699k514243k628147k684236k659917k541005k665818k981901l085196
$$ plain form
3355.2 566176236 563214362 560341656 557407081 554445744 551647127 548963785 546106637 542988479
3371.5 542988479 539894462 537074864 534482121 532006264 529611409 527335525 525239468 523372412
3387.8 523372412 521742105 520090103 518175960 516280293 514776707 513479471 511888921 510028958
3404.1 510028958 508381665 507051229 505806446 504517496 503197670 501968145 500935733 500059962
3420.4 500059962 499284595 498656631 498218775 497921377 497672886 497550189 497628093 497696370 497617751 497610182
3440.8 497610182 497882187 498397142 499065250 499815375 500633776 501569331 502614617 503763199 505000412
3459.2 505000412 506230474 507554173 509163499 510893106 512330711 513422132 514581382 516029000
3475.5 516029000 517666757 519280374 520716190 522152603 523764968 525405169 527002871 528659046
$$ packed form
3355.2E66176236k961874k872706k934575k961337k798617k683342k857148l118158
3371.5E42988479l094017k819598k592743k475857k394855k275884k096057j867056
3387.8E23372412j630307j652002j914143j895667j503586j297236j590550j859963
3404.1E10028958j647293j330436j244783j288950j319826j229525j032412q75771
3420.4E00059962p75367o27964m37856k97398k48491j22697P7904O8277p8619p569
3440.8D97610182K72005N14955O68108P50125Q18401R35555J045286J148582J237213
3459.2E05000412J230062J323699J609326J729607J437605J091421J159250J447618
3475.5E16029000J637757J613617J435816J436413J612365J640201J597702J656175
$$ plain form
3491.8 528659046 530353904 532046199 533723116 535420001 537154555 538807988 540353000 541971207
3508.1 541971207 543791771 545763910 547691107 549429417 551112533 552923501 554874003 556767702
3524.5 556767702 558507800 560296059 562218964 564182580 566192389 568192244 570073485 571943641
3540.8 571943641 573883474 575806260 577639401 579437613 581307054 583269596 585233688 587151170
3557.1 587151170 589112878 591111541 592940271 594709218 596982002 599648893 602074206 604287744
3573.4 604287744 606570542 608970821 611511528 614128768 616573811 618838370 621397793 624298692
3589.7 624298692 626995385 629568875 632335424 635225534 638115823 640969694 643630624 646033943
3606 646033943 648555934 651327431 654080391 656762600 659191012 661591113 664396644 667052805 669039547
$$ packed form
3491.8E28659046J694858J692295J676917J696885J734554J653433J545012J618207
3508.1E41971207J820564J972139J927197J738310J683116J810968J950502J893699
3524.5E56767702J740098J788259J922905J963616K009809J999855J881241J870156
3540.8E71943641J939833J922786J833141J798212J869441J962542J964092J917482
3557.1E87151170J961708J998663J828730J768947K272784K666891K425313K213538
3573.4F04287744K282798K400279K540707K617240K445043K264559K559423K900899
3589.7F24298692K696693K573490K766549K890110K890289K853871K660930K403319
3606F46033943K521991K771497K752960K682209K428412K400101K805531K656161J986742
$$ plain form
3624.4 669039547 670502365 672431111 675282955 677867353 680036724 682101786 684047043 685932517
3640.7 685932517 687646449 688939035 689995706 691697121 694179893 696194172 697694480 699604869
3657 699604869 701709211 703402698 704810917 706043243 706996977 708073437 709495485 710480213 711541831
3675.4 711541831 713376343 715138197 716630459 717929602 718928993 719932854 721320450 722885191
3691.7 722885191 724304497 725481570 726345360 726972699 727773130 728792012 729492545 729741514 729955733
3710.1 729955733 730753720 731874824 732548952 732756853 732795537 732866466 733048737 733406425 733777940 733858645
3730.5 733858645 733742118 733842671 734463096 735168576 735138357 734498680 734446645 734913468 734879076 734987140
3750.9 734987140 735731423 736281872 736372352 736483693 736793756 736913800 736845553 736790836 736865640 737198949
$$ packed form
3624.4F69039547J462818J928746K851844K584398K169371K065062J945257J885474
3640.7F85932517J713932J292586J056671J701415K482772K014279J500308J910389
3657F99604869K104342J693487J408219J232326R53734J076460J422048R84728J061618
3675.4G11541831J834512J761854J492262J299143R99391J003861J387596J564741
3691.7G22885191J419306J177073Q63790O27339Q00431J018882P00533K48969K14219
3710.1G29955733P97987J121104O74128K07901L8684P0929J82271L57688L71515Q0705
3730.5G33858645j16527J00553O20425P05480l0219o39677n2035M66823l4392J08064
3750.9G34987140P44283N50449R0480J11341L10063J20044o8247n4717P4804L33309
$$ plain form
3771.2 737198949 737488508 737500906 737410545 737448037 737555027 737553716 737587690 737712979 737788916 737748086 737523377
3793.7 737523377 737272263 737028062 736621499 736537635 736715496 736699343 736913919 737253964 737212121 736809075
3814.1 736809075 736528456 736376405 736198723 736498892 736869156 736924887 736888647 736749589 736591876 736411929
3834.5 736411929 736139953 736037493 736194730 736482263 736827135 736964703 736596882 735599935 734792531 735382438
3854.9 735382438 736217022 736379504 736129403 735864580 735856712 735752523 735492349 735549688 735777140 735999703
3875.3 735999703 735992312 735726893 735673189 735693634 735732079 735830843 735682487 735611141 735823035 735817015 735445082
3897.7 735445082 735045135 734861076 734991908 735431373 735814869 735894740 735772431 735564232 735380352 735335648
3918.1 735335648 735387564 735407054 735406876 735451818 735439777 735349596 735346973 735444784 735490739 735420883 735272288 735169828
$$ packed form
3771.2G37198949K89559J2398r0361L7492J06990j311L3974J25289P5937m0830k24709
3793.7G37523377k51114k44201m06563q3864J77861j6153K14576L40045m1843m03046
3814.1G36809075k80619j52051j77682L00169L70264N5731l6240j39058j57713j79947
3834.5G36411929k71976j02460J57237K87533L44872J37568l67821r96947q07404N89907
3854.9G35382438Q34584J62482k50101k64823p868j04189k60174N7339K27452K22563
3875.3G35999703p391k65419n3704K0445L8445R8764j48356p1346K11894o020l71933
3897.7G35445082l99947j84059J30832M39465L83496P9871j22309k08199j83880m4704
3918.1G35335648N1916J9490j78M4942j2041r0181k623R7811M5955o9856j48595j02460
$$ plain form
3942.6 735169828 735149562 735127091 735124648 735167503 735213220 735236585 735235453 735198498 735151649 735149860 735165358 735172212
3967 735172212 735151887 735076189 734999657 734963477 734942496 734929204 734941304 734968305 734965861 734962225 734970450 734915197
3991.5 734915197 734844148 734813988 734762728
3997.6 734762728
$$ packed form
3942.6G35169828k0266k2471k443M2855M5717K3365j132l6955m6849j789J5498O854
3967G35172212k0325p5698p6532l6180k0981j3292J2100K7001k444l636Q225n5253
3991.5G34915197p1049l0160n1260
3997.6G34762728
##END=$$ End of the data block
