##TITLE=Sarita 3 $$ Begin of the data block
##JCAMP-DX=5.00 $$ ACD/SpecManager v 10.08
##SPECTROMETER/DATA SYSTEM=Alpha
##DATE=16 Sep 2014 08:23:38
##DATA TYPE=INFRARED SPECTRUM
##DATA CLASS=XYDATA
##ORIGIN=
##OWNER=
##NPOINTS=1765
##FIRSTX=399.76428223
##LASTX=3997.64306641
##MAXX=3997.64306641
##MINX=399.76428223
##MAXY=0.83617604
##MINY=0.48795241
##XFACTOR=1.0000000000
##YFACTOR=1.000000000000000e-9
##FIRSTY=0.75957412
##DELTAX=2.03961372
##XUNITS=1/CM
##YUNITS=ARBITRARY UNITS
##XYDATA=(X++(Y..Y))
$$ plain form
399.8 759574115 762845278 760523915 758492708 763159335 771733820 775556087 772626519 769392073
416.1 769392073 772305369 779577017 781408966 777665257 776254296 780777872 785881341 785081446 780021787
434.4 780021787 778702915 783580899 787779570 785457611 780149579 779911876 785398185 789061069 785933256
452.8 785933256 780582666 780734003 786469340 789207101 785253167 780344069 781197608 785996735 786755621
471.2 786755621 781219721 776516914 777889192 781536400 780169368 772683382 765597582 763087511
487.5 763087511 760038853 749259472 732012331 717538655 713776231 720968306 732244849 741921842
503.8 741921842 753106475 769013345 782957911 787567556 785206437 783960402 787355304 790685058
520.1 790685058 788635433 783140540 780908227 783889949 786069095 782287896 775017262 770201623
$$ packed form
399.8G59574115L271163k321363k031207M666627Q574485L822267k929568l234446
416.1G69392073K913296P271648J831949l743709j410961M523576N103469p99895n059659
434.4G80021787j318872M877984M198671k321959n308032k37703N486309L662884l127813
452.8G85933256n350590J51337N735337K737761l953934m909098Q53539M799127P58886
471.2G86755621n535900m702807J372278L647208j367032p485986p085800k510071
487.5G63087511l048658j0779381j7247141j4473676l762424P192075J1276543R676993
503.8G41921842J1184633J5906870J3944566M609645k361119j246035L394902L329754
520.1G90685058k049625n494893k232313K981722K179146l781199p270634m815639
$$ plain form
536.4 770201623 768148661 762339830 748041868 728464663 710608542 697531402 687897563 682626128
552.7 682626128 686354160 701090753 722155273 741374314 753403485 759932280 766460419 774618268
569.1 774618268 780366957 780763686 778907895 780013323 784497142 787530601 785834789 782398224 782297373
587.4 782297373 785369754 786772251 783858180 779466689 777738631 778337002 776949108 771377981 764793038
605.8 764793038 761123538 758836329 751742423 736969292 719854474 708566070 708919466 728012741
622.1 728012741 765656531 802781641 823101163 829121113 826167822 813734114 798227310 794770122
638.4 794770122 804430723 813367009 814306676 811008692 809884846 812293231 813931644 811693132 808154583
656.8 808154583 808054805 811685979 814378619 812538087 807185590 806128800 811517596 814679086 812718689
$$ packed form
536.4G70201623k052962n808831j4297962j9577205j7856121j3077140r633839n271435
552.7F82626128L728032J4736593K1064520J9219041J2029171O528795O528139Q157849
569.1G74618268N748689L96729j855791J105428M483819L033459j695812l436565j00851
587.4G82297373L072381J402497k914071m391491j728058N98371j387894n571127o584943
605.8G64793038l669500k287209p093906j4773131j7114818j1288404L53396J9093275
622.1G28012741L7643790L7125110K0319522O019950k953291j2433708j5506804l457188
638.4G94770122R660601Q936286R39667l297984j123846K408385J638413k238512l538549
656.8H08154583r9778L631174K692640j840532n352497j056790N388796L161490j960397
$$ plain form
675.1 812718689 808858752 808201969 811025202 812370121 808883548 803093851 799261689 796609402 789579570
693.5 789579570 776024640 762878299 762170970 778453469 800182939 812778056 815809965 817684174
709.8 817684174 821695745 824131966 821967185 817963600 817262590 820427358 822402120 819726348 815339625
728.1 815339625 814406097 817127287 818458080 815141439 810262978 808906436 811112940 811799526 807731569
746.5 807731569 801832795 798967540 799107611 797192752 789785147 779207170 769348860 758056939
762.8 758056939 736294031 698427379 655188739 633473217 651961267 694752038 729123414
777.1 729123414 744934976 754391730 766579807 778683901 785351813 787716508 790904343 796193123
793.4 796193123 799656689 798414111 795041442 794349968 797002733 798576117 795641601 790276468 786814213
$$ packed form
675.1H12718689l859937o56783K823233J344919l486573n789697l832162k652287p029832
693.5G89579570j3554930j3146341p07329J6282499K1729470J2595117L031909J874209
709.8H17684174M011571K436221k164781m003585p01010L164768J974762k675772m386723
728.1H15339625r33528K721190J330793l316641m878461j356542K206504O86586m067957
746.5H07731569n898774k865255J40071j914859p407605j0577977r858310j1291921
762.8G58056939k1762908l7866652m3238640k1715522J8488050M2790771L4371376
777.1G29123414J5811562R456754J2188077J2104094O667912K364695L187835N288780
793.4G96193123L463566j242578l372669o91474K652765J573384k934516n365133l462255
$$ plain form
811.8 786814213 786438942 786523044 784657657 782202184 782336831 785328269 787054598 783532083 776016057
830.1 776016057 768229902 759349704 743435204 717347443 689864099 677265465 683902860 699082971
846.4 699082971 715799809 735638559 758467317 779627204 793996036 799827456 800449371 801216543
862.8 801216543 803720415 804652393 801158965 795307696 791520953 790816367 789763153 785337627 779035687
881.1 779035687 774709225 773357749 772072256 768444002 764207602 763064086 765791714 769085169
897.4 769085169 769659281 768290937 768288851 770575345 772252142 770555079 766703606 764308631 764599442
915.8 764599442 764996827 762873530 759316623 757797480 759723842 762751222 764036894 764070451 765880883
934.1 765880883 770743966 776180029 779063344 779718339 781300128 785298407 789286733 790194869 788946748
$$ packed form
811.8G86814213l75271Q4102j865387k455473J34647K991438J726329l522515p516026
830.1G76016057p786155q880198j5914500k6087761k7483344j2598634O637395J5180111
846.4F99082971J6716838J9838750K2828758K1159887J4368832N831420O21915P67172
862.8H01216543K503872R31978l493428n851269l786743p04586j053214m425526o301940
881.1G79035687m326462j351476j285493l628254m236400j143516K727628L293455
897.4G69085169N74112j368344k086K286494J676797j697063l851473k394975K90811
915.8G64599442L97385k123297l556907j519143J926362L027380J285672L3557J810432
934.1G65880883M863083N436063K883315O54995J581789L998279L988326R08136j248121
$$ plain form
952.5 788946748 789183438 791632414 792816579 790101290 785987139 785416663 790367067 797709525 802051425
970.9 802051425 802070439 801544309 803408206 806156456 806602597 804534614 803053856 804354429 806721807
989.2 806721807 806892276 804601848 802929342 804091036 806418657 806535482 803865135 801282823 801099300
1007.6 801099300 802160680 801867247 799974620 798964262 800600052 803243995 803678751 801335514 799124300
1025.9 799124300 799579024 801463306 801497877 798890829 796389282 796521366 798213840 798244953 795598269
1044.3 795598269 792813361 792462409 793669105 793296874 790155411 786540389 784995496 784805000 783035576
1062.6 783035576 778683603 774187624 772332549 772786140 772841811 771275103 770002127 771271408 774277925
1081 774277925 775937855 774834096 772967398 773002684 774704158 775244653 773072481 770035326 768756986
$$ packed form
952.5G88946748K36690K448976J184165k715289m114151n70476M950404P342458M341900
970.9H02051425J9014n26130J863897K748250M46141k067983j480758J300573K367378
989.2H06721807J70469k290428j672506J161694K327621J16825k670347k582312j83523
1007.6H01099300J061380k93433j892627j010358J635790K643943M34756k343237k211214
1025.9G99124300M54724J884282L4571k607048k501547J32084J692474L1113k646684
1044.3G95598269k784908l50952J206696l72231l141463l615022j544893j90496j769424
1062.6G83035576m351973m495979j855075M53591N5671j566708j272976J269281L006517
1081G74277925J659930j103759j866698L5286J701474N40495k172172l037155j278340
$$ plain form
1099.4 768756986 769011259 768003762 764215171 759527802 756614268 755378485 753228426 748446345
1115.7 748446345 742367089 737399220 732944608 725063980 712067723 700335205 700948119 716569602
1132 716569602 735630155 746100068 748558521 749536693 750859439 749921262 745084643 738065660 731538832
1150.3 731538832 725835919 718959093 709356368 697398305 683690965 666576266 642443597 609650195
1166.7 609650195 571213961 533892930 509020388 510730803 545326054 605023623 674169838
1180.9 674169838 737854481 785628736 812953413 822995007 824016511 822238326 818469286 811744094
1197.3 811744094 803799808 798248410 796280265 795334756 792473257 787783146 783579230 780869007
1213.6 780869007 777902484 772697628 766015232 760506332 757278979 754649341 750592351 745496452
$$ packed form
1099.4G68756986K54273j007497l788591m687369k913534j235783k150059m782081
1115.7G48446345o079256m967869m454612p880628j2996257j1732518O12914J5621483
1132G16569602J9060553J0469913K458453R78172J322746r38177m836619p018983o526828
1150.3G31538832n702913o876826r602725j1958063j3707340j7114699k4132669l2793402
1166.7F09650195l8436234l7321031k4872542J710415L4595251N9697569O9146215
1180.9F74169838O3684643M7774255K7324677J0041594J021504j778185l769040o725192
1197.3H11744094p944286n551398j968145r45509k861499m690111m203916k710223
1213.6G80869007k966523n204856o682396n508900l227353k629638m056990n095899
$$ plain form
1229.9 745496452 741572857 739814341 738611519 735825062 731555641 727829218 725584447 723284245
1246.2 723284245 718925118 712628543 706344008 701120019 695699215 688250661 678789496 668972135
1262.5 668972135 659611881 649526775 637182772 622827113 608561993 596055150 584480524
1276.8 584480524 571526945 556257963 539941490 524510145 511806428 504277885 504665136 514041901
1293.1 514041901 530966997 554081976 582316279 608890891 621765852 614972234 595702827
1307.4 595702827 577445805 567714453 566679001 571297169 576346695 579151273 580792129 582540751
1323.7 582540751 587756455 602207601 627678096 658865929 688004792 709682107 720813870
1338 720813870 720896423 716196716 717057288 728865385 748629928 768872142 784042597 793628931
$$ packed form
1229.9G45496452l923595j758516j202822k786457m269421l726423k244771k300202
1246.2G23284245m359127o296575o284535n223989n420804p448554r461165r817361
1262.5F68972135r360254j0085106j2344003j4355659j4265120j2506843j1574626
1276.8E84480524j2953579j5268982j6316473j5431345j2703717p528543L87251R376765
1293.1E14041901J6925096K3114979K8234303K6574612J2874961o793618j9269407
1307.4E95702827j8257022r731352j035452M618168N049526K804578J640856J748622
1323.7E82540751N215704J4451146K5470495L1187833K9138863K1677315J1131763
1338G20813870Q2553m699707Q60572J1808097J9764543K0242214J5170455R586334
$$ plain form
1354.3 793628931 799952328 804221272 805510759 803190172 799165428 795811713 793522298 790978253
1370.6 790978253 786412776 780299723 775232255 771574914 767420292 761482120 754509687 748332739
1386.9 748332739 744054735 740265548 734645426 727684438 722345471 719508708 717421830 713601649
1403.3 713601649 707173765 699649572 691554189 681591511 668937266 654132962 637866080 622947931
1419.6 622947931 616529346 622984052 643645048 674056411 705613494 726865232 730114281 711715579
1435.9 711715579 675543427 642064095 626920462 638881862 673424065 716239154 753843367
1450.2 753843367 781080306 798884571 810330451 818961978 825358689 829188943 830299914 829210520
1466.5 829210520 827424228 825636327 824351192 823242187 821013629 818232238 816309631 815424383
$$ packed form
1354.3G93628931O323397M268944J289487k320587m024744l353715k289415k544045
1370.6G90978253m565477o113053n067468l657341m154622n938172o972433o176948
1386.9G48332739m278004l789187n620122o960988n338967k836763k086878l820181
1403.3G13601649o427884p524193q095383r962678j2654245j4804304j6266882j4918149
1419.6F22947931o418585O454706K0660996L0411363L1557083K1251738L249049j8398702
1435.9G11715579l6172152l3479332j5143633J1961400L4542203M2815089L7604213
1450.2G53843367K7236939J7804265J1445880Q631527O396711L830254J110971j089394
1466.5H29210520j786292j787901j285135j109005k228558k781391j922607q85248
$$ plain form
1482.8 815424383 813965201 810573757 806592882 804910600 804629445 802154839 796424210 790593982
1499.1 790593982 786761761 783199131 776165068 764506578 755431235 748786271 741063178 731230676
1515.4 731230676 720776618 714079559 714433193 720984280 728828192 735618412 741227746 746022224
1531.8 746022224 750006080 751528263 748842597 742546499 738220811 736988366 735018969 730669320
1548.1 730669320 724532306 718789697 713961840 708377063 699082017 689336061 684163272 678478241
1564.4 678478241 669612288 655822933 637171090 621766508 620182753 640435636 662494481 667863309
1580.7 667863309 662413836 651474595 635138452 613651812 588992298 563058794 536922693
1595 536922693 512867570 494988799 487952411 495151669 515425801 543855369 574935019 601626635
$$ packed form
1482.8H15424383j459182l391444l980875j682282k81155k474606n730629n830228
1499.1G90593982l832221l562630p034063j1658490r075343o644964p723093r832502
1515.4G31230676j0454058o697059L53634O551087P843912O790220N609334M794478
1531.8G46022224L983856J522183k685666o296098m325688j232445j969397m349649
1548.1G30669320o137014n742609m827857n584777r295046r745956n172789n685031
1564.4F78478241q865953j3789355j8651843j5404582j583755K0252883K2058845N368828
1580.7F67863309n449473j0939241j6336143k1486640k4659514k5933504k6136101
1595E36922693k4055123j7878771p036388P199258K0274132K8429568L1079650K6691616
$$ plain form
1611.3 601626635 616683900 615504801 597120106 572892427 550818741 534810603 531801462 539711595
1627.6 539711595 550691187 557559013 558743238 559660316 570194602 590388417 614200413 634236515
1643.9 634236515 645993948 647037506 638627708 616519809 580663919 556503534 541176558 528275371
1660.3 528275371 518859744 514156699 512940407 513308585 514842987 516553462 518263102 520934582
1676.6 520934582 524353385 527593613 531932235 541472614 555364370 571095169 589124322 606221795
1692.9 606221795 623536110 642025352 659876287 679395974 695242643 707589388 720622957
1707.2 720622957 733363390 744522750 753375471 760540962 769201994 779810131 788760900 795237720
1723.5 795237720 800090134 804333329 808860779 812903404 815851271 818331718 820356786 822281778
$$ packed form
1611.3F01626635J5057265j179099j8384695k4227679k2073686j6008138l009141P910133
1627.6E39711595J0979592O867826J184225R17078J0534286K0193815K3811996K0036102
1643.9F34236515J1757433J043558q409798k2107899l5855890k4160385j5326976j2901187
1660.3E28275371r415627m703045j216292L68178J534402J710475J709640K671480
1676.6E20934582L418803L240228M338622R540379J3891756J5730799J8029153J7097473
1692.9F06221795J7314315J8489242J7850935J9519687J5846669J2346745J3033569
1707.2G20622957J2740433J1159360Q852721P165491Q661032J0608137Q950769O476820
1723.5G95237720M852414M243195M527450M042625K947867K480447K025068J924992
$$ plain form
1739.8 822281778 823973238 823987126 822263360 820680797 821372211 824438512 827097118 828264058 829379201
1758.2 829379201 831392944 833827913 835176051 834459543 832837164 831994295 832185328 832465231 831782937
1776.5 831782937 830831051 831117392 832450807 833117127 832639754 831877768 831769407 833033085 834352612
1794.9 834352612 834089160 833043933 833238482 834826052 835783422 835040390 833784878 833903551 835349023
1813.2 835349023 836176038 835443616 834348738 834234715 834870696 835102618 834148943 832843781 833194613
1831.6 833194613 834859312 835686505 834928215 833580852 832789898 832983613 833630145 833314002 832216501
1850 832216501 831866622 832605481 833092213 832246780 830828130 830411613 831135452 831402242 830321312 829280317
1870.3 829280317 829651415 830923676 831739008 831128538 829718113 829122186 829826713 830439150 829615235
$$ packed form
1739.8H22281778J691460J3888j723766j582563O91414L066301K658606J166940J115143
1758.2H29379201K013743K434969J348138p16508j622379q42869J91033K79903o82294
1776.5H31782937r51886K86341J333415O66320m77373p61986j08361J263678J319527
1794.9H34352612k63452j045227J94549J587570R57370p43032j255512J18673J445472
1813.2H35349023Q27015p32422j094878j14023O35981K31922r53675j305162L50832
1831.6H33194613J664699Q27193p58290j347363p90954J93715O46532l16143j097501
1850H32216501l49879P38859M86732q45433j418650m16517P23839K66790j080930j040995
1870.3H29280317L71098J272261Q15332o10470j410425n95927P04527O12437q23915
$$ plain form
1888.7 829615235 828151822 827648938 828265488 828789890 827839673 825661719 823903441 823227108 822413325
1907.1 822413325 820642591 819190443 819458127 820947170 822341204 822924435 822926044 823462963 825131416
1925.4 825131416 826673508 826734006 825766861 825456321 826621652 828168631 828428686 827339351 826678991
1943.8 826678991 827491283 828689516 828792095 827774286 827061594 827646255 828700840 828670442 827410579
1962.1 827410579 826299608 826421022 827264965 827337682 826245844 825304270 825667500 826730907 826959908
1980.5 826959908 825926006 824826121 824835241 825509250 825393856 824176967 823149204 823289692 824069142
1998.8 824069142 824106932 822876990 821457028 821064830 821426928 821159899 819642007 817957044 817690670
2017.2 817690670 818865240 819800317 819421887 818517864 818405449 819093406 819345474 818422616 817128420
$$ packed form
1888.7H29615235j463413n02884O16550N24402r50217k177954j758278o76333q13783
1907.1H22413325j770734j452148K67684J489043J394034N83231J609N36919J668453
1925.4H25131416J542092O0498r67145l10540J165331J546979K60055j089335o60360
1943.8H26678991Q12292J198233J02579j017809p12692N84661J054585l0398j259863
1962.1H27410579j110971J21414Q43943P2717j091838r41574L63230J063407K29001
1980.5H26959908j033902j099885R120O74009j15394j216889j027763J40488P79450
1998.8H24069142L7790j229942j419962l92198L62098k67029j517892j684963k66374
2017.2H17690670J174570R35077l78430r04023j12415O87957K52068r22858j294196
$$ plain form
2035.6 817128420 816715658 817175448 817281604 816230953 814738154 814089000 814447641 814701438 814034164
2053.9 814034164 813073874 813064575 814157903 815133989 815024555 814391971 814479351 815480113 816299736 815948248
2074.3 815948248 814854085 814317107 814760745 815225959 814725041 813595474 813069403 813627362 814333320
2092.7 814333320 814110100 813185155 812760770 813345671 814003408 813579261 812270284 811363637 811495185
2111 811495185 811859190 811347961 810045660 809079468 809118032 809465587 808981180 807650983 806631744 806704164
2131.4 806704164 807232678 807057023 806059837 805301070 805583715 806335211 806337774 805397809 804578900 804727852
2151.8 804727852 805381596 805423796 804588437 803827763 804032922 804801345 804945230 804079473 803148925 803145289
2172.2 803145289 803761959 803834379 802929163 801925182 801807940 802328885 802327931 801304817 800101459 799773633
$$ packed form
2035.6H17128420m12762M59790J06156j050651j492799o49154L58641K53797o67274
2053.9H14034164r60290r299J093328R76086j09434o32584Q7380J000762Q19623l51488
2074.3H15948248j094163n36978M43638M65214n00918j129567n26071N57959P05958
2092.7H14333320k23220r24945m24385N84901O57737m24147j308977r06647J31548
2111H11495185L64005n11229j302301r66192L8564L47555m84407j330197j019239P2420
2131.4H06704164N28514j75655r97186p58767K82645P51496K563r39965q18909J48952
2151.8H04727852O53744M2200q35359p60674K05159P68423J43885q65757r30548l636
2172.2H03145289O16670P2420r05216j003981j17242N20945r54j023114j203358l27826
$$ plain form
2192.6 799773633 800193787 800240815 799300432 798068583 797606528 797902167 797892749 796951234 795779645 795490980
2213 795490980 796127915 796607018 796143174 795241177 794959188 795415521 795611858 794842422 793667793 793182909
2233.4 793182909 793601751 793962598 793413818 792380691 791931152 792270958 792463183 791709542 790439904
2251.8 790439904 789743841 789930403 790176511 789654672 788617253 788050115 788328290 788650870 788087666
2270.1 788087666 786862671 786062837 786187410 786507547 786080658 785021842 784280479 784297526 784392297 783680499
2290.5 783680499 782253861 781080425 780717731 780560195 779711664 778192043 776833057 776169956 775741696
2308.9 775741696 774686337 772963822 771406293 770458698 769601285 768179655 766384244 765024185 764384329
2327.2 764384329 763947487 763111413 761791527 760469496 759725690 759442627 758902490 758223832 758825839
$$ packed form
2192.6G99773633M20154M7028r40383j231849m62055K95639r418r41515j171589k88665
2213G95490980O36935M79103m63844r01997k81989M56333J96337p69436j174629m84884
2233.4G93182909M18842L60847n48780j033127m49539L39806J92225p53641j269638
2251.8G90439904o96063J86562K46108n21839j037419n67138K78175L22580n63204
2270.1G88087666j224995p99834J24573L20137m26889j058816p41363J7047R4771p11798
2290.5G83680499j426638j173436l62694j57536q48531j519621j358986o63101m28260
2308.9G75741696j055359j722515j557529r47595q57413j421630j795411j360059o39856
2327.2G64384329m36842q36074j319886j322031p43806k83063n40137o78658O02007
$$ plain form
2345.6 758825839 760565162 761136174 759211779 755412340 751582384 749047875 747835159 747176826 746730864
2363.9 746730864 747051597 748624980 750910521 752819657 753947735 754973173 756629169 758662879
2380.2 758662879 760127962 760497212 760206103 760046303 760164797 759973109 759048223 757794738 756991863
2398.6 756991863 756794751 756572366 755807757 754794836 754225492 754242837 754192352 753502488 752460480 751793504
2419 751793504 751731396 751708448 751098275 750061929 749300957 749047279 748733759 747759342 746276021 745010793
2439.4 745010793 744351387 743886292 743035793 741848648 740915835 740588069 740478039 739962935 739057481
2457.8 739057481 738400042 738388240 738649130 738512397 737874627 737273037 737089634 736996710 736346364 735046923
2478.1 735046923 733725071 732919395 732487619 731910408 731017530 730215788 729877591 729736745 729157031
$$ packed form
2345.6G58825839J739323N71012j924395l799439l829956k534509j212716o58333m45962
2363.9G46730864L20733J573383K285541J909136J128078J025438J655996K033710
2380.2G58662879J465083L69250k91109j59800J18494j91688r24886j253485q02875
2398.6G56991863j97112k22385p64609j012921n69344J7345n0485o89864j042008o66976
2419G51793504o2108k2948o10173j036346p60972k53678l13520r74417j483321j265228
2439.4G45010793o59406m65095q50499j187145r32813l27766j10030n15104r05454
2457.8G39057481o57439j1802K60890j36733o37770o01590j83403r2924o50346j299441
2478.1G35046923j321852q05676m31776n77211q92878q01742l38197j40846n79714
$$ plain form
2496.5 729157031 727932930 726569295 725644112 725070715 724258780 722949266 721568763 720630229 720014513
2514.9 720014513 719142199 717755735 716247261 715148032 714422464 713522911 712138474 710590422 709369421
2533.2 709369421 708455503 707371652 705854058 704250157 703188241 702859581 702820241 702648163 702538490
2551.6 702538490 702972531 704030037 705309033 706484914 707804501 709772587 712424636 715165317
2567.9 715165317 717351615 718920767 720274210 721555829 722310722 722059250 720976532 719707787 718632519
2586.2 718632519 717579782 716387749 715456843 715458274 716626406 718436778 720100880 721365631 722537041
2604.6 722537041 723755121 724611223 724613547 723826289 722849786 722087502 721294940 720049500 718431175
2623 718431175 717036843 716305196 716042697 715737820 715181470 714653552 714432061 714258075 713595867 712369084
$$ packed form
2496.5G29157031j224101j363635r25183n73397q11935j309514j380503r38534o15716
2514.9G20014513q72314j386464j508474j099229p25568q99553j384437j548052j221001
2533.2G09369421r13918j083851j517594j603901j061916l28660l9340j72078j09673
2551.6G02538490M34041J057506J278996J175881J319587J968086K652049K740681
2567.9G15165317K186298J569152J353443J281619P54893k51472j082718j268745j075268
2586.2G18632519j052737j192033r30906J431J168132J810372J664102J264751J171410
2604.6G22537041J218080Q56102K324p87258r76503p62284p92562j245440j618325
2623G18431175j394332p31647k62499l04877n56350n27918k21491j73986o62208j226783
$$ plain form
2643.4 712369084 711099088 710257947 709728360 709027767 707995594 707033873 706508100 706233442 705781996
2661.7 705781996 705058277 704402506 704176664 704344749 704537988 704565585 704734504 705474317 706791282 708367109
2682.1 708367109 710080087 712180793 714941084 718175471 721273184 723821819 725940883 727928996
2698.4 727928996 729768515 731092274 731679916 731820941 732015431 732395470 732629120 732433915 732021928
2716.8 732021928 731808186 731805563 731649816 731127322 730441928 730036855 730109990 730320632 730254591 729940295
2737.2 729940295 729672849 729548514 729299605 728650928 727689683 726716757 725868523 725004613 723913252
2755.5 723913252 722628951 721458554 720574915 719787717 718830109 717741013 716825008 716248810 715796530
2773.9 715796530 715065181 713984907 712907732 712071002 711311460 710366070 709258556 708244979 707499743
$$ packed form
2643.4G12369084j269996q41141n29587p00593j032173r61721n25773k74658m51446
2661.7G05781996p23719o55771k25842J68085J93239K7597J68919P39813J316965J575827
2682.1G08367109J712978K100706K760291L234387L097713K548635K119064J988113
2698.4G27928996J839519J323759N87642J41025J94490L80039K33650j95205m11987
2716.8G32021928k13742k623j55747n22494o85394m05073P3135K10642o6041l14296
2737.2G29940295k67446j24335k48909o48677r61245r72926q48234q63910j091361
2755.5G23913252j284301j170397q83639p87198r57608j089096r16005n76198m52280
2773.9G15796530p31349j080274j077175q36730p59542r45390j107514j013577p45236
$$ plain form
2792.2 707499743 706960678 706407607 705693781 704933226 704359710 703887224 703173399 702160716 701101124
2810.6 701101124 700208008 699456990 698630571 697673380 696870446 696527123 696613491 696833074 697018206 697345078
2831 697345078 698089540 699208379 700343072 701244652 702009141 702853322 703670681 704043150 703760386 703073680
2851.4 703073680 702386618 701821029 701220930 700451851 699634194 699089706 698892176 698711276 698348284 698021531
2871.8 698021531 697912335 697956383 698068261 698172510 698279202 698533475 698958218 699330389 699454725 699427009
2892.2 699427009 699514985 699747443 699811697 699517727 699029028 698590636 698255301 697850108 697284639 696754575
2912.6 696754575 696477056 696477890 696604967 696687639 696793556 697133482 697732568 698223829 698077083 697294652
2933 697294652 696398675 695689559 695047975 694314778 693517506 692763388 692055166 691312253 690479755 689490795
$$ packed form
2792.2G07499743n39065n53071p13826p60555n73516m72486p13825j012683j059592
2810.6G01101124q93116p51018q26419r57191q02934l43323Q6368K19583J85132L26872
2831F97345078P44462J118839J134693R01580P64489Q44181Q17359L72469k82764o86706
2851.4G03073680o87062n65589o00099p69079q17657n44488j97530j80900l62992l26753
2871.8F98021531j09196M4048J11878J04249J06692K54273M24743L72171J24336k7716
2892.2F99427009Q7976K32458O4254k93970m88699m38392l35335m05193n65469n30064
2912.6F96754575k77519Q34J27077Q2672J05917L39926N99086M91261j46746p82431
2933F97294652q95977p09116o41584p33197p97272p54118p08222p42913q32498r88960
$$ plain form
2953.4 689490795 688478827 687780917 687378705 686958015 686440408 686050773 685964584 686034262 686019659 685908794
2973.8 685908794 685921967 686313748 686939895 687302351 687348187 687566340 688232124 689140737 689842105 690090775
2994.2 690090775 690212905 690530181 690932155 691313922 691713691 692283154 693197370 694289804 695096970
3012.5 695096970 695391178 695448875 695680439 696117878 696501434 696684659 696796119 697078168 697485089 697678685
3032.9 697678685 697461009 697066903 696933031 697025776 696842730 696092010 694907248 693793058 693320334
3051.3 693320334 693485439 693979919 694832444 696152747 697736859 699204564 700365126 701297045 702175379
3069.6 702175379 703087270 703921556 704616249 705312788 706111312 706985950 707797885 708387613 708889842 709556997
3090 709556997 710318446 710947752 711419165 711904109 712523520 713248670 713980556 714610934 715100408 715529382
$$ packed form
2953.4F89490795j011968o97910m02212m20690n17607l89635q6189O9678j4603j10865
2973.8F85908794J3173L91781O26147L62456M5836K18153O65784R08613P01368K48670
2994.2F90090775J22130L17276M01974L81767L99769N69463R14216J092434Q07166
3012.5F95096970K94208N7697K31564M37439L83556J83225J11460K82049M06921J93596
3032.9F97678685k17676l94106j33872R2745j83046p50720j184762j114190m72724
3051.3F93320334J65105M94480Q52525J320303J584112J467705J160562R31919Q78334
3069.6G02175379R11891Q34286O94693O96539P98524Q74638Q11935N89728N02229O67155
3090G09556997P61449O29306M71413M84944O19411P25150P31886O30378M89474M28974
$$ plain form
3110.4 715529382 716067016 716692150 717158318 717430472 717698336 718092024 718595862 719072223 719494045 719990194
3130.8 719990194 720605969 721213400 721651912 721880257 722010672 722267330 722700477 723138452 723569870 724117100
3151.2 724117100 724713147 725138187 725279570 725236297 725274444 725554705 725907803 726072013 726044476 726068318
3171.6 726068318 726268768 726475954 726490915 726339102 726200044 726211667 726279855 726155818 725760520 725232184
3192 725232184 724693656 724051654 723103583 721838593 720491111 719312012 718285263 717208266 716056228
3210.3 716056228 715016901 714243591 713571787 712551832 710946083 708960354 706934988 705112100 703777790
3228.7 703777790 703395605 704343200 706539750 709486187 712524354 715150356 717301905 719219446 721000969
3247.1 721000969 722504497 723742127 725039840 726668119 728501022 730163097 731382012 732191980
$$ packed form
3110.4G15529382N37634O25134M66168K72154K67864L93688N03838M76361M21822M96149
3130.8G19990194O15775O07431M38512K28345J30415K56658M33147M37975M31418N47230
3151.2G24117100N96047M25040J41383m3273L8147K80261L53098J64210k7537K3842
3171.6G26068318K00450K07186J4961j51813j39058J1623O8188j24037l95298n28336
3192G25232184n38528o42002r48071j264990j347482j179099j026749j076997j152038
3210.3G16056228j039327p73310o71804j019955j605749j985729k025366j822888j334310
3228.7G03777790l82185R47595K196550K946437L038167K626002K151549J917541J781523
3247.1G21000969J503528J237630J297713J628279J832903J662075J218915Q09968
$$ plain form
3263.4 732191980 732868433 733562768 734068274 734111190 733799815 733527780 733413517 733151436 732484639 731540442
3283.8 731540442 730673254 730067313 729504883 728645504 727504432 726371109 725329518 724193454 722810507
3302.1 722810507 721265376 719708085 718117356 716337383 714229226 711862504 709403157 706854105
3318.4 706854105 704043448 700767040 697048366 693151772 689258158 685239434 680828333 676021457
3334.8 676021457 671061635 666008711 660606563 654590011 647906125 640640736 632773399 623981357
3351.1 623981357 613897204 602516472 590459585 579072356 570293307 566465676 569549501 579595745
3367.4 579595745 593894541 607937813 617397785 619899631 616283536 610705972 608479857 612742126
3383.7 612742126 623032153 637043893 652596712 667505801 679619312 688096464 693630159 697155595
$$ packed form
3263.4G32191980O76453O94335N05506M2916l11375k72035j14263k62081o66797r44197
3283.8G31540442q67188o05941n62430q59379j141072j133323j041591j136064j382947
3302.1G22810507j545131j557291j590729j779973k108157k366722k459347k549052
3318.4G06854105k810657l276408l718674l896594l893614m018724m411101m806876
3334.8F76021457m959822n052924n402148o016552o683886p265389p867337q792042
3351.1F23981357j0084153j1380732j2056887j1387229q779049l827631L083825J0046244
3367.4E79595745J4298796J4043272R459972K501846l616095n577564k226115M262269
3383.7F12742126J0290027J4011740J5552819J4909089J2113511Q477152N533695L525436
$$ plain form
3400 697155595 699091315 699677229 699344814 698555410 697569191 696389675 694829166 692835987 690639079
3418.4 690639079 688448310 686262429 683883429 681158483 678185046 675106108 672065437 669087410
3434.7 669087410 665931344 662611902 659511030 656657577 653514743 649461567 644023120 636559904
3451 636559904 626295209 613479912 600626469 592186391 592010498 600160360 612084627 621875167
3467.3 621875167 626585245 627574682 628410578 631743312 638144970 646813214 656565487 666369796 675362885
3485.7 675362885 682892203 688819289 693601787 697764397 701443970 704440594 706744730 708779335
3502 708779335 710851848 712811649 714477897 715981901 717538297 719101369 720524549 721776485 722902358
3520.4 722902358 724073231 725312889 726439893 727504313 728612542 729709208 730913043 732265055
$$ packed form
3400F97155595J935720N85914l32415p89404r86219j179516j560509j993179k196908
3418.4F90639079k190769k185881k379000k724946k973437l078938l040671k978027
3434.7F69087410l156066l319442l100872k853453l142834m053176n438447p463216
3451F36559904j0264695j2815297j2853443q440078j75893Q149862J1924267R790540
3467.3F21875167M710078R89437Q35896L332734O401658Q668244R752273R804309Q993089
3485.7F75362885P529318N927086M782498M162610L679573K996624K304136K034605
3502G08779335K072513J959801J666248J504004J556396J563072J423180J251936J125873
3520.4G22902358J170873J239658J127004J064420J108229J096666J203835J352012
$$ plain form
3536.7 732265055 733499706 734552264 735523462 736457825 737461567 738526106 739422739 740198731 741182685
3555 741182685 742372990 743526757 744427264 744889438 745149076 746151984 748139024 749935091 751044869
3573.4 751044869 752016246 753253698 754690945 756065369 757045925 757594168 758495986 760312796 761980772
3591.7 761980772 762917757 763951838 765577316 767340124 768908799 770139694 770933449 771826267 773202002
3610.1 773202002 774449408 775357664 776126802 777056098 778759241 780643761 781590760 781399369 781227350
3628.5 781227350 782724142 784657001 785812438 786639452 787487745 788285971 788746297 788378835 787176669
3646.8 787176669 786599815 788058102 789826989 790406048 790734529 791677058 792468369 792633772 792212844
3665.2 792212844 791080058 789795756 789457679 789045215 787966788 788103938 789355338 790466428 791048050
$$ packed form
3536.7G32265055J234651J052558R71198R34363J003742J064539Q96633P75992R83954
3555G41182685J190305J153767R00507M62174K59638J002908J987040J796067J109778
3573.4G51044869R71377J237452J437247J374424R80556N48243R01818J816810J667976
3591.7G61980772R36985J034081J625478J762808J568675J230895P93755Q92818J375735
3610.1G73202002J247406R08256P69138R29296J703143J884520R46999j91391j72019
3628.5G81227350J496792J932859J155437Q27014Q48293P98226M60326l67462j202166
3646.8G87176669n76854J458287J768887N79059L28481R42529P91311J65403m20928
3665.2G92212844j132786j284302l38077m12464j078427J37150J251400J111090N81622
$$ plain form
3683.5 791048050 790858746 790050387 789681971 790560246 791704953 792088330 791745484 791219831 791121900 791579962
3703.9 791579962 791694462 790886879 789809525 789892077 791067302 791639507 791144013 790298462 789723814
3722.3 789723814 789448738 789388239 789438188 789086759 788118482 787268102 787503123 788437128 788664460 787601113
3742.7 787601113 786556721 786651790 786397099 785998940 787081599 788438082 788631499 788216352 788370550
3761 788370550 788786411 788748622 788365245 788002372 788282096 789106965 789480805 788975537 788213491 787991345
3781.4 787991345 788144112 788328171 788470805 788444340 788267970 787875950 787187159 786302328 785082638 784240603
3801.8 784240603 784533978 784913480 785248816 785822153 785890818 785123289 784222484 783553779 782585979 782317400
3822.2 782317400 783130169 783730745 783794999 783422410 782909334 782553554 782026589 781436741 781397760 781846344
$$ packed form
3683.5G91048050j89304q08359l68416Q78275J144707L83377l42846n25653r7931M58062
3703.9G91579962J14500q07583j077354Q2552J175225N72205m95494q45551n74648
3722.3G89723814k75076o0499M9949l51429r68277q50380K35021R34005K27332j063347
3742.7G87601113j044392R5069k54691l98159J082659J356483J93417m15147J54198
3761G88370550M15861l7789l83377l62873K79724Q24869L73840n05268p62046k22146
3781.4G87991345J52767J84059J42634k6465j76370l92020o88791q84831j219690q42035
3801.8G84240603K93375L79502L35336N73337O8665p67529r00805o68705r67800k68579
3822.2G82317400Q12769O00576O4254l72589n13076l55780n26965n89848l8981M48584
$$ plain form
3842.6 781846344 782598615 783260763 783041656 781384885 779201806 779446363 781363189 782335937 781942844
3861 781942844 780955493 780562758 780564189 780147672 779966831 780445933 781110406 781424463 781002164 780475438
3881.4 780475438 780214131 780072689 780286789 780304790 780026734 780236959 780538321 780089021 779066205 778190076
3901.8 778190076 778000236 778735936 779771268 780286491 780247986 779872060 779330015 779078841 779204547 779172182
3922.1 779172182 778900743 778827608 778865099 778681695 778527617 778719068 779036522 779153526 778933108 778509080
3942.5 778509080 778166473 777929783 777867198 778089643 778324664 778331161 778250933 778263211 778290510 778194606 777940452
3965 777940452 777651668 777544796 777622819 777645051 777530730 777430713 777408004 777421474 777368069 777121902 776763201
3987.4 776763201 776531875 776493788 776489675 776430070 776409209
$$ packed form
3842.6G81846344P52271O62148k19107j656771k183079K44557J916826R72748l93093
3861G81942844r87351l92735J431m16517j80841M79102O64473L14057m22299n26726
3881.4G80475438k61307j41442K14100J8001k78056K10225L01362m49300j022816q76129
3901.8G78190076j89840P35700J035332N15223l8505l75926n42045k51174J25706l2365
3922.1G79172182k71439p3135L7491j83404j54078J91451L17454J17004k20418m24028
3942.5G78509080l42607k36690o2585K22445K35021O497q0228J2278K7299r5904k54154
3965G77940452k88784j06872P8023K2232j14321j00017k2709J3470n3405k46167l58701
3987.4G76763201k31326l8087m113n9605k0861
$$ plain form
3997.6 776409209
$$ packed form
3997.6G76409209
##END=$$ End of the data block
