##TITLE=Sarita 02 $$ Begin of the data block
##JCAMP-DX=5.00 $$ ACD/SpecManager v 10.08
##SPECTROMETER/DATA SYSTEM=Alpha
##DATE=09 Sep 2014 08:39:12
##DATA TYPE=INFRARED SPECTRUM
##DATA CLASS=XYDATA
##ORIGIN=
##OWNER=
##NPOINTS=1765
##FIRSTX=399.76428223
##LASTX=3997.64306641
##MAXX=3997.64306641
##MINX=399.76428223
##MAXY=0.88931227
##MINY=0.47205877
##XFACTOR=1.0000000000
##YFACTOR=1.000000000000000e-9
##FIRSTY=0.85757816
##DELTAX=2.03961372
##XUNITS=1/CM
##YUNITS=ARBITRARY UNITS
##XYDATA=(X++(Y..Y))
$$ plain form
399.8 857578158 862544477 863381743 862081110 862793565 864295542 863119602 861263394 861535668 861211538
418.1 861211538 858078897 856426477 856902242 853901863 843804061 832958937 832209766 841049016
434.4 841049016 850096345 856358767 861080587 862595737 861587584 862248540 864419460 864170611 862186730
452.8 862186730 862537146 864340246 863834441 862266719 863030493 864578426 863553464 861696482 862262666
471.2 862262666 863404334 862170935 860742629 861659825 862512231 860803723 859114766 859666228 859629512
489.5 859629512 856720448 853152931 849822581 842163384 826902270 811538875 810964227 825605333
505.8 825605333 841254890 851163566 857243896 859666944 858916163 858319521 859174669 859075546 857300460
524.2 857300460 856214464 856285870 855098128 852230370 849408865 846230626 839976966 829375803 815712214
$$ packed form
399.8H57578158M966319Q37266j300633P12455J501977j175940j856208K72274l24130
418.1H61211538l132641j652420M75765l000379j0097802j0845124p49171Q839250
434.4H41049016R047329O262422M721820J515150j008153O60956K170920k48849j983881
452.8H62186730L50416J803100n05805j567722P63774J547933j024962j856982N66184
471.2H62262666J141668j233399j428306R17196Q52406j708508j688957N51462l6716
489.5H59629512k909064l567517l330350p659197j5261114j5363395n74648J4641106
505.8H25605333J5649557R908676O080330K423048p50781n96642Q55148r9123j775086
524.2H57300460j085996P1406j187742k867758k821505l178239o253660j0601163j3663589
$$ plain form
542.5 815712214 801536083 791568518 791875660 803609490 820250750 833976030 842489004 847911477
558.9 847911477 851600766 853237152 853389859 853301823 852665126 850193143 846604526 845197380 847697616
577.2 847697616 851483107 853944957 855240464 855933726 855981886 855529606 854997694 854380608 853158414
595.6 853158414 851045668 848028302 843761146 837693572 830379307 825815856 829390705 839865446
611.9 839865446 849699974 854863346 857003689 858248234 859014571 859382212 859888852 860311091 859577537
630.2 859577537 858381808 858991802 861078501 862294555 862217963 862113118 862723947 863394320 863448858 863463104
650.6 863463104 863882303 863894165 863096356 862450838 862286091 861508965 859654427 856785059 853571713
669 853571713 851093352 847398758 840566516 830785573 823725700 826377630 835379779 841864824 842962623
$$ packed form
542.5H15712214j4176131r967565L07142J1733830J6641260J3725280Q512974N422473
558.9H47911477L689289J636386J52707q8036o36697k471983l588617j407146K500236
577.2H47697616L785491K461850J295507O93262M8160m52280n31912o17086j222194
595.6H53158414k112746l017366m267156o067574p314265m563451L574849J0474741
611.9H39865446R834528N163372K140343J244545P66337L67641N06640M22239p33554
630.2H59577537j195729O09994K086699J216054p6592j04845O10829O70373N4538J4246
650.6H63463104M19199J1862p97809o45518j64747p77126j854538k869368l213346
669H53571713k478361l694594o832242r780943p059873K651930R002149O485045J097799
$$ plain form
687.3 842962623 840694129 837574005 833818734 826401770 813947082 801717758 796985924 800731122
703.7 800731122 808793128 818064809 827397346 835519254 841693461 846826851 851732671 855821908
720 855821908 858613789 861095965 863970995 866403103 867794394 869028032 870805681 872412205 873229861
738.3 873229861 873980641 875212491 876118898 876189113 876154065 876539946 876616478 875605881 873671591 870905161
758.7 870905161 865611315 852072060 822570920 786949575 778373003 806656659 841682553 862069666
775.1 862069666 870727539 873828590 874740064 875344515 875806212 875425994 874077618 871802986 868039310
793.4 868039310 863060534 860075474 862719893 869876683 876700163 880534649 882156789 882462502 881628573
811.8 881628573 880629301 880822778 881842375 882198095 881376624 879946411 878123283 875281334 870817780
$$ packed form
687.3H42962623k268494l120124l755271p416964j2454688j2229324m731834L745198
703.7H00731122Q062006R271681R332537Q121908O174207N133390M905820M089237
720H55821908K791881K482176K875030K432108J391291J233638J777649J606524Q17656
738.3H73229861P50780J231850R06407P0215l5048L85881P6532j010597j934290k766430
758.7H70905161n293846j3539255k9501140l5621345q576572K8283656L5025894K0387113
775.1H62069666Q657873L101051R11474O04451M61697l80218j348376k274632l763676
793.4H68039310m978776k985060K644419P156790O823480L834486J622140L05713q33929
811.8H81628573r99272J93477J019597L55720q21471j430213j823128k841949m463554
$$ plain form
830.1 870817780 865209818 860667527 859900475 863360107 868471086 872284591 873206019 870891511 865911186
848.5 865911186 858369768 848440349 841185749 843655169 852819622 858099878 854025602 841749549
864.8 841749549 828419626 827405989 843903124 865488470 879669785 886110187 888378382 888741493
881.1 888741493 888925791 889312267 888993800 887911439 887206137 887090564 886458635 885053456 884016216
899.5 884016216 883636773 882683098 880780101 879109025 877941072 876006186 872903049 869763792 866904438
917.8 866904438 863089323 857915401 852615237 847730339 842339635 836347282 831300378 828164339
934.1 828164339 826177776 824878335 825333118 828010321 831516087 834841371 838728607 843366027 846846044
952.5 846846044 847840369 848394334 851149619 854622781 855654418 855231822 856876671 861024201 865442395
$$ packed form
830.1H70817780n607962m542291p67052L459632N110979L813505R21428k314508m980325
848.5H65911186p541418r929419p254600K469420R164453N280256m074276j2276053
864.8H41749549j3329923j013637J6497135K1585346J4181315O440402K268195L63111
881.1H88741493J84298L86476l18467j082361p05302j15573o31929j405179j037240
899.5H84016216l79443r53675j902997j671076j167953j934886l103137l139257k859354
917.8H66904438l815115n173922n300164m884898n390704n992353n046904l136039
934.1H28164339j986563j299441M54783K677203L505766L325284L887236M637420L480017
952.5H46846044R94325N53965K755285L473162J031637m22596J644849M147530M418194
$$ plain form
970.9 865442395 869235456 872421503 873754442 872218966 868622899 864784658 863150418 865052164
987.2 865052164 868742049 871686637 872635305 871592641 869915664 868653953 866937518 863732517 859743178
1005.5 859743178 855775893 851080060 845238924 840051532 837375879 836798251 838205159 843375862
1021.8 843375862 851763010 859226346 863014936 864083052 864186108 863337398 860871971 857487798 854746997
1040.2 854746997 853457630 853783190 855954349 859601557 863243401 865591884 866930962 868152082
1056.5 868152082 869126320 869244516 868809998 868603587 868501902 867866337 866864443 866130710 865570188
1074.9 865570188 864640176 863431334 862504780 861803830 860794842 859560788 858605146 857893646 856951296
1093.2 856951296 855688214 854393184 852974176 850864232 847735822 843672037 838999450 834744632
$$ packed form
970.9H65442395L793061L186047J332939j535476l596067l838241j634240J901746
987.2H65052164L689885K944588R48668j042664j676977j261711j716435l205001l989339
1005.5H59743178l967285m695833n841136n187392k675653n77628J406908N170703
1021.8H43375862Q387148P463336L788590J068116J03056q48710k465427l384173k740801
1040.2H54746997j289367L25560K171159L647208L641844K348483J339078J221120
1056.5H68152082R74238J18196m34518k06411j01685o35565j001894p33733n60522
1074.9H65570188r30012j208842r26554p00950j008988j234054r55642p11500r42350
1093.2H56951296j263082j295030j419008k109944l128410m063785m672587m254818
$$ plain form
1109.6 834744632 832389414 832207561 832753718 832703292 832370043 832895339 833692968 831519306 825018406
1127.9 825018406 820488393 825397134 836627305 845739484 850126207 851780474 852420151 852546513
1144.2 852546513 852192223 851552248 850893855 850208282 849353611 848390639 847417295 846159756 844147503
1162.6 844147503 841229022 837341130 831743062 823150039 811168730 797189951 784144461 776228547
1178.9 776228547 777119637 787806928 806508005 827502966 843124866 850803316 853229344 853020251
1195.2 853020251 851664782 850416899 849612474 848626256 847296119 846234977 845521986 844433606 842830479
1213.6 842830479 841502428 840757072 839938819 838740349 837682903 836873770 835666597 833903551 832249284
1231.9 832249284 830863059 828985870 826304615 823367417 820175767 815855384 810136259 803645313
$$ packed form
1109.6H34744632k355218j81853N46157n0426l33249N25296P97629k173662o500900
1127.9H25018406m530013M908741J1230171R112179M386723J654267O39677J26362
1144.2H52546513l54290o39975o58393o85573q54671r62972r73344j257539k012253
1162.6H44147503k918481l887892n598068q593023j1981309j3978779j3045490p915914
1178.9G76228547Q91090J0687291J8701077K0994961J5621900P678450K426028k09093
1195.2H53020251j355469j247883q04425r86218j330137j061142p12991j088380j603127
1213.6H42830479j328051p45356q18253j198470j057446q09133j207173j763046j654267
1231.9H32249284j386225j877189k681255k937198l191650m320383n719125o490946
$$ plain form
1248.2 803645313 796351552 786990702 774440825 758435249 738792956 716379106 696638763 689705789
1264.6 689705789 702921927 732033253 763226807 785124660 795288503 796133161 790217221 779625118
1280.9 779625118 765529454 747850955 726691365 703820169 682319701 665282130 654834509
1295.2 654834509 651891232 657109916 670749068 689633787 705397844 708766997 695984423 672182262
1311.5 672182262 652591825 654315174 676719904 702021599 720516086 737933695 758710325
1325.8 758710325 779587209 796390593 808030367 815340817 820017993 824524224 830530822 836808443
1342.1 836808443 841245413 843518615 844229817 843309462 840270340 835377097 828961492 820161819 807626128
1360.4 807626128 792740405 781424940 777387857 778454900 781453431 785248220 789759099 794091880
$$ packed form
1248.2H03645313p293761r360850j2549877j6005576j9642293k2413850j9740343o932974
1264.6F89705789J3216138K9111326L1193554K1897853J0163843Q44658n915940j0592103
1280.9G79625118j4095664j7678499k1159590k2871196k1500468j7037571j0447621
1295.2F54834509k943277N218684J3639152J8884719J5764057L369153j2782574k3802161
1311.5F72182262j9590437J723349K2404730K5301695J8494487J7417609K0776630
1325.8G58710325K0876884J6803384J1639774P310450M677176M506231O006598O277621
1342.1H36808443M436970K273202P11202r20355l039122m893243o415605q799673j2535691
1360.4H07626128j4885723j1315465m037083J067043K998531L794789M510879M332781
$$ plain form
1376.7 794091880 797460139 799575865 800004184 798649013 795595527 791328728 786567092 780939400
1393.1 780939400 774094582 766615212 758278251 749511480 742080331 738268495 740574419 748191774
1409.4 748191774 757450640 763970315 764878929 758357763 744098961 728071332 714360654 705356359
1425.7 705356359 705705762 717786849 738305151 760342360 782164574 801622033 814748049 823670208
1442 823670208 830409229 835666120 840103924 843480110 845897973 847861052 849651575 850902140 851446629
1460.4 851446629 851550281 851172507 850335777 849381804 848371387 846928298 844949067 842442214 839665830
1478.7 839665830 836901367 834561527 832920015 831407666 828807890 824477255 819231808 812408984
1495 812408984 802674830 791342854 780498445 770058572 755696535 732545137 711214006 696117103
$$ packed form
1376.7G94091880L368259K115726M28319j355171l053486m266799m761636n627692
1393.1G80939400o844818p479370q336961q766771p431149l811836K305924P617355
1409.4G48191774R258866O519675R08614o521166j4258802j6027629j3710678r004295
1425.7G05356359L49403J2081087K0518302K2037209K1822214J9457459J3126016Q922159
1442H23670208O739021N256891M437804L376186K417863J963079J790523J250565N44489
1460.4H51446629J03652l77774q36730r53973j010417j443089j979231k506853k776384
1478.7H39665830k764463k339840j641512j512349k599776m330635n245447o822824
1495H12408984r734154j1331976j0844409j0439873j4362037k3151398k1331131j5096903
$$ plain form
1511.4 696117103 682876706 667047143 646595061 627888083 616737545 616511345 626406729 643521965
1527.7 643521965 663614810 685654283 710872054 733186364 751688957 773022890 793243766
1542 793243766 807606697 819025517 828341126 836053610 842218816 846952498 850371361 852580249
1558.3 852580249 853747904 854376197 854582787 854644299 854548633 854251266 853584409 851462066 846327364
1576.6 846327364 839288414 830652595 818102062 799717247 774218798 745350182 724721551 722565293
1593 722565293 735255063 750083268 758548677 758345485 748231530 728930831 710043311 709699214
1609.3 709699214 734065473 765844405 789460897 801194489 803847790 802449465 798857749 793980122
1625.6 793980122 788046300 781370640 775112391 768628180 760091126 752250195 746679723 741724372
$$ packed form
1511.4F96117103j3240397j5829563k0452082j8706978j1150538k26200R895384J7115236
1527.7F43521965K0092845K2039473K5217771K2314310J8502593K1333933K0220876
1542G93243766J4362931J1418820R315609P712484O165206M733682L418863K208888
1558.3H52580249J167655O28293K06590O1512r5666k97367o66857k122343n134702
1576.6H46327364p038950q635819j2550533j8384815k5498449k8868616k0628631k156258
1593G22565293J2689770J4828205Q465409k03192j0113955j9300699j8887520l44097
1609.3G09699214K4366259L1778932K3616492J1733592K653301j398325l591716m877627
1625.6G93980122n933822o675660o258249o484211q537054p840931n570472m955351
$$ plain form
1641.9 741724372 736421287 729300380 720910668 713667214 702717662 683285952 664510369 644282281
1658.2 644282281 617509604 582866311 545953214 514796913 488526285 472058773 473216712
1672.5 473216712 490334094 515820622 539146662 558755279 578395545 601284981 621614277
1686.8 621614277 638324499 654363334 667489231 678393722 689000368 702611089 723711014
1701.1 723711014 745213330 764834523 783155918 796798527 806973219 815653801 823713899 831593812
1717.4 831593812 838533282 844110131 849015951 853267610 856696129 859739244 862300634 864216685
1733.7 864216685 865727901 867190838 868636906 869904876 871076763 872432232 873743534 874518871
1750 874518871 874998689 875636876 876265645 876502216 876412332 876412988 876694620 876839042 876776814 876891851 877145946
$$ packed form
1641.9G41724372n303085p120907q389712p243454j0949552j9431710j8775583k0228088
1658.2F44282281k6772677l4643293l6913097l1156301k6270628j6467512J157939
1672.5D73216712J7117382K5486528K3326040J9608617J9640266K2889436K0329296
1686.8F21614277J6710222J6038835J3125897J0904491J0606646J3610721K1099925
1701.1G23711014K1502316J9621193J8321395J3642609J0174692Q680582Q060098P879913
1717.4H31593812O939470N576849M905820M251659L428519L043115K561390J916051
1733.7H64216685J511216J462937J446068J267970J171887J355469J311302P75337
1750H74518871M79818O38187O28769K36571q9884O56K81632J44422o2228J15037K54095
$$ plain form
1772.4 877145946 877289176 877308667 877405465 877530932 877390981 877005398 876862347 877019286 876972914 876743376
1792.8 876743376 876913726 877386749 877581716 877439082 877428472 877662838 877778828 877731919 877896905 878392696
1813.2 878392696 878900588 879307270 879862726 880505383 880836725 880805671 880829155 880991817 881045222 880938113
1833.6 880938113 880894780 881039321 881146193 881048620 880922973 881049573 881203771 881201982 881293893 881539702
1854 881539702 881631315 881483078 881403208 881508589 881560266 881392419 881175816 881137431 881133437 880957246 880753577
1876.5 880753577 880652010 880497277 880216718 879974782 879844785 879661918 879422307 879288137 879293084 879359245
1896.9 879359245 879422724 879524529 879666448 879710376 879563987 879336357 879194677 879147768 879108667 879128575
1917.3 879128575 879346907 879676223 879967272 880252600 880524933 880668402 880629241 880474985 880305827 880162477
$$ packed form
1772.4H77145946J43230J9491R6798J25467j39951l85583j43051J56939m6372k29538
1792.8H76743376J70350M73023J94967j42634j0610K34366J15990m6909J64986M95791
1813.2H78392696N07892M06682N55456O42657L31342l1054K3484J62662N3405j07109
1833.6H80938113m3333J44541J06872r7573j25647J26600J54198j789R1911K45809
1854H81539702R1613j48237p9870J05381N1677j67847k16603l8385l994j76191k03669
1876.5H80753577j01567j54733k80559k41936j29997j82867k39611j34170M947O6161
1896.9H79359245O3479J01805J41919M3928j46389k27630j41680m6909l9101J9908
1917.3H79128575K18332L29316K91049K85328K72333J43469l9161j54256j69158j43350
$$ plain form
1937.7 880162477 880081713 880104005 880234241 880389929 880480528 880504906 880413353 880098581 879575729 879040301
1958.1 879040301 878755808 878833830 879156828 879534125 879835129 880019486 880119801 880178213 880179226 880116582
1978.5 880116582 880059123 880063415 880086005 880078495 880060852 880036354 879987121 879944801 879949749 879988670 880002260 879965782
2002.9 879965782 879939377 879938960 879877150 879747689 879668593 879646599 879569650 879420996 879287779 879215062 879119694
2025.4 879119694 878947020 878791809 878697932 878549218 878313899 878123760 878026485 877906322 877697885 877512753
2045.8 877512753 877411127 877285957 877109826 876980126 876882434 876705825 876451731 876230061 876070023 875861287
2066.2 875861287 875555992 875262737 875028551 874750197 874429524 874232769 874214292 874261320 874328375 874482274
2086.6 874482274 874718308 874909520 874995708 875060737 875129998 875111580 874959767 874771595 874647260 874561727
$$ packed form
1937.7H80162477q0764K2292J30236J55688R0599K4378r1553l14772n22852n35428
1958.1H79040301k84493P8022L22998L77297L01004J84357J00315N8412J013o2644
1978.5H80116582n7459M292K2590p510j7643k4498m9233m2320M948L8921J3590l6478
2002.9H79965782k6405m17o1810j29461p9096k1994p6949j48654j33217p2717r5368
2025.4H79119694j72674j55211r3877j48714k35319j90139r7275j20163k08437j85132
2045.8H77512753j01626j25170j76131j29700r7692j76609k54094k21670j60038k08736
2066.2H75861287l05295k93255k34186k78354l20673j96755j8477M7028O7055J53899
2086.6H74482274K36034J91212Q6188O5029O9261j8418j51813j88172j24335q5533
$$ plain form
2106.9 874561727 874485493 874485612 874608099 874760389 874854863 874942720 875079155 875176430 875156581 875104904 875128567
2129.4 875128567 875170588 875124156 875045180 875007629 874951541 874841213 874731421 874642551 874547720 874420762 874271035
2151.8 874271035 874118507 873928726 873677313 873431861 873261809 873134077 873009384 872936010 872956634 873011470
2172.2 873011470 873014033 873006999 873078883 873167038 873191416 873192191 873191118 873142719 873010814 872849226 872754335 872716308
2196.7 872716308 872638941 872513354 872427583 872382641 872302175 872197092 872133732 872091651 872023582 871923625 871779501
2219.1 871779501 871581137 871363580 871169209 870989621 870815754 870648682 870483816 870330572 870175600 869999051
2239.5 869999051 869816840 869657099 869545162 869493604 869497716 869528055 869510889 869419336 869289339 869121909 868907750
2262 868907750 868699074 868550777 868444502 868319094 868139327 867939472 867762804 867584586 867392838 867215812
$$ packed form
2106.9H74561727p6234J19J22487J52290R4474Q7857J36435R7275j9849n1677K3663
2129.4H75128567M2021m6432p8976l7551n6088j10328j09792q8870r4831j26958j49727
2151.8H74271035j52528j89781k51413k45452j70052j27732j24693p3374K0624N4836
2172.2H73011470K563p034P1884Q8155K4378P75j073m8399j31905j61588r4891l8027
2196.7H72716308p7367j25587q5771m4942q0466j05083o3360m2081o8069r9957j44124
2219.1H71779501j98364k17557j94371j79588j73867j67072j64866j53244j54972j76549
2239.5H69999051j82211j59741j11937n1558M112L0339j7166r1553j29997j67430k14159
2262H68907750k08676j48297j06275j25408j79767j99855j76668j78218j91748j77026
$$ plain form
2282.3 867215812 867039859 866818011 866541326 866221249 865864575 865520597 865233302 865011811 864844501 864671767
2302.7 864671767 864484906 864334583 864203632 864059091 863917887 863773108 863550425 863189340 862744212 862320423
2323.1 862320423 861956179 861610770 861276150 860977352 860691190 860416114 860170007 859916449 859639287 859416783
2343.5 859416783 859475315 859853506 860120952 859925270 859344840 858722389 858189762 857711434 857276201 856910229
2363.9 856910229 856666744 856510162 856338561 856139362 855955899 855812132 855731010 855684042 855591357 855425239
2384.3 855425239 855199397 854904354 854546726 854179561 853846490 853549898 853255808 852939546 852615952 852271318
2404.7 852271318 851868570 851445019 851074934 850752711 850408733 850027680 849660456 849316299 848966181 848625541
2425.1 848625541 848330438 848062694 847774863 847466588 847161949 846810400 846342444 845822096 845351100 844914854
$$ packed form
2282.3H67215812j75953k21848k76685l20077l56674l43978k87295k21491j67310j72734
2302.7H64671767j86861j50323j30951j44541j41204j44779k22683l61085m45128m23789
2323.1H62320423l64244l45409l34620k98798k86162k75076k46107k53558k77162k22504
2343.5H59416783N8532L78191K67446j95682n80430o22451n32627m78328m35233l65972
2363.9H56910229k43485j56582j71601j99199j83463j43767q1122m6968r2685j66118
2384.3H55425239k25842k95043l57628l67165l33071k96592k94090l16262l23594l44634
2404.7H52271318m02748m23551l70085l22223l43978l81053l67224l44157l50118l40640
2425.1H48625541k95103k67744k87831l08275l04639l51549m67956n20348m70996m36246
$$ plain form
2445.5 844914854 844443381 843931317 843405724 842807651 842084706 841332376 840681672 840123296 839566708 838997960
2465.9 838997960 838479042 837993801 837472856 836966097 836552024 836174250 835724175 835185289 834605396 834002972
2486.3 834002972 833357036 832708716 832155824 831685483 831212819 830746949 830340683 829908431 829323888 828636348
2506.7 828636348 827955127 827241898 826414883 825513721 824624479 823724329 822722793 821636319 820580900
2525.1 820580900 819592535 818571210 817465901 816351414 815262973 814144313 812996149 811932981
2541.4 811932981 811006486 810171723 809475839 809043527 808932960 809117019 809555352 810292661 811356783
2559.7 811356783 812595725 813891709 815321743 816883206 818417907 819856286 821247220 822582960
2576 822582960 823733151 824575901 825129032 825440109 825421214 825043619 824493825 823888659 823219597 822602749
$$ packed form
2445.5H44914854m71473n12064n25593n98073p22945p52330o50704n58376n56588n68748
2465.9H38997960n18918m85241n20945n06759m14073l77774m50075n38886n79893o02424
2486.3H34002972o45936o48320n52892m70341m72664m65870m06266m32252n84543o87540
2506.7H28636348o81221p13229q27015r01162q89242r00150j001536j086474j055419
2525.1H20580900r88365j021325j105309j114487j088441j118660j148164j063168
2541.4H11932981r26495q34763o95884m32312j10567J84059M38333P37309J064122
2559.7H11356783J238942J295984J430034J561463J534701J438379J390934J335740
2576H22582960J150191Q42750N53131L11077j8895l77595n49794o05166o69062o16848
$$ plain form
2596.4 822602749 822248995 822247446 822529435 822974801 823501587 824045122 824490070 824744165 824835539 824794412
2616.8 824794412 824555516 824124575 823655784 823251307 822840571 822351635 821851611 821376562 820865035 820287406
2637.2 820287406 819695592 819127977 818524897 817869663 817282200 816822946 816369236 815821409 815256536 814746141
2657.6 814746141 814232707 813675404 813168347 812808633 812564611 812415302 812460601 812776685 813344836 814137340
2678 814137340 815169871 816427529 817796290 819180548 820605040 822064281 823435545 824647129 825763106
2696.4 825763106 826824188 827735603 828405023 828847885 829093993 829088330 828770816 828248680 827688098 827116787
2716.8 827116787 826550066 826130748 825958490 825975180 826106250 826396227 826899111 827512860 828120887 828670442
2737.2 828670442 829073846 829245150 829164445 828913689 828534126 827915192 827029169 826031446 825051188 824088931
$$ packed form
2596.4H22602749l53754j549K81989M45366N26786N43535M44948K54095R1374m1127
2616.8H24794412k38896m30941m68791m04477m10736m88936n00024m75049n11527n77629
2637.2H20287406n91814n67615o03080o55234n87463m59254m53710n47827n64873n10395
2657.6H14746141n13434n57303n07057l59714k44022j49309M5299L16084N68151P92504
2678H14137340J032531J257658J368761J384258J424492J459241J371264J211584J115977
2696.4H25763106J061082R11415O69420M42862K46108n663l17514n22136n60582n71311
2716.8H27116787n66721m19318j72258J6690J31070K89977N02884O13749O08027N49555
2737.2H28670442M03404J71304q0705k50756l79563o18934q86023r97723r80258r62257
$$ plain form
2757.6 824088931 823167324 822403491 821820080 821289718 820726454 820175350 819656193 819046021 818212092 817208171
2778 817208171 816196442 815231323 814297915 813453317 812735558 812016070 811203778 810440540 809843004 809287250
2798.4 809287250 808654547 808020830 807441652 806879759 806304514 805704355 805101216 804507017 803913653 803378701
2818.8 803378701 802967131 802658021 802417278 802284420 802305341 802402735 802484274 802608609 802850127 803080797
2839.1 803080797 803173840 803299725 803608060 803962648 804235876 804506421 804874361 805307150 805757105 806203723
2859.5 806203723 806562662 806742966 806728065 806580901 806420267 806290209 806032896 805559278 805073798 804734170
2879.9 804734170 804495215 804320693 804200947 804080069 803957403 803970993 804176450 804396570 804510653 804670751
2900.3 804670751 805005133 805373132 805627704 805833459 806075394 806232095 806042910 805450857 804644406 803766489
$$ packed form
2757.6H24088931r21607p63833n83411n30362n63264n51104n19157o10172q33929j003921
2778H17208171j011729r65119r33408q44598p17759p19488q12292p63238n97536n55754
2798.4H09287250o32703o33717n79178n61893n75245o00159o03139n94199n93364n34952
2818.8H03378701m11570l09110k40743j32858K0921R7394Q1539J24335K41518K30670
2839.1H03080797R3043J25885L08335L54588K73228K70545L67940M32789M49955M46618
2859.5H06203723L58939J80304j4901j47164j60634j30058k57313m73618m85480l39628
2879.9H04734170k38955j74522j19746j20878j22666J3590K05457K20120J14083J60098
2900.3H04670751L34382L67999K54572K05755K41935J56701j89185n92053q06451q77917
$$ plain form
2920.7 803766489 802896798 802112877 801538229 801238894 801076174 801016450 801134765 801320970 801478684 801720977
2941.1 801720977 802083611 802358091 802370191 802224636 802113533 801957190 801636338 801282465 801041365 800896525
2961.5 800896525 800690889 800357640 799998939 799660385 799373150 799165845 798969865 798829257 798813760 798791587
2981.9 798791587 798684478 798571229 798518538 798557758 798601449 798505664 798375368 798307359 798229277 798206866 798327148
3004.4 798327148 798593402 799010932 799494088 799825370 799874961 799704432 799390435 798973203 798518658 798065364
3024.7 798065364 797603309 797227323 797076106 797161818 797405601 797770917 798274755 798808277 799175620 799291909
3045.1 799291909 799267232 799422204 800050020 801099181 802269697 803256810 803942323 804434001 804823756
3063.5 804823756 805047154 804904640 804257929 803266704 802335858 801948309 802317619 803100169 803792238 804114521
$$ packed form
2920.7H03766489q69691p83921n74648k99335j62720n9724J18315J86205J57714K42293
2941.1H01720977L62634K74480J2100j45555j11103j56343l20852l53873k41100j44840
2961.5H00896525k05636l33249l58701l38554k87235k07305j95980j40608j5497k2173
2981.9G98791587j07109j13249n2691L9220M3691r5785j30296o8009p8082k2411J20282
3004.4G98327148K66254M17530M83156L31282M9591j70529l13997m17232m54545m53294
3024.7G98065364m62055l75986j51217Q5712K43783L65316N03838N33522L67343J16289
3045.1G99291909k4677J54972O27816J049161J170516R87113O85513M91678L89755
3063.5H04823756K23398j42514o46711r91225r30846l87549L69310P82550O92069L22283
$$ plain form
3083.9 804114521 804014683 803808391 803876042 804189205 804587543 805030644 805381358 805342913 804800272 804097116
3104.3 804097116 803687572 803622127 803734958 804183841 805126071 806185901 806985557 807502329 807846963 808215737
3124.7 808215737 808758438 809457004 810138106 810683846 811226845 811952591 812730134 813208461 813433170 813739240
3145.1 813739240 814160645 814584553 814936817 815014362 814751863 814352334 813919306 813477933 813034713 812451124
3165.5 812451124 811596632 810496569 809225917 807752132 806027949 804243624 802747250 801704764
3181.8 801704764 801057756 800691068 800450563 800124288 799603403 799012721 798559070 798336625 798317373 798459232
3202.2 798459232 798703492 798846662 798697472 798355281 798013449 797672033 797217011 796593606 795832813 794923186
3222.6 794923186 793756068 792368114 790982485 789669454 788180530 786237001 783969581 781645477
$$ packed form
3083.9H04114521r9838k06292O7651L13163L98338M43101L50714l8445n42641p03156
3104.3H04097116m09544o5445J12831M48883R42230J059830P99656N16772L44634L68774
3124.7H08215737N42701O98566O81102N45740N42999P25746P77543M78327K24709L06070
3145.1H13739240M21405M23908L52264P7545k62499l99529m33028m41373m43220n83589
3165.5H12451124q54492j100063j270652j473785j724183j784325j496374j042486
3181.8H01704764o47008l66688k40505l26275n20885n90682m53651k22445j9252J41859
3202.2G98459232K44260J43170j49190l42191l41832l41416m55022o23405p60793r09627
3222.6G94923186j167118j387954j385629j313031j488924j943529k267420k324104
$$ plain form
3238.9 781645477 779240370 776732504 774220288 771522820 768326223 764804006 761373222 758052468
3255.2 758052468 754658580 751326859 748309255 745547116 742835581 740142465 737501919 734681785
3271.5 734681785 731503367 728220761 725112796 722071648 718668222 714611232 709908485 704625070
3287.8 704625070 698896289 692871809 686621130 680181861 673587203 667227924 661943436 658399522
3304.2 658399522 656789601 657224834 659911811 664765656 671304703 678957820 687202394 695514381
3320.5 695514381 703431547 710663855 717109144 722773492 727638721 731750906 735274255 738302231
3336.8 738302231 740825117 742818594 744339943 745488584 746225536 746477246 746343493 745989442 745412409
3355.2 745412409 744543135 743468821 742256522 740842998 739277422 737685919 736064136 734342158
$$ packed form
3238.9G81645477k405107k507866k512216k697468l196597l522217l430784l320754
3255.2G58052468l393888l331721l017604k762139k711535k693116k640546k820134
3271.5G34681785l178418l282606l107965l041148l403426m056990m702747n283415
3287.8G04625070n728781o024480o250679o439269o594658o359279n284488l543914
3304.2F58399522j609921M35233K686977M853845O539047P653117Q244574Q311987
3320.5F95514381P917166P232308O445289N664348M865229M112185L523349L027976
3336.8G38302231K522886J993477J521349J148641P36952K51710j33753l54051n77033
3355.2G45412409q69274j074314j212299j413524j565576j591503j621783j721978
$$ plain form
3371.5 734342158 732528687 730740309 729056358 727434635 725813687 724221289 722754836 721456409
3387.8 721456409 720261216 719018281 717668951 716369390 715273738 714289784 713105619 711686194
3404.1 711686194 710415244 709421158 708524883 707637191 706690252 705696881 704830050 704145610 703566074
3422.5 703566074 703087926 702780187 702660620 702591419 702564776 702687085 702771068 702646077 702536702 702702582
3442.9 702702582 703114927 703631878 704184413 704811454 705531836 706295788 707144558 708114147 709075391 710072756
3463.2 710072756 711314857 712643623 713639438 714247584 714875221 715806901 717043340 718319416 719289839
3481.6 719289839 720139921 721195877 722311378 723355114 724465370 725696981 726971269 728154540
3497.9 728154540 729273498 730483294 731664300 732681572 733700395 734944940 736480892 738013625
$$ packed form
3371.5G34342158j813471j788378j683951j621723j620948j592398j466453j298427
3387.8G21456409j195193j242935j349330j299561j095652r83954j184165j419425
3404.1G11686194j270950r94086q96275q87692r46939r93371q66831o84440n79536
3422.5G03566074m78148l07739j19567o9201k6643J22309Q3983j24991j09375J65880
3442.9G02702582M12345N16951N52535O27041P20382P63952Q48770R69589R61244R97365
3463.2G10072756J242101J328766R95815O08146O27637R31680J236439J276076R70423
3481.6G19289839Q50082J055956J115501J043736J110256J231611J274288J183271
3497.9G28154540J118958J209796J181006J017272J018823J244545J535952J532733
$$ plain form
3514.2 738013625 739291668 740525901 741964877 743550301 744950414 746099532 747362792 748836219
3530.6 748836219 750356793 751965165 753612995 755131066 756708264 758524001 760346651 761878431
3546.9 761878431 763203204 764612973 766162217 767720699 769259632 770875096 772572994 774167418
3563.2 774167418 775593221 777205884 779164732 781058729 782752216 784497559 786448479 788572490
3579.5 788572490 790751100 792844474 794783413 796676874 798695862 800728738 802728772 804847419
3595.8 804847419 807071567 809205890 811230779 813189209 814975083 816696405 818533242 820440650
3612.1 820440650 822354019 824072778 825651169 827465534 829283059 830709577 831762314 832847297
3628.5 832847297 834347188 835792184 836970329 838071764 839122117 840073347 840980768 841808319 842362821
$$ packed form
3514.2G38013625J278043J234233J438976J585424J400113J149118J263260J473427
3530.6G48836219J520574J608372J647830J518071J577198J815737J822650J531780
3546.9G61878431J324773J409769J549244J558482J538933J615464J697898J594424
3563.2G74167418J425803J612663J958848J893997J693487J745343J950920K124011
3579.5G88572490K178610K093374J938939J893461K018988K032876K000034K118647
3595.8H04847419K224148K134323K024889J958430J785874J721322J836837J907408
3612.1H20440650J913369J718759J578391J814365J817525J426518J052737J084983
3628.5H32847297J499891J444996J178145J101435J050353R51230R07421Q27551N54502
$$ plain form
3646.8 842362821 842856109 843724310 844580889 845095634 845649600 846419752 847002506 847295582 847467184 847437561
3667.2 847437561 847269535 847377419 847446978 847168684 847185254 847575903 848001897 848498583 849094868 849675179
3687.6 849675179 850069463 850380123 850795627 851159811 851312160 851340115 851452470 851734698 851965129 851966560
3708 851966560 851781487 851743460 852049649 852348208 852464378 852441490 852287889 852091134 852110326 852386534
3728.4 852386534 852527440 852348864 852164209 852308214 852618873 852650523 852172017 851681828 851749778 851734638
3748.8 851734638 851476729 851603687 851936281 852030218 851980031 852053404 852171719 852172792 852082074 851987898 851988852
3771.2 851988852 852081180 852202475 852280736 852245986 852114677 851927817 851805687 851812124 851837277 851821780 851724744
3793.7 851724744 851558149 851402104 851102054 850853920 850962460 850940347 850807369 850921214 851054013 850935936
$$ packed form
3646.8H42362821M93288Q68201Q56579N14745N53966P70152N82754K93076J71602k9623
3667.2H47437561j68026J07884O9559k78294J6570L90649M25994M96686N96285N80311
3687.6H49675179L94284L10660M15504L64184J52349K7955J12355K82228K30431J431
3708H51966560j85073l8027L06189K98559J16170k2888j53601j96755J9192K76208
3728.4H52386534J40906j78576j84655J44005L10659L1650m78506m90189O7950j5140
3748.8H51734638k57909J26958L32594R3937n0187P3373J18315J073r0718r4176R54
3771.2H51988852R2328J21295P8261l4750j31309j86860j22130O437K5153j5497r7036
3793.7H51724744j66595j56045l00050k48134J08540k2113j32978J13845J32799j18077
$$ plain form
3814.1 850935936 850732625 850668490 850441158 850229681 850299597 850353718 850350261 850316226 850315452 850386798 850197434
3836.5 850197434 849768043 849636614 849776864 849953115 850117087 850132346 849642932 848600745 848272920 848841846
3856.9 848841846 849238753 849264801 849087000 848964453 848892987 848651469 848474979 848501742 848595023 848623991
3877.3 848623991 848437428 848315120 848348260 848298073 848251581 848152637 847974181 847979724 848083735 847972572 847639441
3899.7 847639441 847261846 847012460 847083449 847325087 847462416 847506166 847473025 847275078 847018182 846924722
3920.1 846924722 846967459 846995652 847002327 846949339 846792579 846683919 846692860 846701026 846665204 846544683 846384108
3942.5 846384108 846366704 846418500 846363366 846278191 846271455 846296608 846285641 846222162 846136868 846087098 846049011 845962465
3967 845962465 845882058 845860779 845850170 845841527 845857859 845865428 845840871 845788181 845681667 845530093 845401168 845304012
$$ packed form
3814.1H50935936k03311o4135k27332k11477O9916N4121l457l4035p74P1346j89364
3836.5H50197434m29391j31429J40250J76251J63972J5259m89414j042187l27825N68926
3856.9H48841846L96907K6048j77801j22547p1466k41518j76490K6763R3281K8968
3877.3H48623991j86563j22308L3140n0187m6492r8944j78456N543J04011j11163l33131
3899.7H47639441l77595k49386P0989K41638J37329M3750l3141j97947k56896r3460
3920.1H46924722M2737K8193O675n2988j56760j08660Q941Q166l5822j20521j60575
3942.5H46384108j7404N1796n5134q5175o736K5153j0967o3479q5294m9770l8087q6546
3967H45962465q0407k1279j0609q643J6332P569k4557n2690j06514j51574j28925r7156
$$ plain form
3991.5 845304012 845237195 845224202 845207512
3997.6 845207512
$$ packed form
3991.5H45304012o6817j2993j6690
3997.6H45207512
##END=$$ End of the data block
