##TITLE=Sarita 01 $$ Begin of the data block
##JCAMP-DX=5.00 $$ ACD/SpecManager v 10.08
##SPECTROMETER/DATA SYSTEM=Alpha
##DATE=04 Sep 2014 08:34:00
##DATA TYPE=INFRARED SPECTRUM
##DATA CLASS=XYDATA
##ORIGIN=
##OWNER=
##NPOINTS=1765
##FIRSTX=399.76428223
##LASTX=3997.64306641
##MAXX=3997.64306641
##MINX=399.76428223
##MAXY=0.86664891
##MINY=0.42551777
##XFACTOR=1.0000000000
##YFACTOR=1.000000000000000e-9
##FIRSTY=0.83370107
##DELTAX=2.03961372
##XUNITS=1/CM
##YUNITS=ARBITRARY UNITS
##XYDATA=(X++(Y..Y))
$$ plain form
399.8 833701074 838551581 842959642 843625546 841626525 840581715 841503382 842148304 842203617 843723476
418.1 843723476 845877647 845605552 843755126 842960775 843775749 844175637 842960894 841840565 842398524
436.5 842398524 843242764 842642367 841508985 841642380 842566192 842302620 840876400 840315223 841399252
454.8 841399252 842273653 841267169 839965940 839969814 840261340 839437962 838385344 838620365 839110553 838061154
475.2 838061154 836381316 835980296 836367905 835442305 833171964 831620395 830812633 828399837 823546231
493.6 823546231 817659080 809938371 794391990 762803793 723703206 700646639 688578844 671295226
509.9 671295226 674274266 719663978 777326822 812853098 826554954 831903756 834949493 835892677
526.2 835892677 834514499 832607687 831636369 831283331 830953717 831383348 833297968 835637152 836829245
$$ packed form
399.8H33701074M850507M408061O65904j999021j044810R21667O44922N5313J519859
418.1H43723476K154171k72095j850426p94351Q14974L99888j214743j120329N57959
436.5H42398524Q44240o00397j133382J33395R23812k63572j426220n61177J084029
454.8H41399252Q74401j006484j301229L874K91526q23378j052618K35021M90188j049399
475.2H38061154j679838m01020L87609r25600k270341j551569q07762k412796m853606
493.6H23546231n887151p720709j5546381l1588197l9100587k3056567j2067795j7283618
509.9F71295226K979040M5389712N7662844L5526276J3701856N348802L045737R43184
526.2H35892677j378178j906812r71318l53038l29614M29631J914620K339184J192093
$$ plain form
544.6 836829245 836815298 836708605 836928964 836948931 836377859 835701764 835604370 835788131 835471690 834913671
565 834913671 834973216 835513175 835609078 835057378 834715128 835091054 835547984 835272491 834680557 834614158 834634840
587.4 834634840 833633721 831660271 829948246 828757644 826489806 820626974 808290839 790258884
603.7 790258884 779027224 787188411 806552112 820781171 825041473 820340395 810101032 805941164
620 805941164 815476775 829622567 837926865 841469586 843931675 845496774 845561445 844963670 844817460
638.4 844817460 844595790 842790186 840190172 840216577 843557417 846687496 847490251 847499132 848231792 848962367
658.8 848962367 848570883 847847223 847706735 847288907 846405029 846404672 846946836 847558975 847478569 846432686
679.2 846432686 845674336 845946074 846199214 845411360 844315052 844037116 844105005 843329489 841833353 840678453
$$ packed form
544.6H36829245j3947j06693K20359J9967n71072o76095r7394J83761l16441n58019
565H34913671N9545N39959R5903n51700l42250L75926M56930k75493n91934o6399K0682
587.4H34634840j001119j973450j712025j190602k267838n862832j2336135j8031955
603.7G90258884j1231660Q161187J9363701J4229059M260302m701078j0239363m159868
620H05941164R535611J4145792Q304298L542721K462089J565099O4671n97775j46210
638.4H44817460k21670j805604k600014K6405L340840L130079Q02755Q881P32660P30575
658.8H48962367l91484p23660j40488m17828q83878l57N42164O12139q0406j045883
679.2H46432686p58350K71738K53140p87854j096308k77936O7889p75516j496136j154900
$$ plain form
699.6 840678453 839732766 837814391 835578144 834949672 835573137 835565567 834240437 832356989 830737114
717.9 830737114 829177141 827006400 824262142 821601808 819153368 816169679 812167108 807521820
734.3 807521820 802524567 796596825 789001584 779932320 770277619 760734200 751700521 743962646
750.6 743962646 738736331 736965060 738667190 743240952 750376642 759737194 769813955 777265429
766.9 777265429 778785169 778739929 788275599 806953609 822716892 831308901 836456776 840177119
783.2 840177119 842237949 842975020 843591332 844444454 844762623 844199777 843425333 842556000 840122759
801.6 840122759 834456384 825679302 814683914 799883604 776075900 736439466 678422570 615255237
817.9 615255237 574469507 574087918 609162152 660305142 708822310 748261154 780427516 805117607
$$ packed form
699.6H40678453r45687j918375k236247o28472O23465p570j325130j883448j619875
717.9H30737114j559973k170741k744258k660334k448440k983689m002571m645288
734.3H07521820m997253n927742p595241r069264r654701r543419r033679p737875
750.6G43962646n226315j771271J702130M573762P135690R360552J0076761P451474
766.9G77265429J519740m5240R535670J8678010J5763283Q592009N147875L720343
783.2H40177119K060830P37071O16312Q53122L18169n62846p74444q69333k433241
801.6H40122759n666375q777082j0995388j4800310k3807704l9636434n8016896o3167333
817.9F15255237m0785730l81589L5074234N1142990M8517168L9438844L2166362K4690091
$$ plain form
834.2 805117607 820767403 829595327 836127043 842092752 846303403 847532630 845568299 842162132
850.5 842162132 841020048 844277978 849871933 854630172 857915580 860408902 861967266 862408876 862571895
868.9 862571895 863242805 864040911 864250124 864156723 864614427 865553141 866046309 865866244 865810156 866305828
889.3 866305828 866648912 866247416 865708232 865826905 866277337 866194367 865674555 865587473 866068125 866271913
909.7 866271913 865813434 865374029 865450799 865417004 864543378 863229215 862419009 862239182 861844242 860662520
930.1 860662520 858566999 854278445 846576214 840442300 843096793 851364434 856864572 857705653 856058538
948.4 856058538 853461981 850282371 846409023 841915727 836884201 832685053 830504775 829828680 832553208
966.8 832553208 839461625 845899999 848566413 848390281 847372532 846294701 844308317 840455353 834693074
$$ packed form
834.2H05117607J5649796Q827924O531716N965709M210651J229227j964331l406167
850.5H42162132j142084L257930N593955M758239L285408K493322J558364M41610J63019
868.9H62571895O70910P98106K09213r3401M57704R38714M93168j80065n6088M95672
889.3H66305828L43084m01496n39184J18673M50432q2970n19812q7082M80652K03788
909.7H66271913m58479m39405P6770l3795q73626j314163q10206j79827l94940j181722
930.1H60662520k095521m288554p702231o133914K654493Q267641N500138Q41081j647115
948.4H56058538k596557l179610l873348m493296n031526m199148k180278o76095K724528
966.8H32553208O908417O438374K666414j76132j017749j077831j986384l852964n762279
$$ plain form
985.1 834693074 827386975 819985211 816557109 819839656 826725066 831834435 832732797 830081165 825658023
1003.5 825658023 820150733 812092125 799710989 784925222 775659144 779609263 792206466 799863517
1019.8 799863517 801919162 808446944 817549407 821690977 820943832 816632092 807103753 791165233
1036.1 791165233 772798359 762498558 768463492 786344409 804896832 818250597 826680362 831563473
1052.4 831563473 834038019 835455239 836722851 837752044 838132620 838108718 838280976 838658154 838703036
1070.8 838703036 838242590 837802172 837806582 837927759 837650418 837195575 837093294 837252796 837101042 836485326
1091.2 836485326 835918069 835680187 835256398 834113657 832570195 831169605 829472661 826121628 819938719
1109.6 819938719 811715305 806299508 807843447 812622786 814816058 814391851 814541698 817649603 823239446
$$ packed form
985.1H34693074p306099p401764l428102L282547O885410N109369Q98362k651632m423142
1003.5H25658023n507290q058608j2381136j4785767r266078L950119J2597203P657051
1019.8G99863517K055645O527782R102463M141570p47145m311740r528339j5938520
1036.1G91165233j8366874j0299801N964934J7880917J8552423J3353765Q429765M883111
1052.4H31563473K474546J417220J267612J029193L80576k3902J72258L77178M4882
1070.8H38703036m60446m40418M410J21177k77341m54843j02281J59502j51754o15716
1091.2H36485326n67257k37882m23789j142741j543462j400590j696944l351033o182909
1109.6H19938719q223414n415797J543939M779339K193272m24207J49847L107905N589843
$$ plain form
1127.9 823239446 828517973 831747413 833040297 833256543 833420277 833845019 833997011 833566904 833070099
1146.3 833070099 833009958 833100975 832784951 832155943 831725419 831501424 831038833 830219924 829502583 829220176
1166.7 829220176 829037666 828465998 827515960 826063812 822650731 816011488 810607672 813371241 821614325
1185 821614325 827285707 828810573 828777313 828597903 828248441 827331662 825949669 824515760 822769523
1203.4 822769523 819575489 814475596 810271382 810564041 813601196 815438569 815961480 816281319 815892279
1221.7 815892279 813868999 810199142 806330621 804384589 804778993 805602014 805291474 803860962 801563263
1240.1 801563263 798523247 795256197 792324483 789606571 786347985 781738102 774983704 764760137
1256.4 764760137 748962283 725960672 700160921 688591659 708232164 750000536 786831617
$$ packed form
1127.9H23239446N278527L229440J292884K16246J63734M24742J51992m30107m96805
1146.3H33070099o0141R1017l16024o29008m30524k23995m62591q18909p17341k82407
1166.7H29220176j82510n71668r50038j452148l413081o639243n403816K763569Q243084
1185H21614325N671382J524866l3260j79410l49462r16779j381993j433909j746237
1203.4H22769523l194034n099893m204214K92659L037155J837373N22911L19839l89040
1221.7H15892279k023280l669857l868521j946032L94404Q23021l10540j430512k297699
1240.1H01563263l040016l267050k931714k717912l258586m609883o754398j0223567
1256.4G64760137j5797854k3001611k5799751j1569262J9640505M1768372L6831081
$$ plain form
1270.7 786831617 805896699 812208652 812598348 810210407 806606233 802624702 798240244 793056726
1287 793056726 787048221 780781984 774892926 769198418 762544572 754210472 745553792 740760148 741269052
1305.4 741269052 739060879 725246608 699939787 666353703 626297057 585076630 552300394
1319.6 552300394 538374484 556987584 613613963 686613858 745997190 781026721 797459424
1333.9 797459424 803820193 804939568 802129567 796290994 789134681 781722188 774154603 765965104
1350.2 765965104 757125497 747899890 737229407 721598208 696097493 661657095 637489259 645406365
1366.6 645406365 680513203 717182457 736925840 734190941 714581907 703261197 717938900
1380.8 717938900 742290199 755475581 757017314 752215624 743449509 729679585 708149195 676994443
$$ packed form
1270.7G86831617J9065082O311953L89696k387941l604174l981531m384458n183518
1287G93056726o008505o266237n889058n694508o653846q334100q656680m793644N08904
1305.4G41269052k208173j3814271k5306821l3586084m0056646m1220427l2776236
1319.6E52300394j3925910J8613100N6626379P2999895N9383332L5029531J6432703
1333.9G97459424O360769J119375k810001n838573p156313p412493p567585q189499
1350.2G65965104q839607r225607j0670483j5631199k5500715l4440398k4167836P917106
1366.6F45406365L5106838L6669254J9743383k734899j9609034j1320710J4677703
1380.8G17938900K4351299J3185382J541733m801690q766115j3769924k1530390l1154752
$$ plain form
1397.1 676994443 634420991 597744524 603105962 659168959 725792885 767382741 784856737
1411.4 784856737 789087832 787660301 783584893 776643574 767892957 757995903 746565104 734790027
1427.7 734790027 723339677 713214874 704567373 693415940 677628458 663523495 655388713 652803957
1444.1 652803957 651502013 645438135 632414520 616707146 607218623 616883099 650215030 685065687
1460.4 685065687 711294293 729448438 738071859 739991248 739333034 736592412 732179880 727911651
1476.7 727911651 724110246 720072091 715213478 709881425 704276264 697777331 690062582 682568848
1493 682568848 675083280 665253460 652216673 636806726 619699895 596050262 560923755 532962561
1509.3 532962561 524423480 535987079 565689921 601230443 627631664 642202079 646296382 642694056
$$ packed form
1397.1F76994443m2573452l6676467N361438N6062997O6623926M1589856J7473996
1411.4G84856737M231095j427531m075408o941319q750617r897054j1430799j1775077
1427.7G34790027j1450350j0124803q647501j1151433j5787482j4104963q134782k584756
1444.1F52803957j301944o063878j3023615j5707374r488523R664476L3331931L4850657
1460.4F85065687K6228606J8154145Q623421J919389o58214k740622m412532m268229
1476.7G27911651l801405m038155m858613n332053n605161o498933p714749p493734
1493F82568848p485568r829820j3036787j5409947j7106831k3649633l5126507k7961194
1509.3E32962561q539081J1563599K9702842L5540522K6401221J4570415M094303l602326
$$ plain form
1525.6 642694056 634934366 626731396 620068491 614986122 612341583 611962378 610596240 603555262
1542 603555262 589286208 567705452 542837083 523523271 522810757 545768619 583200574 631184876
1558.3 631184876 677442372 702972293 721779287 740763605 758560061 773054123 781149089
1572.6 781149089 783915222 781151533 773265660 762521923 748467803 731015682 710710466 688012183
1588.9 688012183 663340211 637019932 609230757 581459105 557013273 539547145 530920088
1603.2 530920088 529142380 529458344 529413819 533220828 547507644 576101243 612717450 638462305
1619.5 638462305 650819719 654991329 654457152 652845621 649987042 644920766 637062669 624144197
1635.8 624144197 609145820 596268237 585462809 577831209 573391199 570176244 565906286 552869260
$$ packed form
1525.6F42694056p759690q202970o662905n082369k644539l79205j366138p040978
1542F03555262j4269054k1580756k4868369j9313812p12514K2957862L7431955M7984302
1558.3F31184876M6257496K5529921J8806994J8984318J7796456J4494062Q094966
1572.6G81149089K766133k763689p885873j0743737j4054120j7452121k0305216k2698283
1588.9F88012183k4671972k6320279k7789175k7771652k4445832j7466128q627057
1603.2E30920088j777708L15964m4525L807009J4286816K8593599L6616207K5744855
1619.5F38462305J2357414M171610n34177j611531k858579n066276p858097j2918472
1635.8F24144197j4998377j2877583j0805428p631600m440010l214955m269958j3037026
$$ plain form
1652.1 552869260 520663798 484958589 453742117 430570185 425517768 439643711 464971662
1666.4 464971662 502196372 550049782 592976749 629283071 660588145 684018016 703254461
1680.7 703254461 722349048 741868615 756234169 766602933 776406407 785441577 795010507 804473758
1697 804473758 812225938 818518162 822733164 826124668 829107165 831170380 833213985 835897207 839127004
1715.3 839127004 841816068 842745543 843047559 843547463 844030797 844506919 845389068 846800625 848385751
1733.7 848385751 849326432 850501835 852532864 854403794 855796754 857148230 858578742 859514058 859458029
1752 859458029 859061420 858933747 858820856 858750880 858733356 858729243 859272122 860391915 861689150 862473488
1772.4 862473488 862365007 862057328 862032115 861998737 861686170 861121714 860418916 859990120 859885454 859631419
$$ packed form
1652.1E52869260l2205462l5705209l1216472k3171932n052417J4125943K5327951
1666.4D64971662L7224710M7853410M2926967L6306322L1305074K3429871J9236445
1680.7G03254461J9094587J9519567J4365554J0368764R803474R035170R568930R463251
1697H04473758P752180O292224M215002L391504K982497K063215K043605K683222L229797
1715.3H39127004K689064R29475L02016M99904M83334M76122Q82149J411557J585126
1733.7H48385751R40681J175403K031029J870930J392960J351476J430512R35316n6029
1752H59458029l96609j27673j12891o9976j7524m113N42879J119793J297235P84338
1772.4H62473488j08481l07679k5213l3378l12567n64456p02798m28796j04666k54035
$$ plain form
1792.8 859631419 859422445 859953105 861031473 861908734 862237394 862442195 862896264 863410592 863560736
1811.2 863560736 863282323 862968206 862654150 862212598 861917675 862134457 862662196 863195717 863513768 863318384
1831.6 863318384 863018572 862936199 862854660 862859190 863300383 863785446 863538861 862885535 862403214 862085938
1852 862085938 861772358 861418605 861076951 860781193 860481560 860260665 860261261 860222578 859748304 859176338 858917713
1874.4 858917713 858868718 858843029 858754456 858583748 858354926 858147562 857736230 856535792 854291081 850764215
1894.8 850764215 845698535 840468884 838310659 841067433 846514404 851166964 853818655 855095804
1911.1 855095804 855901897 856644332 857105970 856997728 856574833 856095672 855643630 855446279 855535746 855699480
1931.5 855699480 855687141 855389476 855013072 854901373 855010509 854964793 854795039 854736388 854712367 854571819
$$ packed form
1792.8H59631419k08974N30660J078368Q77261L28660K04801M54069N14328J50144
1811.2H63560736k78413l14117l14056m41552k94923K16782N27739N33521L18051j95384
1831.6H63318384k99812q2373q1539M530M41193M85063k46585o53326m82321l17276
1852H62085938l13580l53753l41654k95758k99633k20895N96l8683m74274n71966k58625
1874.4H58917713m8995k5689q8573j70708k28822k07364m11332j200438k244711l526866
1894.8H50764215n065680n229651k158225K756774N446971M652560K651691J277149
1911.1H55095804Q06093P42435M61638j08242m22895m79161m52042j97351Q9467J63734
1931.5H55699480j2339k97665l76404j11699J09136m5716j69754n8651k4021j40548
$$ plain form
1951.9 854571819 854332924 854072809 853783667 853376985 852822602 852292061 851923347 851625323 851345301 851169884
1972.3 851169884 851106584 851026237 850872636 850791156 850891352 851043284 851115704 851166666 851242423 851189554 850911319
1994.8 850911319 850505471 850086391 849779427 849622011 849554718 849546134 849577904 849577904 849511266 849435389 849339843 849156916
2019.2 849156916 848895252 848602235 848311782 848062634 847855926 847669601 847505927 847412050 847435832 847539067
2039.6 847539067 847611845 847600102 847549558 847469330 847350955 847209752 847055733 846886814 846703410 846521318
2060 846521318 846372187 846248865 846073389 845841646 845607579 845371902 845133305 844932079 844756246 844542921
2080.4 844542921 844278097 844031751 843894303 843899190 844027996 844236255 844471097 844637454 844680309 844637334
2100.8 844637334 844575763 844511747 844406903 844252884 844067335 843879580 843699932 843529224 843401790 843353987
$$ packed form
1951.9H54571819k38895k60115k89142m06682n54383n30541l68714k98024k80022j75417
1972.3H51169884o3300q0347j53601q1480J00196J51932P2420N0962P5757n2869k78235
1994.8H50911319m05848m19080l06964j57416o7293q584L1770%o6638p5877r5546j82927
2019.2H49156916k61664k93017k90453k49148k06708j86325j63674r3877K3782J03235
2039.6H47539067P2778j1743n0544q0228j18375j41203j54019j68919j83404j82092
2060H46521318j49131j23322j75476k31743k34067k35677k38597k01226j75833k13325
2080.4H44542921k64824k46346j37448M887J28806K08259K34842J66357M2855m2975
2100.8H44637334o1571o4016j04844j54019j85549j87755j79648j70708j27434m7803
$$ plain form
2121.2 843353987 843352020 843309999 843193293 843059719 842936993 842756033 842503369 842268288 842117310 841998816
2141.6 841998816 841820598 841584027 841392696 841286123 841172695 841031492 840949535 840944290 840927482 840807199
2162 840807199 840583324 840333164 840072870 839799047 839636445 839736223 840041280 840313196 840403914 840373814
2182.4 840373814 840344608 840311110 840203226 840072691 840038538 840083301 840060890 839926839 839805603 839770973 839744151
2204.8 839744151 839635968 839471221 839340508 839191794 838888347 838504672 838249683 838166773 838111699 838011086
2225.2 838011086 837980688 838064492 838079095 837894201 837627709 837444365 837309718 837062240 836720467 836490214
2245.6 836490214 836429656 836387455 836275399 836178303 836178780 836175859 836046278 835879266 835779905 835658431 835370958
2268.1 835370958 834926605 834500194 834191918 833899558 833594561 833481073 833633840 833814681 833794296 833631098
$$ packed form
2121.2H43353987j967m2021j16706j33574j22726j80960k52664k35081j50978j18494
2141.6H41998816j78218k36571j91331j06573j13428j41203q1957n245j6808j20283
2162H40807199k23875k50160k60294k73823j62602R9778L05057K71916R0718l0100
2182.4H40373814k9206l3498j07884j30535l4153M4763k2411j34051j21236l4630k6822
2204.8H39744151j08183j64747j30713j48714l03447l83675k54989q2910n5074j00613
2225.2H38011086l0398Q3804J4603j84894k66492j83344j34647k47478l41773k30253
2245.6H36490214o0558m2201j12056r7096M77k921j29581j67012r9361j21474k87473
2268.1H35370958m44353m26411l08276k92360l04997j13488J52767J80841k0385j63198
$$ plain form
2288.5 833631098 833461046 833202004 832777262 832326710 831982195 831629038 831078649 830422461 830011010 830010355
2308.9 830010355 830134392 830036163 829714000 829289317 828707755 827896237 827047348 826494277 826260030 826111019
2329.3 826111019 825959980 825856328 825737596 825476289 825079560 824826062 825111270 825956047 826719761 826728523
2349.7 826728523 825883627 824587524 823265851 822071970 821252406 820958972 821094632 821538270 822242022
2368 822242022 823185444 824229896 825119197 825789988 826410353 827004790 827419519 827599525 827626467 827561498
2388.4 827561498 827389657 827134252 826889813 826740026 826704144 826757967 826849103 826919198 826918066 826795757 826609015
2410.8 826609015 826466024 826371610 826289833 826233029 826195598 826143920 826070189 825957239 825794637 825602055 825410843
2433.3 825410843 825219989 824994326 824747264 824521780 824306726 824080050 823844135 823586464 823316395 823090136
$$ packed form
2288.5H33631098j70052k59042m24742m50552l44515l53157n50389o56188m11451o55
2308.9H30010355J24037r8229l22163m24683n81562q11518q48889n53071k34247j49011
2329.3H26111019j51039j03652j18732k61307l96729k53498K85208Q44777P63714Q762
2349.7H26728523q44896j296103j321673j193881q19564k93434J35660M43638P03752
2368H22242022R43422J044452Q89301O70791O20365N94437M14729J80006K6942o4969
2388.4H27561498j71841k55405k44439j49787l5882N3823R1136P0095j132j22309j86742
2410.8H26609015j42991r4414q1777n6804l7431n1678p3731j12950j62602j92582j91212
2433.3H25410843j90854k25663k47062k25484k15054k26676k35915k57671k70069k26259
$$ plain form
2453.7 823090136 822927773 822767437 822578549 822411001 822318137 822309256 822335958 822333097 822260022 822120249 821936309
2476.1 821936309 821748316 821609259 821480453 821295023 821062863 820807159 820514202 820167601 819804668 819485128
2496.5 819485128 819295526 819319844 819483995 819622576 819652200 819568336 819408059 819204807 818976343 818731129
2516.9 818731129 818409503 817953110 817372561 816751540 816270411 816090107 816187382 816398859 816598713 816712737
2537.3 816712737 816683650 816510260 816191316 815724909 815211356 814841509 814754426 814918399 815155387 815311730
2557.7 815311730 815363467 815334439 815234959 815083385 814932168 814860106 814870656 814842999 814648271 814255178 813767850
2580.1 813767850 813415349 813352764 813484311 813653767 813818157 813916028 813874364 813727558 813569903 813434005
2600.5 813434005 813245654 812965751 812665105 812374651 812008500 811498046 810879350 810206592 809514165 808871388
$$ packed form
2453.7H23090136j62363j60336j88888j67548r2864q881K6702k861p3075j39773j83940
2476.1H21936309j87993j39057j28806j85430k32160k55704k92957l46601l62933l19540
2496.5H19485128j89602K4318J64151J38581K9624q3864j60277k03252k28464k45214
2516.9H18731129l21626m56393n80549o21021m81129j80304R7275K11477J99854J14024
2537.3H16712737k9087j73390l18944m66407n13553l69847q7083J63973K36988J56343
2557.7H15311730N1737k9028r9480j51574j51217p2062J0550k7657j94728l93093m87328
2580.1H13767850l52501o2585J31547J69456J64390R7871m1664j46806j57655j35898
2600.5H13434005j88351k79903l00646k90454l66151n10454o18696o72758o92427o42777
$$ plain form
2620.9 808871388 808481157 808548987 808998644 809541464 810007751 810442865 810880542 811224580 811396241 811439812
2641.3 811439812 811436474 811366379 811144471 810780108 810351551 809886992 809346735 808704436 808009267 807329476
2661.7 807329476 806743801 806369126 806316853 806562901 806877971 807018638 806947827 806787193 806599736 806354403
2682.1 806354403 806081355 805861950 805727422 805656672 805587828 805473804 805312216 805094242 804780841 804364145
2702.5 804364145 803916514 803515553 803122580 802623630 802010596 801397443 800879121 800471902 800190985 800024688
2722.9 800024688 799784482 799118280 797864735 796660364 796675742 798056722 799560308 800240636 800226808
2741.2 800226808 799928725 799561679 799174130 798753560 798366666 798070490 797762513 797332883 796792150 796147168
2761.6 796147168 795381486 794582248 793893635 793316364 792716503 792039752 791353345 790689707 789946258 789001763
$$ packed form
2620.9H08871388l90231O7830M49657N42820M66287M35114M37677L44038J71661M3571
2641.3H11439812l338p0095k21908l64363m28557m64559n40257o42299o95169o79791
2661.7H07329476n85675l74675n2273K46048L15070J40667p0811j60634j87457k45333
2682.1H06354403k73048k19405j34528p0750o8844j14024j61588k17974l13401m16696
2702.5H04364145m47631m00961l92973m98950o13034o13153n18322m07219k80917j66297
2722.9H00024688k40206o66202j253545j204371J5378J380980J503586O80328j3828
2741.2H00226808k98083l67046l87549m20570l86894k96176l07977m29630n40733o44982
2761.6G96147168p65682p99238o88613n77271n99861o76751o86407o63638p43449r44495
$$ plain form
2782 789001763 787892222 786699951 785348952 783718586 781895101 780165732 778845012 778115571 778038085
2800.4 778038085 778687119 779953539 781417370 782714725 783729136 784453034 784871161 784922004 784640193
2818.8 784640193 784186184 783608377 782808125 781755269 780560911 779319882 777983546 776505888 774967074
2837.1 774967074 773362875 771583021 769640267 767624199 765613735 763733089 762153447 760901690
2853.4 760901690 759783506 758620143 757227063 755405903 753441453 752385914 753474116 756918609
2869.7 756918609 761431515 765299559 767698228 768717706 768627882 767670929 766189575 764504731 762796998
2888.1 762796998 761246264 760123253 759559751 759354353 759199202 758992314 758743346 758307755 757381499
2906.5 757381499 755625427 752736807 748431206 742680311 736640573 733065963 734318674 739546418
$$ packed form
2782G89001763j109541j192271j350999j630366j823485j729369j320720p29441p7486
2800.4G78038085O49034J266420J463831J297355J014411P23898M18127N0843k81811
2818.8G84640193m54009n77807q00252j052856j194358j241029j336336j477658j538814
2837.1G74967074j604199j779854j942754k016068k010464j880646j579642j251757
2853.4G60901690j118184j163363j393080j821160j964450j055539J088202L444493
2869.7G56918609M512906L868044K398669J019478q9824r56953j481354j684844j707733
2888.1G62796998j550734j123011n63502k05398j55151k06888k48968m35591r26256
2906.5G57381499j756072k888620m305601n750895o039738l574610J252711N227744
$$ plain form
2922.8 739546418 745258093 748967171 750715733 751372039 751144350 749384284 744808197 736225009 724810302
2941.1 724810302 716376901 717479348 727443635 739053369 746923387 750405610 750580907 748220086
2957.4 748220086 743575692 737061739 730358124 726366282 727178812 732224047 738999248 745111406
2973.8 745111406 749377608 751836181 753095686 753673136 753858268 753762364 753357410 752596140 751440942
2992.1 751440942 749892116 748237431 747039855 746809483 747702777 749246478 750631928 751357615 751375198
3010.5 751375198 750939906 750420749 749918401 749170184 747878134 745874941 743118763 739661515 735637426
3028.8 735637426 731435180 727886975 725759029 724738181 723625362 721774757 719783127 718555093
3045.1 718555093 718107462 717667639 716574788 714699268 712276459 709599316 706910372 704478920 702592134
$$ packed form
2922.8G39546418N711675L709078J748562O56306k27689j760066m576087q583188j1414707
2941.1G24810302q433401J102447R964287J1609734P870018L482223J75297k360821
2957.4G48220086m644394o513953o703615l991842Q12530N045235O775201O112158
2973.8G45111406M266202K458573J259505N77450J85132r5904m04954p61270j155198
2992.1G51440942j548826j654685j197576k30372Q93294J543701J385450P25687J7583
3010.5G51375198m35292n19157n02348p48217j292050k003193k756178l457248m024089
3028.8G35637426m202246l548205k127946j020848j112819j850605j991630j228034
3045.1G18555093m47631m39823j092851j875520k422809k677143k688944k431452j886786
$$ plain form
3063.5 702592134 701487243 701323211 702226639 704293787 707413495 711199939 715128124 718731701 721812487
3081.9 721812487 724337399 726215422 727405846 727949619 727760971 726619303 724358559 720964491 716672838
3100.2 716672838 712165713 708423913 705845296 703623593 700570762 696264684 691052079 685514092
3116.5 685514092 680291235 676110923 673793375 674040616 676926851 681762695 687501073 693233490
3132.8 693233490 698393404 702717960 706071794 708369732 709790885 710620165 710954368 710867584 710389495
3151.2 710389495 709352851 707717478 705727696 703556478 701195061 698568165 695586026 692194700
3167.5 692194700 688422441 684295058 679780483 674971700 670072615 665253341 660740495 656923056
3183.8 656923056 654253244 653066278 653511286 655535221 658810675 662764370 666708052 670022130
$$ packed form
3063.5G02592134j104891j64032R03428K067148L119708L786444L928185L603577L080786
3081.9G21812487K524912J878023J190424N43773j88648j141668k260744l394068m291653
3100.2G16672838m507125l741800k578617k221703l052831m306078n212605n537987
3116.5F85514092n222857m180312k317548K47241K886235M835844N738378N732417
3132.8F93233490N159914M324556L353834K297938J421153Q29280L34203q6784m78089
3151.2G10389495j036644j635373j989782k171218k361417k626896k982139l391326
3167.5F92194700l772259m127383m514575m808783m899085m819274m512846l817439
3183.8F56923056k669812j186966M45008K023935L275454L953695L943682L314078
$$ plain form
3200.1 670022130 672402799 673819005 674343944 674096823 673173428 671704113 669889748 667858303 665597677
3218.5 665597677 663067758 660277665 657199144 653720617 649743557 645223618 640140235 634450614
3234.8 634450614 628181994 621529937 614719272 607922733 601292074 594962120 589124382 584189415
3251.1 584189415 580695391 578954816 578927338 580295444 582319558 583901525 584136069 582721829 579884470
3269.5 579884470 576044738 571720958 567347765 562927067 558253884 553274691 548136473 543276846
3285.8 543276846 539363265 537021399 536656976 538450599 542379916 548158169 555345535 563477218
3302.1 563477218 572067440 580704510 589118779 597164512 604771733 611812651 618059874 623346448
3318.4 623346448 627736211 631609678 635510623 639755487 644189537 648430169 652221799 655460835
$$ packed form
3200.1F70022130K380669J416206N24939k47121r23395j469315j814365k031445k260626
3218.5F65597677k529919k790093l078521l478527l977060m519939n083383n689621
3234.8F34450614o268620o652057o810665o796539o630659o329954n837738m934967
3251.1E84189415l494024j740575k7478J368106K024114J581967K34544j414240k837359
3269.5E79884470l839732m323780m373193m420698m673183m979193n138218m859627
3285.8E43276846l913581k341866l64423J793623L929317N778253P187366Q131683
3302.1E63477218Q590222Q637070Q414269Q045733P607221P040918O247223N286574
3318.4F23346448M389763L873467L900945M244864M434050M240632L791630L239036
$$ plain form
3334.8 655460835 658096433 660142004 661711514 662896991 663690805 664127648 664308727 664196074 663700700
3353.1 663700700 662909448 661957264 660868585 659555197 658039391 656517327 655006230 653281689 651242077
3371.5 651242077 649121702 647144318 645269513 643427312 641619325 639882326 638238072 636743367
3387.8 636743367 635478556 634205222 632640839 631060958 629877329 628936768 627672136 626030743
3404.1 626030743 624591231 623529375 622568369 621575832 620501280 619405866 618522167 617831767 617120028
3422.5 617120028 616461039 616064191 615889728 615724087 615610540 615687966 615716457 615518689 615352750 615463078
3442.9 615463078 615852952 616354406 616795599 617281914 617959440 618757725 619627237 620602965 621565640 622491062
3463.2 622491062 623636544 624962389 626005948 626630306 627262473 628206134 629429162 630714595 631762564
$$ packed form
3334.8F55460835K635598K045571J569510J185477P93814M36843J81079j12653m95374
3353.1F63700700p91252r52184j088679j313388j515806j522064j511097j724541k039612
3371.5F51242077k120375j977384j874805j842201j807987j736999j644254j494705
3387.8F36743367j264811j273334j564383j579881j183629r40561j264632j641393
3404.1F26030743j439512j061856r61006r92537j074552j095414q83699o90400p11739
3422.5F17120028o58989l96848j74463j65641j13547P7426K8491j97768j65939J10328
3442.9F15463078L89874N01454M41193M86315O77526P98285Q69512R75728R62675R25422
3463.2F22491062J145482J325845J043559O24358O32167R43661J223028J285433J047969
$$ plain form
3481.6 631762564 632662833 633694708 634764552 635776103 636910439 638197005 639454544 640618384
3497.9 640618384 641853333 643210709 644371033 645314813 646437764 647783279 649181664 650542676
3514.2 650542676 651847661 653216660 654774606 656492531 658064544 659338653 660564959 661910772
3530.6 661910772 663409114 665090263 666739404 668217719 669849753 671826601 673812091 675336242
3546.9 675336242 676586568 678038597 679592252 681106925 682760656 684604108 686509669 688455939
3563.2 688455939 690513015 692439556 693937480 695340514 697041154 699031055 701119661 703235626
3579.5 703235626 705499113 708047926 710715473 712903976 714552701 716380656 718545675 720722198
3595.8 720722198 722868323 724985003 726959407 728952467 731134295 733319759 735318244 737254739
$$ packed form
3481.6F31762564R00269J031875J069844J011551J134336J286566J257539J163840
3497.9F40618384J234949J357376J160324R43780J122951J345515J398385J361012
3514.2F50542676J304985J368999J557946J717925J572013J274109J226306J345813
3530.6F61910772J498342J681149J649141J478315J632034J976848J985490J524151
3546.9F75336242J250326J452029J553655J514673J653731J843452J905561J946270
3563.2F88455939K057076J926541J497924J403034J700640J989901K088606K115965
3579.5G03235626K263487K548813K667547K188503J648725J827955K165019K176523
3595.8G20722198K146125K116680J974404J993060K181828K185464J998485J936495
$$ plain form
3612.1 737254739 739142418 740948796 742695332 744101942 745218277 746651292 748680413 750650406
3628.5 750650406 751662731 752288342 753114522 754035115 754990101 755958319 757023871 758455336 760252178
3646.8 760252178 761591673 761590004 761151791 761265159 761637568 761884332 762057424 762216687 762666762 763560355
3667.2 763560355 764301240 764469087 764688671 764636338 763713479 762884736 762641907 762970746 763966978 765337408
3687.6 765337408 765989661 765565515 765115619 765111983 765442848 765961051 766261697 766190767 766357720 767080188
3708 767080188 767804027 767688572 767017484 766671538 766727865 766870618 766854405 766672194 766404808 766329765
3728.4 766329765 766822875 767720044 768268824 767929316 767235041 767110825 767562687 767684400 767498314 767728269
3748.8 767728269 767689228 766909719 766312897 766228080 766140640 765799165 765638471 765745938 765840054 765720069
$$ packed form
3612.1G37254739J887679J806378J746536J406610J116335J433015K029121J969993
3628.5G50650406J012325O25611Q26180R20593R54986R68218J065552J431465J796842
3646.8G60252178J339495j669m38213J13368L72409K46764J73092J59263M50075Q93593
3667.2G63560355P40885J67847K19584n2333r22859q28743k42829L28839R96232J370430
3687.6G65337408O52253m24146m49896l636L30865N18203L00646p0930J66953P22468
3708G67080188P23839j15455o71088l45946N6327J42753j6213j82211k67386p5043
3728.4G66329765M93110Q97169N48780l39508o94275j24216M51862J21713j86086K29955
3748.8G67728269l9041p79509n96822q4817q7440l41475j60694J07467R4116j19985
$$ plain form
3769.2 765720069 765234172 764743686 764699161 765042782 765228212 764934838 764591455 764367938 764153063 764028609
3789.6 764028609 764046729 764238536 764481902 764672637 764855504 764654338 764192581 763897240 763377845 762842000
3810 762842000 762860894 763258874 763482094 763615906 763769150 763264239 762525916 762178123 762063801 762150109
3830.4 762150109 762372971 762732387 763065159 762812436 762101412 761467934 760966837 760735154 761080861 761951149
3850.8 761951149 762304723 761210561 760145664 759893835 760089457 760293126 760189533 760108709 760141671 759837687
3871.2 759837687 759319246 758852065 758713007 758928061 758994639 758945704 758753657 758289814 758089542 757986605
3891.6 757986605 757607996 757467508 757796943 758196473 758272529 757886052 757213593 756674945 756432295 756385922
3912 756385922 756501794 756650686 756539106 756218135 755986214 755828142 755628824 755508900 755499840 755386114
$$ packed form
3769.2G65720069m85897m90486m4525L43621J85430k93374l43383k23517k14875j24454
3789.6G64028609J8120J91807K43366J90735J82867k01166m61757k95341n19395n35845
3810G62842000J8894L97980K23220J33812J53244n04911p38323l47793j14322Q6308
3830.4G62150109K22862L59416L32772k52723p11024o33478n01097k31683L45707Q70288
3850.8G61951149L53574j094162j064897k51829J95622K03669j03593q0824L2962l03984
3871.2G59837687n18441m67181j39058K15054O6578m8935j92047m63843k00272j02937
3891.6G57986605l78609j40488L29435L99530P6056l86477o72459n38648k42650m6373
3912G56385922J15872J48892j11580l20971k31921j58072j99318j19924r060j13726
$$ plain form
3932.3 755386114 755138278 754955709 754908860 754935741 754909456 754808426 754738748 754645228 754458368 754264772
3952.7 754264772 754106343 753974736 753913701 753920555 753880203 753773034 753694713 753662884 753615379 753532648 753455877
3975.2 753455877 753358662 753234565 753165007 753118157 752973974 752789021 752699614 752621472 752458692 752294481
3995.6 752294481 752175510
3997.6 752175510
$$ packed form
3932.3G55386114k47836j82569m6849K6881k6285j01030o9678r3520j86860j93596
3952.7G54264772j58429j31607o1035O854m0352j07169p8321l1829m7505q2731p6771
3975.2G53455877r7215j24097o9558m6850j44183j84953q9407p8142j62780j64211
3995.6G52294481j18971
3997.6G52175510
##END=$$ End of the data block
