##TITLE=Sample description $$ Begin of the data block
##JCAMP-DX=5.00 $$ ACD/SpecManager v 10.08
##SPECTROMETER/DATA SYSTEM=Alpha
##DATE=09 Oct 2013 09:28:52
##DATA TYPE=INFRARED SPECTRUM
##DATA CLASS=XYDATA
##ORIGIN=
##OWNER=
##NPOINTS=3334
##FIRSTX=599.63525391
##LASTX=3998.58886719
##MAXX=3998.58886719
##MINX=599.63525391
##MAXY=1.13323796
##MINY=0.38895732
##XFACTOR=1.0000000000
##YFACTOR=0.000000010000000
##FIRSTY=0.96469390
##DELTAX=1.01978803
##XUNITS=1/CM
##YUNITS=ARBITRARY UNITS
##XYDATA=(X++(Y..Y))
599.6I6469390O4081M31538O87981Q03882P81130O51253N05220M05205L55744L07381
609.8A01462805K20466J09148J6165j9765r954P522K38m0936l3999P9120K06530K61807
622.1A02259147K30968J59609J04547N6016J9658J7190K3556J0180L541K2209J1503
633.3A02918124p4756j96242l02959m12655m91249l40677P0835L91674M29940L37362
643.5A02329397K21479J20342M4966j6928k8527o461k4152l8039N9K3544L982j3125
655.7A02616537j1921j6070l2830m3321n0771n4693m8101m8006o0844q2886j20139
666.9A02046955j16170Q3554J04380M0578P570m613l1984r3007j53244j72591j75857
678.2A01535571k06280k78783l80027n03326o65062r00102j265067j800978k508432
$$ plain form
599.6 96469390 96533471 96965009 97652990 98456872 99238002 99889255 100394475 100799680 101155424 101462805
609.8 101462805 101683271 101792419 101808584 101788819 101778865 101786387 101786625 101745689 101711690 101790810 101997340 102259147
622.1 102259147 102490115 102649724 102754271 102810287 102829945 102847135 102870691 102880871 102884412 102906621 102918124
633.3 102918124 102843368 102647126 102344167 101931512 101440263 101099586 101170421 101562095 101992035 102329397
643.5 102329397 102550876 102671218 102716184 102699256 102670729 102664268 102640116 102602077 102602136 102625680 102629662 102616537
655.7 102616537 102604616 102588546 102555716 102512395 102461624 102406931 102358830 102310824 102249980 102167094 102046955
666.9 102046955 101930785 102014339 102118719 102159297 102166867 102162254 102130270 102037263 101884019 101711428 101535571
678.2 101535571 101329291 101050508 100670481 100167155 99502093 98601991 97336924 95535946 93027514
687.3I3027514l326678m015327m180723l596836k427525j042926K54160J367170K311235
696.5G8370064K997017L306914L235203K846187K254987J659018J169377P57718L69406
705.7I6965891l9625n88304j351595k040881j929551n17368J438939K492833K232725
714.9I6663064J416301P43455L46369J10894j7285m3059n000N2726J18321J86610K33412
726.1I9805808K38693K14541J82164J38390P7378P534o1285j25885j78659k25508l03805
737.3I9769366m20225n46044o86890q81785j135945j446599j842505k287865k715659
746.5H7805849l130465l533578l878808m072154l972030l497910k746850j951105j277417
755.7E9745532o43712L21603J921683L829211N206859N474294M782331L728449K756840
$$ plain form
687.3 93027514 89700836 85685509 81504786 77907950 75480425 74437499 74691659 76058829 78370064
696.5 78370064 81367081 84673995 87909198 90755385 93010372 94669390 95838767 96596485 96965891
705.7 96965891 96926266 96337962 94986367 92945486 91015935 90498567 91937506 94430339 96663064
714.9 96663064 98079365 98822820 99169189 99280083 99262798 99219739 99214739 99267465 99385786 99572396 99805808
726.1 99805808 100044501 100259042 100441206 100579596 100656974 100664508 100603223 100477338 100298679 100073171 99769366
737.3 99769366 99349141 98803097 98116207 97234422 96098477 94651878 92809373 90521508 87805849
746.5 87805849 84675384 81141806 77262998 73190844 69218814 65720904 62974054 61022949 59745532
755.7 59745532 59101820 59423423 61345106 65174317 70381176 75855470 80637801 84366250 87123090
764.8H7123090J981598J363433Q45706L96657j7238l84223n96213n33784j63346M25624
775I0441304J042134J456743J531071J320583R85980O34896L31056J11694o4701k28542
785.2I7562218l60400m62782n35476n71204o10250o47586o16515n43600m87692m61798
795.4I2264915m96489o31565q72719j214362j667451k218819k835083l467971m006529
804.6G4853927m296363m201638l663832k780080j778036q60453j57756K89369N79220
813.8E7984358Q61001J226819J699298K235467K730298L079444L229391L178466K952599
823G9177141K602583K183688J721072J268387Q85391N67180L03698J28436N7554O4463
833.2H8959593J44547K86829M08834M20213L15857J39070r1076l99846q84044j665515
$$ plain form
764.8 87123090 89104688 90468121 91313827 91710484 91693246 91309023 90712810 90179026 90015680 90441304
775 90441304 91483438 92940181 94471252 95791835 96777815 97412711 97743767 97855461 97790760 97562218
785.2 97562218 97201818 96739036 96203560 95632356 95022106 94374520 93758005 93214405 92726713 92264915
795.4 92264915 91768426 91136861 90264142 89049780 87382329 85163510 82328427 78860456 74853927
804.6 74853927 70557564 66355926 62692094 59912014 58133978 57273525 57115769 57405138 57984358
813.8 57984358 58845359 60072178 61771476 64006943 66737241 69816685 73046076 76224542 79177141
823 79177141 81779724 83963412 85684484 86952871 87838262 88405442 88709140 88837576 88895130 88959593
833.2 88959593 89104140 89390969 89799803 90220016 90535873 90674943 90583867 90184021 89299977 87634462
843.4H7634462k666718l295618k644181m81701K130568L760707L952861L259903K389157
852.5I4039440J692116J206220Q76182O48403M97896L98039K98679J92333J03092L9243
862.7I9991643j6331p4667j26684j77288k21330k61759l35241m63408o41817q53896
872.9I6819222j056856j154047j024223n81669J24925Q44926J298278J402140J249993
882.1I7922689R88519P46447N67615M36854L43955K73990K13170J60838R8788J3435
892.3A01766300o6876j11485j11747p1692q321N1582Q9967R6059N7984l3033j69778
903.5A01488960l15845m49193n36215n13113l63218j21433J41060L52139M92906N71478
913.7A00747526N86557N43881M66573L79050K92396K02537J11091L4654n96J7333O3407
$$ plain form
843.4 87634462 84967744 81672126 79027945 78546244 80676812 84437519 88390380 91650283 94039440
852.5 94039440 95731556 96937776 97813958 98462361 98960257 99358296 99656975 99849308 99952400 99991643
862.7 99991643 99975312 99900645 99773961 99596673 99375343 99113584 98778343 98314935 97673118 96819222
872.9 96819222 95762366 94608319 93584096 93002427 93127352 93972278 95270556 96672696 97922689
882.1 97922689 98911208 99657655 100225270 100662124 101006079 101280069 101493239 101654077 101752865 101766300
892.3 101766300 101699424 101587939 101476192 101404500 101396179 101447761 101537728 101633787 101691771 101658738 101488960
903.5 101488960 101173115 100723922 100187707 99674594 99311376 99189943 99331003 99683142 100176048 100747526
913.7 100747526 101334083 101877964 102344537 102723587 103015983 103218520 103329611 103364265 103363669 103381002 103444409
924.9A03444409J05918J30164J33813J25491J07074P5233M2343J4544j4722l6776n1928
936.2A04075563p7069r8371j02914j12200j30116j40644j34944j11306p9382m7087
946.4A03041530j2887J6034L3617M7397O1870O7139N3513K5987n018l4893p4315j24180
958.6A03095794j60873j73211j84453k12300k35855k48289k71404l18217l74794m26352
968.8A00490046m82583n35781n63270n67919n57255n12612m08870k43533m2617J58220
979I6733826L28207M38565M81999M71002M17155L43490K70116J85549Q9294K1363K1350
990.2I9801916Q8209J96671L21377M00149L65031K23780L8206j09386j40262q8131
1000.4A01097560q6320k03502m01222n92012o61873n23711k46817l7241m0370k27880
$$ plain form
924.9 103444409 103550327 103680491 103814304 103939795 104046869 104122102 104164445 104178989 104164267 104127491 104075563
936.2 104075563 103998494 103900123 103797209 103685009 103554893 103414249 103279305 103167999 103088617 103041530
946.4 103041530 103028643 103044677 103078294 103125691 103187561 103254700 103308213 103334200 103329182 103294289 103219974 103095794
958.6 103095794 102934921 102761710 102577257 102364957 102129102 101880813 101609409 101291192 100916398 100490046
968.8 100490046 100007463 99471682 98908412 98340493 97783238 97270626 96861756 96618223 96575606 96733826
979 96733826 97062033 97500598 97982597 98453599 98870754 99214244 99484360 99669909 99759203 99780566 99801916
990.2 99801916 99890125 100086796 100408173 100808322 101173353 101397133 101435339 101325953 101185691 101097560
1000.4 101097560 101011240 100807738 100406516 99814504 99152631 98628920 98382103 98344862 98304492 98076612
1010.6I8076612m59039o47223q26258j083374j459157j799548j779360j235723m09132
1019.8H8377798K66754N56135N30368M05264L51090L67909L54445K80124J79422P2438
1030I1741747j9878q2171j27018j55133j47098r8384j7845R0551K19500L46488M50820
1041.2I2201579N30487N91731O27005O16211N66470N11706M62568M05198L30359K62189
1051.4I7105503K28393K17313K17724K27069K46114K76393K87527K65592K28238J65206
1061.6I9465072P8106l266p7498j48213k12067k72984l26299l85416m63605n14483
1071.8I7139347m61615k58868N2040L42155M97216M80419L30329J22619q3584k44045
1082I7916013l31807l56871l55339l64035l89898m16011m30351m28111m02617l45808
$$ plain form
1010.6 98076612 97617573 96970350 96144092 95060718 93601561 91802013 90022653 88786930 88377798
1019.8 88377798 88644552 89200687 89731055 90136319 90487409 90855318 91209763 91489887 91669309 91741747
1030 91741747 91721869 91639698 91512680 91357547 91210449 91112065 91094220 91184771 91404271 91750759 92201579
1041.2 92201579 92732066 93323797 93950802 94567013 95133483 95645189 96107757 96512955 96843314 97105503
1051.4 97105503 97333896 97551209 97768933 97996002 98242116 98518509 98806036 99071628 99299866 99465072
1061.6 99465072 99543178 99539912 99462414 99314201 99102134 98829150 98502851 98117435 97653830 97139347
1071.8 97139347 96677732 96418864 96470904 96813059 97310275 97790694 98121023 98243642 98160058 97916013
1082 97916013 97584206 97227335 96871996 96507961 96118063 95702052 95271701 94843590 94440973 94095165
1092.2I4095165k55698j19752O0254K30694L34907L50982K73311J14643j01840l46798
1102.4I4635868n64235o96320p02500n55569k54762J19430M16475N43100N07986L82811
1112.6I3832284K62726K04515J98478K22301K72536L48109M35520N05316N45007N57923
1122.8I7384715N35709M77600M07237L39764K73305K11311J51115Q1319L916p3469
1133I9792522j57922k53278l57420m72748o00690p28285q31473r05627r45753r41371
1143.2I3597955r03988q45957p69323o65158n44721m66538m66233n25117n89109n79822
1153.4H7241989m73356l56555l41701m61430o85215r86504j364088j848233k485347
1162.6G8239560l277457m115963m725766m688215l673822j803249K51913J679754K207995
$$ plain form
1092.2 94095165 93839467 93719715 93779969 94010663 94345570 94696552 94969863 95084506 94982666 94635868
1102.4 94635868 94071633 93375313 92672813 92117244 91862482 91981912 92398387 92941487 93449473 93832284
1112.6 93832284 94095010 94299525 94498003 94720304 94992840 95340949 95776469 96281785 96826792 97384715
1122.8 97384715 97920424 98398024 98805261 99145025 99418330 99629641 99780756 99862075 99865991 99792522
1133 99792522 99634600 99381322 99023902 98551154 97950464 97222179 96390706 95485079 94539326 93597955
1143.2 93597955 92693967 91848010 91078687 90413529 89868808 89402270 88936037 88410920 87821811 87241989
1153.4 87241989 86768633 86412078 86070377 85608947 84923732 83937228 82573140 80724907 78239560
1162.6 78239560 74962103 70846140 66120374 61432159 57758337 55955088 56207001 57886755 60094750
1171.7F0094750K327603K592784K890605K793127K254117J562398R64809N71877M11862
1180.9G6463932M20660M68170M39793K76589l7664m90176j002294j428992j577508
1190.1G3532510j256716m51124N88065J479805J941114J931507J607758J153057O68765
1199.3H1194741J83290k99144p63446j190859j543069j748782j723278j371485o48207
1208.4G2089761L07149J153404J538670J307398O17450q9675l06970K15119J228363
1217.6G8060669K163094K603388K536821K182520J742601J331800R95344P40481N50776
1226.8I2907494M00305K80011J89894J17451M1062m0907j12659j76912k38556k90322
1237I3076861l28583l48264l54474l55304l45671l25519l10540k98601k76149k47097
$$ plain form
1171.7 60094750 62422353 65015137 67905742 70698869 72952986 74515384 75480193 76052070 76463932
1180.9 76463932 76884592 77352762 77792555 78069144 78031480 77541304 76539010 75110018 73532510
1190.1 73532510 72275794 71824670 72412735 73892540 75833654 77765161 79372919 80525976 81194741
1199.3 81194741 81378031 81078887 80315441 79124582 77581513 75832731 74109453 72737968 72089761
1208.4 72089761 72396910 73550314 75088984 76396382 77013832 76924157 76617187 76832306 78060669
1217.6 78060669 80223763 82827151 85363972 87546492 89289093 90620893 91616237 92356718 92907494
1226.8 92907494 93307799 93587810 93777704 93895155 93936217 93895310 93782651 93605739 93367183 93076861
1237 93076861 92748278 92400014 92045540 91690236 91344565 91019046 90708506 90409905 90133756 89886659
1247.2H9886659k10130j77979j62274j54042j58322j81395k18469k56252k70891k40076
1257.4H7856829j59341l8475R6894K11757K93028L44068L62933L52353L21781K85560
1267.6H9927387K62046K50542K33192K05755J74606J34247Q0109J4883o4230j48427
1277.8I1070110k16413k60872k86513k90907k70187k28590j87057j74106k00361k48128
1288H8706976k88504l15625l43114l78448m26608m92877n45156n20062l70628r3794
1298.2H4932160K18785L87907K31701l84503j525325k959382l752256k762693k95681
1307.4G4090713J873487K629000K351326J812881J368970J046485Q18300O65873N46164
1316.5H7203199M33278L33464K40594J71495J57868J88917K47312L10391L56370L89040
$$ plain form
1247.2 89886659 89676529 89498550 89336276 89182234 89023912 88842517 88624048 88367796 88096905 87856829
1257.4 87856829 87697488 87659013 87755907 87967664 88260692 88604760 88967693 89320046 89641827 89927387
1267.6 89927387 90189433 90439975 90673167 90878922 91053528 91187775 91267884 91282767 91218537 91070110
1277.8 91070110 90853697 90592825 90306312 90015405 89745218 89516628 89329571 89155465 88955104 88706976
1288 88706976 88418472 88102847 87759733 87381285 86954677 86461800 85916644 85396582 85025954 84932160
1298.2 84932160 85150945 85538852 85770553 85386050 83860725 80901343 77149087 74386394 74090713
1307.4 74090713 75964200 78593200 80944526 82757407 84126377 85172862 85991162 86657035 87203199
1316.5 87203199 87636477 87969941 88210535 88382030 88539898 88728815 88976127 89286518 89642888 90031928
1326.7I0031928M13453M21673M09461L83007L34442K46036J29342L9840J7893O3097
1336.9I2490172J53309K19280J70285K3418j08689k03705k87759l53485l90518l99286
1347.1I1313022l75825l28928k75379k13606j51574j18000j31732j92261k78878l76248
1357.3H8870591n11581o77991q91977j190049j614642k174431k550191k710443k800787
1366.5G3748499k705622k451843j986271j302862n41758K56568J057803J646412J882571
1375.7F9603497J988363K085757K096796J982832J795376J525974J155609P32738L94535
1384.9H3361477L08948N30231Q33714R84657J128614J232475J172996J091075J106721
1394I1750908R91869O83063N41914N45573M39906J74248P10o5727j44648k72161n05578
$$ plain form
1326.7 90031928 90445381 90867054 91276515 91659522 91993964 92240000 92369342 92409182 92427075 92490172
1336.9 92490172 92643481 92862761 93033046 93056464 92947775 92744070 92456311 92102826 91712308 91313022
1347.1 91313022 90937197 90608269 90332890 90119284 89967710 89849710 89717978 89525717 89246839 88870591
1357.3 88870591 88359010 87681019 86789042 85598993 83984351 81809920 79259729 76549286 73748499
1366.5 73748499 71042877 68591034 66604763 65301901 64760143 65016711 66074514 67720926 69603497
1375.7 69603497 71591860 73677617 75774413 77757245 79552621 81078595 82234204 82966942 83361477
1384.9 83361477 83670425 84200656 85034370 86019027 87147641 88380116 89553112 90644187 91750908
1394 91750908 92742777 93425840 93967754 94513327 94953233 95127481 95128191 95062464 94917816 94645655 94140077
1405.3I4140077p20555q06439q52680q78805q36134o78980m10885r0444K11310M35448
1415.5H9511913N56976N88095O02269M65775J21998O6555K16275K75755J76090Q4448
1425.7I2666149R5374J19942J39439R2733o4111j69295j95157k32220k15411j90783
1435.9I2046660n12701q72356q30471p81590p67100o78056n23925l52615k21956j62417
1446H6343473j93292l62616m31234j33181L62039P40301Q28803P78085P67642Q28129
1456.2H9528149O08486O9338o5297J40828M27771O17737O81847P19929N28997K55275
1466.4I3513060K42287L00085K78044K67553K50328j8263m58104n67215m99201o43373
1476.6I2665201p97706q33935r96441j533472k513957l471589l630793k362842o509
$$ plain form
1405.3 94140077 93419522 92613083 91760403 90881598 90045464 89366484 88955599 88865155 89076465 89511913
1415.5 89511913 90068889 90656984 91259253 91725028 91847026 91913581 92129856 92405611 92581701 92666149
1425.7 92666149 92761523 92881465 93020904 93113637 93049526 92880231 92685074 92452854 92237443 92046660
1435.9 92046660 91533959 90661603 89831132 89049542 88282442 87604386 87080461 86727846 86505890 86343473
1446 86343473 86150181 85787565 85356331 85223150 85585189 86325490 87154293 87932378 88700020 89528149
1456.2 89528149 90136635 90205973 90140676 90281504 90709275 91327012 92008859 92728788 93257785 93513060
1466.4 93513060 93755347 94055432 94333476 94601029 94851357 94833094 94374990 93807775 93308574 92665201
1476.6 92665201 91867495 91033560 90037119 88503647 85989690 82518101 78887308 76524466 76517957
1485.8G6517957K185715K851146K048969J025379l1501p73895j107353j451081k116883
1495G9148453l829884n509180n824554n429184k413696J831740M589259M869581L666520
1504.2G1099055K668863J751310k5433j333773j764828j826579j428973p46382N6148
1513.4F8449408Q88818J666940K399021K780408K252906J925624K431267K710992J926363
1522.5H7431747J300710J286060J416963J195270R52703Q37391O67459O25879O76721
1531.7I6390903P24691N46140J55103O2412K24721M54778O76727M35382n3370j07765
1541.9I9509722j13988l2037L8957n5563o9678Q3655K11662J51330j9264l0470J07306
1553.1I9781632Q2821j34480q7440K07591K41274n05471j307655j260978r93472r87989
$$ plain form
1485.8 76517957 78703672 81554818 83603787 84629166 84597665 83823770 82716417 81265336 79148453
1495 79148453 75318569 69809389 63984835 58555651 56141955 57973695 62562954 67432535 71099055
1504.2 71099055 73767918 75519228 75493795 74160022 72395194 70568615 69139642 68393260 68449408
1513.4 68449408 69338226 71005166 73404187 76184595 78437501 80363125 82794392 85505384 87431747
1522.5 87431747 88732457 90018517 91435480 92630750 93583453 94420844 95088303 95714182 96390903
1531.7 96390903 97115594 97661734 97816837 97879249 98103970 98558748 99235475 99670857 99617487 99509722
1541.9 99509722 99395734 99363697 99402654 99347091 99277413 99361068 99572730 99724060 99704796 99674326 99781632
1553.1 99781632 99864453 99729973 99642533 99850124 100091398 99585927 98278272 97017294 96023822 95035833
1563.3I5035833j245040j712155k015263k086401k202809k681464k720689j777178
1571.5G8594834r15909l86459j45101j53149l41421l4702P66695J417422J365000N86927
1581.7H0754137n28181j681119k756405l682410m210323l967751k730816q14712R98574
1590.9F1380994J897914J636880O02389o55705j728583k465057k891982l096056l131985
1600E1548809l025857k697623k071103j126725J0026J158413K105102K695692L085649
1609.2E1682383L356314L484201L507554L248030K635652K096135J985556J375860
1617.4G3371685K91824k38323o82599j119047j293981j132018l53765P94619J869965
1626.5G1508360K605408K476538J780831J341325J144314J076573J205176J750261
$$ plain form
1563.3 95035833 93790793 92078638 90063375 87976974 85774165 83092701 80372012 78594834
1571.5 78594834 77678925 77292466 77147365 76994216 76652795 76618093 77384788 78802210 80167210 80754137
1581.7 80754137 80225956 78544837 75788432 72106022 67895699 63927948 61197132 60382420 61380994
1590.9 61380994 63278908 64915788 65518177 64862472 63133889 60668832 57776850 54680794 51548809
1600 51548809 48522952 45825329 43754226 42627501 42637527 43795940 45901042 48596734 51682383
1609.2 51682383 55038697 58522898 62030452 65278482 67914134 70010269 71995825 73371685
1617.4 73371685 73663509 73425186 72742587 71623540 70329559 69197541 68843776 69638395 71508360
1626.5 71508360 74113768 76590306 78371137 79712462 80856776 81933349 83138525 84888786
1634.7H4888786K187741J500970J042765R79776Q70597P24983N16755K97623J68360
1643.9I3178356J36685M5186k91645o21170p15780n26929j63978K90733M48555k34842
1654.1I1545171l39318l0631K35004L52221L60912L33202L23379K74498N293k70010
1664.3I2789721l30501l33643l24703l47596o46591r30607r93419j022327r05681q90171
1674.5H6064482j401276j769381j727874j911997k365268k917426l109020l194476
1682.6F7667764m068219n571372m592979k610498j372576j04630J226425K127600K371162
1691.8E5072677K121884J522308Q19207m26352k059919k633971k983862m525906n253229
1701D1652837k433896l23209J500121L267962M467713M850421M424053M178685M142452
$$ plain form
1634.7 84888786 87076527 88577497 89620262 90600038 91470635 92195618 92712373 93009996 93178356
1643.9 93178356 93315041 93360227 93068582 92447412 91731632 91204703 91040725 91331458 91780013 91545171
1654.1 91545171 91205853 91175222 91410226 91762447 92123359 92456561 92779940 93054438 93059731 92789721
1664.3 92789721 92459220 92125577 91800874 91453278 90806687 89876080 88882661 87860334 86954653 86064482
1674.5 86064482 84663206 82893825 81165951 79253954 76888686 73971260 70862240 67667764
1682.6 67667764 63599545 58028173 53435194 50824696 49452120 49347490 50573915 52701515 55072677
1691.8 55072677 57194561 58716869 59536076 59109724 57049805 54415834 51431972 46906066 41652837
1701 41652837 39218941 38895732 40395853 43663815 48131528 52981949 57406002 61584687 65727139
1710.2F5727139L638154K892673K345460K011961J561880J046259Q51029N15657r4604
1719.3H0495608l16000l69549n14072p50232r70822j092840j186829j223702j152843
1728.5G2918719j079827j053137q96853o45471n89490r07874r86516p80029o55549
1737.7F5323973n91725o70702q35311p87991p15715p52622p52777o75589o09803n81556
1747.9E8350182n82606m88633k68155r9856J02478M58032Q84217J400399J921827K116394
1758.1F3794279K243149K527380L046388L455823L079743K791106K848345K746779
1766.3H6532992K677667K632553K146029J740611J757478J644713J105935P19213O76954
1775.4A01634145O25324N13148M75633M55714L84235K51460J89555K23327K29573J49274
$$ plain form
1710.2 65727139 69365293 72257966 74603426 76615387 78177267 79223526 80074555 80590212 80495608
1719.3 80495608 80179608 79810059 79295987 78545755 77574933 76482093 75295264 74071562 72918719
1728.5 72918719 71838892 70785755 69888902 69243431 68653941 67746067 66759551 65979522 65323973
1737.7 65323973 64732248 64061546 63226235 62438244 61722529 60969907 60217130 59541541 58931738 58350182
1747.9 58350182 57767576 57278943 57010788 56910932 57013410 57471442 58355659 59756058 61677885 63794279
1758.1 63794279 66037428 68564808 71611196 75067019 78146762 80937868 83786213 86532992
1766.3 86532992 89210659 91843212 93989241 95729852 97487330 99132043 100237978 100957191 101634145
1775.4 101634145 102259469 102772617 103248250 103703964 104088199 104339659 104529214 104752541 104982114 105131388
1785.6A05131388R2697J07872J41037J89626K39396K24459N9665r6095m9603L8135
1795.8A06078577M8101P4100J30463J03331K8944M804j2744j8119J1420L9995O4516
1807A06553388P4958R0898J07085O6340J6821L2198P5877J02198J12879J12808J03140
1818.3A07448590R8979J10150J19781J29116J58071J83988J09887N567N5277J78981
1828.5A08598387J78337j3768j21343n3108J0955K7418M0829M5252K1291j31N889L0339
1840.7A08770347P7176J60694J72174l4690j66524p6723j5616l6538m0686k3651j7548
1851.9A08768415j8167j6797j1706r66P344Q607O032M720L922J550O91M113K2662N4335
1866.2A08834755Q2517O7771l9864j54138j46472q2159m4775l4750l3652l3546l4320
$$ plain form
1785.6 105131388 105224085 105331957 105472994 105662620 105902016 106126475 106186140 106090045 106040442 106078577
1795.8 106078577 106126678 106200778 106331241 106434572 106463516 106468320 106455576 106437457 106448877 106488872 106553388
1807 106553388 106628346 106719244 106826329 106892669 106909490 106941688 107017565 107119763 107232642 107345450 107448590
1818.3 107448590 107547569 107657719 107777500 107906616 108064687 108248675 108358562 108364129 108419406 108598387
1828.5 108598387 108776724 108762956 108641613 108588505 108599460 108626878 108667707 108712959 108734250 108734119 108740008 108770347
1840.7 108770347 108847523 109008217 109180391 109145701 108979177 108902454 108886838 108850300 108809614 108785963 108768415
1851.9 108768415 108750248 108733451 108721745 108720779 108728123 108736730 108742762 108747482 108751404 108752954 108753645 108757758 108780420 108834755
1866.2 108834755 108917272 108985043 108945179 108791041 108644569 108562410 108517635 108482885 108449233 108415687 108381367
1877.4A08381367l5525l5107l1543k7477k6477k7227k5046k4486k2017R274M4060K74
1889.7A08180070q0931p8452k8479J013p570m7206o6483n4384m7147m8113n0044n6219
1901.9A07616055n3406m3857m3714l7789j9348j2827k0265l9328o2298n4562l1543
1913.1A07197118j8072k051L7480P9620L5369m8959k6012N7066R0527N7698K4116L5250
1925.3A07519150N7924O3967O1703N5265M7756M3761M0102K7299J0074K074J561M447
1937.6A07935083P498J2767L8863O6733L1293l2270k7001J0395K1696TK5499K7799
1949.8A08140051K7025K9719L6645M0114L4714K4306K2352K8825K9993K6596K4914
1961A08465254K5583K7287K9158M0424N4371M0746N782p868K158J3232J6558J3876
$$ plain form
1877.4 108381367 108345842 108310735 108279192 108251715 108225238 108198011 108172965 108148479 108126462 108135736 108179796 108180070
1889.7 108180070 108099139 108020687 107992208 107993221 107985651 107938445 107871962 107817578 107770431 107722318 107672274 107616055
1901.9 107616055 107562649 107518792 107475078 107437289 107417941 107405114 107384849 107345521 107283223 107228661 107197118
1913.1 107197118 107179046 107176995 107214475 107294095 107329464 107280505 107254493 107311559 107402086 107459784 107483900 107519150
1925.3 107519150 107577074 107641041 107702744 107758009 107805765 107849526 107889628 107916927 107927001 107929075 107930636 107935083
1937.6 107935083 107942581 107955348 107994211 108060944 108092237 108059967 108032966 108043361 108065057 108086753 108112252 108140051
1949.8 108140051 108167076 108196795 108233440 108273554 108308268 108332574 108354926 108383751 108413744 108440340 108465254
1961 108465254 108490837 108518124 108547282 108587706 108642077 108682823 108688605 108680737 108682895 108696127 108712685 108726561
1973.3A08726561J7381K5785K8491L0184L5607L7003L2270K9552K9540L1400L3736
1984.5A09057510K9170K8480L7455L7563L8087N7543N7351J0777j7643m351M518K551
1996.7A09339011L147Q70l254l624r883j7845j3841p176q082j2052j7679k6870l5787
2010A09186935l9458l5214k9171k2125k778K1089K8288K8551L8325M7040M3989L8671
2022.2A09304142L9375L6192K4056J2815J5450K2149J5902L898n972j0395q976o497
2034.5A09442139n73J1445K0599J5056L219M160K897j3936k3555k2042j9884j7727
2046.7A09401798j5008j4591j7989j6904j1599j0002r548p034l433j001j931J78M781
2060A09297717J728l397K62R549J2517N650N925K0718L2366L0279K4032K5893L0863
$$ plain form
1973.3 108726561 108743942 108769727 108798218 108828402 108864009 108901012 108933282 108962834 108992374 109023774 109057510
1984.5 109057510 109086680 109115160 109152615 109190178 109228265 109285808 109343159 109353936 109336293 109331942 109336460 109339011
1996.7 109339011 109342158 109343028 109339774 109336150 109326267 109308422 109294581 109287405 109279323 109267271 109249592 109222722 109186935
2010 109186935 109147477 109112263 109083092 109060967 109058189 109079278 109107566 109136117 109174442 109221482 109265471 109304142
2022.2 109304142 109343517 109379709 109403765 109416580 109432030 109454179 109470081 109473979 109468007 109457612 109448636 109442139
2034.5 109442139 109441566 109453011 109473610 109488666 109491885 109496045 109498942 109485006 109461451 109439409 109419525 109401798
2046.7 109401798 109386790 109372199 109354210 109337306 109325707 109315705 109306157 109299123 109295690 109294689 109292758 109292936 109297717
2060 109297717 109299445 109296048 109296310 109305859 109318376 109324026 109329951 109350669 109383035 109413314 109437346 109463239 109494102
2073.2A09494102K8467K3055J9360J7071J8787K3067K2280J6773J4627J1408L207L254
2085.4A09695458R275R179Q500R906P784M304j073o700k467J394m100n246j585M53
2099.7A09725082O79M30K574K420K265P558Q941N364L827P784J2851R918O628P499
2114A09803820O485N960P343Q262N066L994J0645J2302O140N793P975J383m899p04
2128.3A09879565K301r42k479k766n746r215p260l647j991J299M697P415P796O247
2142.6A09875274Q356J5271J9085J2863N305R715J6559R799K873O771R036R465J2410
2155.8A10012782J1277R370J0764J0777J1408J0634M291J395P665R573L325L314O724
2169.1A10113299N233L195K658K528L719N281N305P212R727O199M030J0156J4162N627
$$ plain form
2073.2 109494102 109522569 109545624 109564984 109582055 109600842 109623909 109646189 109662962 109677589 109688997 109692204 109695458
2085.4 109695458 109704733 109713912 109722412 109732318 109740102 109744406 109743333 109736633 109734166 109735560 109731460 109726214 109724629 109725082
2099.7 109725082 109725761 109726191 109728765 109731185 109733450 109741008 109749949 109755313 109759140 109766924 109779775 109789693 109796321 109803820
2114 109803820 109810305 109816265 109823608 109831870 109836936 109840930 109851575 109863877 109870017 109875810 109883785 109885168 109880269 109879565
2128.3 109879565 109881866 109880924 109878445 109875679 109869933 109860718 109853458 109849811 109847820 109849119 109853816 109861231 109869027 109875274
2142.6 109875274 109883630 109898901 109917986 109930849 109936154 109945869 109962428 109972227 109975100 109981871 109990907 110000372 110012782
2155.8 110012782 110024059 110033429 110044193 110054970 110066378 110077012 110081303 110082698 110090363 110099936 110103261 110106575 110113299
2169.1 110113299 110118532 110121727 110124385 110126913 110130632 110135913 110141218 110148430 110158157 110164356 110168386 110178542 110192704 110198331
2183.3A10198331m363L57O772M529L088O044J0776J0884M471j08m41j526J002L898
2197.6A10243714R54J812M613M089M959P069Q059Q654R203O759N281Q178Q261N961
2211.9A10327566Q261J2278P952N281J0323R835R370J1396N949k480m065l433m554
2225.2A10393679p03P99l493R65J5939K0229O390l374k908j026o79n209q250m804j919
2240.5A10405636l195k873K503M316J108r05j121j240m053m673n257q476l636J526
2254.7A10379660o127j4758j5271j6677j6010j0574j5152k5951k9612k2304j2231j3268
2267A10181725k0194k2769j8024j6666k3818k5296k3937k5022k3771k2268k2948k4152
2279.2A09912860k5475k9230k9754k2519j4913j0240n222k098j919J872J3733K6416
$$ plain form
2183.3 110198331 110193968 110194325 110201097 110205626 110208714 110214758 110225534 110236418 110240889 110240781 110240340 110238814 110239816 110243714
2197.6 110243714 110244668 110246480 110251093 110255182 110260141 110267210 110275269 110283923 110293126 110299885 110305166 110313344 110321605 110327566
2211.9 110327566 110335827 110348105 110356057 110361338 110371661 110381496 110390866 110402262 110408211 110405731 110401666 110398233 110393679
2225.2 110393679 110392976 110393775 110390282 110391247 110407186 110427415 110433805 110430431 110427523 110426497 110425818 110420609 110412359 110407555 110405636
2240.5 110405636 110402441 110399568 110402071 110406387 110407495 110406590 110405469 110404229 110400176 110395503 110390246 110381770 110378134 110379660
2254.7 110379660 110373533 110358775 110343504 110326827 110310817 110300243 110285091 110259140 110229528 110207224 110194993 110181725
2267 110181725 110161531 110138762 110120738 110104072 110080254 110054958 110031021 110005999 109982228 109959960 109937012 109912860
2279.2 109912860 109887385 109858155 109828401 109805882 109790969 109780729 109775507 109773409 109771490 109773362 109787095 109813511
2291.4A09813511K7931K5952K4796J8668J4960J4270J3900J1110N007L802N270Q153
2303.7A09987330J0920K921m173J43K253L6l10N067Q785K504k313k098k718o235k2983
2319A09979129m2141l9959l0279j1563K2149L8719M5860O3050P0262O7234O8998O3694
2331.2A10295153M7826L3129L1471L0041J6451K3555N5898N8674J1075k7692l0661
2342.4A10544920l6037m3654n2500p0012o3276k7287R894L7897M7827L1352J6713K5415
2354.7A10421252K9445K6393K5427M316l5119n8866n8663n3120k8908q571k4128l6931
2366.9A10202527k7823j8776k3413l4141l2425k5749l2842l9566l6705l2496k9314
2378.1A09869277k2053o974k03n853Q58J9348K6596K0694K0385K8503K3008J1587J1503
$$ plain form
2291.4 109813511 109841442 109867394 109892190 109910858 109925818 109940088 109953988 109965098 109970105 109973907 109979177 109987330
2303.7 109987330 109998250 110001171 109996998 109997141 109999394 109999430 109999120 110004187 110012972 110015476 110013163 110011065 110008347 110002112 109979129
2319 109979129 109936988 109897029 109866750 109855187 109877336 109916055 109961915 110024965 110095227 110162461 110231459 110295153
2331.2 110295153 110342979 110376108 110407579 110437620 110454071 110477626 110533524 110592198 110603273 110575581 110544920
2342.4 110544920 110508883 110465229 110412729 110342717 110279441 110252154 110262048 110299945 110347772 110379124 110395837 110421252
2354.7 110421252 110450697 110477090 110502517 110506833 110471714 110412848 110354185 110301065 110272157 110263586 110239458 110202527
2366.9 110202527 110174704 110155928 110132515 110098374 110065949 110040200 110007358 109967792 109931087 109898591 109869277
2378.1 109869277 109847224 109840250 109840047 109834194 109835052 109854400 109880996 109901690 109922075 109950578 109973586 109985173 109996676
2391.4A09996676R585L397j120l302m113q023j3840j5688j2577j1670j5867j6510j2958
2404.6A09893990j8216k8157k6369j7846j3959r799l898k909l278l898k897M768J0276
2417.9A09777808M292o640q679n948o592l434j633j919N60R54K074K253K551P391R763
2433.2A09772801R084P594o68j0288j4329j7404j6892j7548k3353k4128k0325k0420
2445.4A09624124k4009k5666k5725k1684n997O855K324K182P915M89q499n925o0l373
2459.7A09522951r168j0895j2505j0872p248o557k885K504J442k26l58L82J645p39
2474A09467471m661p904n794k873j919K647N901L612j502k313J418K754Q11M05P87
2489.3A09458840m447o985k27j323j3161j5723q429m816n531p307j1671j4555j4914
$$ plain form
2391.4 109996676 110006261 110009658 110008538 110005236 110001123 109993100 109979260 109963572 109950995 109939325 109923458 109906948 109893990
2404.6 109893990 109875774 109847617 109821248 109803402 109789443 109779644 109775746 109772837 109769559 109765661 109762764 109767532 109777808
2417.9 109777808 109782100 109775460 109766781 109760833 109754241 109750807 109749174 109747255 109747815 109748769 109750843 109753096 109755647 109763038 109772801
2433.2 109772801 109781885 109789479 109788811 109778523 109764194 109746790 109729898 109712350 109688997 109664869 109644544 109624124
2445.4 109624124 109600115 109574449 109548724 109527040 109521043 109527898 109530222 109532404 109540319 109540808 109532309 109526384 109526324 109522951
2459.7 109522951 109513783 109502888 109490383 109479511 109472263 109465706 109462821 109465325 109466767 109466541 109466183 109466565 109468210 109467471
2474 109467471 109462810 109454906 109449112 109446239 109444320 109446967 109452868 109456480 109454978 109452665 109454083 109456837 109457648 109458053 109458840
2489.3 109458840 109454393 109447408 109447181 109445858 109432697 109416974 109408545 109403729 109398198 109390891 109379220 109364665 109349751
2502.5A09349751j6319j4901j2780j1587j3411k2638k6440k3175k5260k9039k8408
2513.8A09125793k4712k2566k1625j6177j2612j6546j6570o533N221J1599J5176J7798
2526A09038246J7547J5867J4186J1957P617M292N126P319Q202J967q083n841k158j1539
2540.3A09104705j8549j6832j2839j1003j5378j7107r310m637j1826k0766k3890k2566
2552.5A08920002j9491j4341r942j2421j4603j0264o759m340k730o914j5008k1184
2564.7A08782005j9526j2708j2720k4819l4642l0089k7871l7050m4930m4310l6383
2576A08456957l1542m0424n3847n9498o1559o2132o0976n6398m5537l6777l2401k7704
2588.2A07888162k0683q952K62N36K063J3864K6738L1043L0827L0375L3068L9542L8552
$$ plain form
2502.5 109349751 109333432 109318531 109305751 109294164 109280753 109258115 109231675 109208500 109183240 109154201 109125793
2513.8 109125793 109101081 109078515 109056890 109040713 109028101 109011555 108994985 108988452 108993673 109005272 109020448 109038246
2526 109038246 109055793 109071660 109085846 109097803 109105420 109109712 109114838 109122157 109130359 109132326 109124243 109118402 109116244 109104705
2540.3 109104705 109086156 109069324 109056485 109045482 109030104 109012997 109003687 108999050 108987224 108966458 108942568 108920002
2552.5 108920002 108900511 108886170 108876228 108863807 108849204 108838940 108832181 108827841 108825111 108818197 108803189 108782005
2564.7 108782005 108762479 108749771 108737051 108712232 108677590 108647501 108619630 108582580 108537650 108493340 108456957
2576 108456957 108425415 108384991 108331144 108271646 108210087 108147955 108086979 108030581 107985044 107948267 107915866 107888162
2588.2 107888162 107867479 107858527 107858789 107859325 107861388 107875252 107901990 107933033 107963860 107994235 108027303 108066845 108105397
2601.5A08105397L5250L9137L6287K9469L2198L6585L4595L1006K7359K2387J3423
2612.7A08443093n543k0063j4257n436l815n722j0323j0682n579M804J3495J2529J4531
2625.9A08407032K7490L8302L6514L2103K9433J8632M447O878K1505K0326K944k158
2638.2A08643448J1242J8775J2172L814Q4j085m816o020l910r251j7035j4329m125
2651.4A08628964k086j1551j7989j5461o736L6l493j0848j6141j9657j7178j2493j6845
2664.7A08478522k1553j6916j5461k2459k9159l4487m3475n0188m3535l7813n3537
2675.9A08109939p3564p8118p7820q4316q1814o7925p0715q8275j01673j01805q9216
2687.1A07194698p3862n0509j6165J4401L1101L7110L5095K2555m89k6894n3191p0166
$$ plain form
2601.5 108105397 108140647 108179784 108216071 108245540 108277738 108314323 108348918 108379924 108407283 108429670 108443093
2612.7 108443093 108437550 108417487 108403230 108397794 108393979 108388257 108377934 108367252 108361673 108366477 108379972 108392501 108407032
2625.9 108407032 108434522 108472824 108509338 108541441 108570874 108589506 108593953 108600831 108622336 108642662 108645606 108643448
2638.2 108643448 108654690 108673465 108685637 108689451 108689535 108688450 108683634 108677614 108673704 108664453 108647418 108633089 108628964
2651.4 108628964 108626878 108615327 108597338 108581877 108575141 108575177 108571684 108560836 108544695 108525038 108507860 108495367 108478522
2664.7 108478522 108456969 108440053 108424592 108402133 108372974 108338487 108295012 108244824 108201289 108163476 108109939
2675.9 108109939 108036375 107958257 107880437 107796121 107714307 107646382 107575667 107487392 107385719 107283914 107194698
2687.1 107194698 107120836 107070327 107054162 107068563 107099664 107136774 107171869 107194424 107193935 107167041 107113850 107043684
2699.4A07043684p8440r7370j23477j45901j61790j69349j73235j80090j92070j96135
2709.6A05525827j83558j74093j71626j55675j40655j38247j40095j48583j60932j87981
2719.7A03924382k39122k80941k82585k81418l13365l39794l15500k70736k49672k21920
2729.9A01129329j67942j07717l9983L4845R8896J43480J86122K31969K65717K77353
2740.1A02052069K67827K61832K62176K48135K30372K06303J85633K07758K28488K22123
2750.3A04372716K39396K51544K24244J93799J75202J67846J65141J50394J32704J18744
2760.5A06191730R6393P6282O6221M9853K4748M411r811k6774m3142n7173p3254q5616
2772.8A06213868j09911j36042j08969p3254r7454j31988j39594j39976j35672j19507
$$ plain form
2699.4 107043684 106965244 106867874 106744397 106598496 106436706 106267357 106094122 105914032 105721962 105525827
2709.6 105525827 105342269 105168176 104996550 104840875 104700220 104561973 104421878 104273295 104112363 103924382
2719.7 103924382 103685260 103404319 103121734 102840316 102526951 102187157 101871657 101600921 101351249 101129329
2729.9 101129329 100961387 100853670 100813687 100848532 100947428 101090908 101277030 101508999 101774716 102052069
2740.1 102052069 102319896 102581728 102843904 103092039 103322411 103528714 103714347 103922105 104150593 104372716
2750.3 104372716 104612112 104863656 105087900 105281699 105456901 105624747 105789888 105940282 106072986 106191730
2760.5 106191730 106288123 106364405 106430626 106480479 106505227 106509638 106499827 106473053 106429911 106372738 106299484 106213868
2772.8 106213868 106103957 105967915 105858946 105785692 105688238 105556250 105416656 105276680 105141008 105021501
2783A05021501r7621q5211q1372p7808p9214o1322r572K1899K0325J4579m423l2985
2795.2A04548776n7590q7142j06490r4735r4080j21188j45650j66762j83296j96052
2805.4A03295791k13528k31993k48086k53594k33686k08366k09546k16985k06005j87087
2815.6A01086915j67406j42515j19233r8979p6878o9523p5150o5398n1248n6732o1512
2826.8A00102341m6408l5179m3493n5933o4904o7037o5213o7378p0023r4354j32764
2838I9359655j18523o9046o8242j15567j61827j89590k08706k33537k55787k46787
2848.2I7692043k09064j87742j88840j82503j63001j31631r2751n5617k4295j257K8038
2859.5I6483380P5352J11288J12182R2613O9469M9496M2629M5091L8749K8861K6244
$$ plain form
2783 105021501 104923880 104838669 104757297 104679489 104600275 104538953 104529381 104551280 104571605 104586184 104581761 104548776
2795.2 104548776 104491186 104404044 104297554 104202819 104108739 103987551 103841901 103675139 103491843 103295791
2805.4 103295791 103082263 102850270 102602184 102348590 102114904 101906538 101696992 101480007 101274002 101086915
2815.6 101086915 100919509 100776994 100657761 100558782 100481904 100412381 100337231 100271833 100220585 100163853 100102341
2826.8 100102341 100055933 100020754 99977261 99921328 99856424 99789387 99724174 99656796 99586773 99492419 99359655
2838 99359655 99241132 99172086 99103844 98988277 98826450 98636860 98428154 98194617 97938830 97692043
2848.2 97692043 97482979 97295237 97106397 96923894 96760893 96629262 96536511 96480894 96456599 96455342 96483380
2859.5 96483380 96558732 96670020 96782202 96874815 96944284 96993780 97036409 97081500 97120249 97149110 97175354
2870.7I7175354K2995K6179O9093J41120J68544J37246R9480P1228N0890M7732N6380
2881.9I8066241N9074N5998O0988O3944N6702N1307M8036L7819K2065Q148j0192m9138
2894.1I8470992r3705r2691o0636p0977j22374j68038j93363k12854k42025k58416
2904.3I6955913k47019k44457k66635l05015l66068m29976m83709n49865o02275o07157
2914.5I2853737o07234o09744n72562m91482l73793k37489r9361M1771J85806L20041
2924.7I0409690M20869M71526M67354M37647M35895M62204M49771L77941K97427K37876
2934.9I4468200K04885J94162J86825J71793J52486J30439R4050M9532L2329L4082
2945.1I5718783O569k1679j0973j1134l7777n5331m6158J323N6821Q0812Q5306R4450
$$ plain form
2870.7 97175354 97198349 97224528 97293621 97434741 97603285 97740531 97840011 97911239 97962129 98009861 98066241
2881.9 98066241 98125315 98181313 98242301 98306245 98362947 98414254 98462290 98500109 98522174 98530322 98520130 98470992
2894.1 98470992 98377287 98284596 98223960 98152983 98030609 97862571 97669208 97456354 97214329 96955913
2904.3 96955913 96708894 96464437 96197802 95892787 95526719 95096743 94613034 94063169 93460894 92853737
2914.5 92853737 92246503 91636759 91064197 90572715 90198922 89961433 89862072 89903843 90089649 90409690
2924.7 90409690 90830559 91302085 91769439 92207086 92642981 93105185 93554956 93932897 94230324 94468200
2934.9 94468200 94673085 94867247 95054072 95225865 95378351 95508790 95602840 95652372 95684701 95718783
2945.1 95718783 95725352 95703673 95692700 95681566 95643789 95588458 95542300 95543623 95600444 95681256 95766562 95861012
2957.4I5861012J02955TJ01304R3347R3108J14084J21110R8473O7425K9445k0820o9285
2969.6I6695113j11389j64121k28632k89518l01659k46399k04909k08795j85442j12367
2979.8I4641882l4100L9643J19180J75857J89752J82587J76024J67060J49250J14435
2990I5921570N4032N579M0662J13422R3186p910p5728l8266M4149M5532q547l4046
3002.2I6153635k5028J0264M9042N4336L8028K2912k3759j01584j30302j21712j69093
3013.4I5756739k24614k41506k91055l49069l60841l43734l02612k63805k58618k63417
3023.6I2857468k09093q8644p689J3840M3601J08176K12038L01623L38418L67748M12184
3034.9I4349670M42875M12267L07495J69557M5735k6852n8878p8344j01179j35100
$$ plain form
2957.4 95861012 95963967 96066922 96168226 96261573 96354681 96468765 96589875 96688348 96755773 96785218 96764398 96695113
2969.6 96695113 96583724 96419603 96190971 95901453 95599794 95353395 95148486 94939691 94754249 94641882
2979.8 94641882 94607782 94647425 94766605 94942462 95132214 95314801 95490825 95657885 95807135 95921570
2990 95921570 95975602 95981181 96021843 96135265 96228451 96220541 96144813 96106547 96150696 96196228 96187681 96153635
3002.2 96153635 96128607 96138871 96187913 96242249 96280277 96303189 96279430 96177846 96047544 95925832 95756739
3013.4 95756739 95532125 95290619 94999564 94650495 94289654 93945920 93643308 93379503 93120885 92857468
3023.6 92857468 92648375 92559731 92552042 92565882 92609483 92717659 92929697 93231320 93569738 93937486 94349670
3034.9 94349670 94792545 95204812 95512307 95681864 95727599 95700747 95641869 95563525 95462346 95327246
3045.1I5327246j40953j21260j21021j24734r2030q637R0683J40285J43761J56551
3055.3I5249891J66655J69301K11590K78342L25543L56114L95411M51231M89938M77273
3065.5I8571289M46862M47428M60058M41933L87382L22760K66122K12956J57750R5677
3075.6A01810217M1711K8992O2346J08266J37890J56784J59704J52076J73664K00248
3085.8A03031898J98328J96242J89758J75702J99414K43711K49398K27785K21932K29037
3096A05163205K19583J94609J82820J90878K06244K07185J77753J37794J01567O8414
3106.2A06850052L6955J8251N2774J04463J01685P3183L8206j5592l1042P021L6526
3117.5A07272482L3498J6844K9087Q1194J13201R2029N7638N0533N5599M3142K5642
$$ plain form
3045.1 95327246 95186293 95065033 94944012 94819278 94727248 94718611 94809294 94949579 95093340 95249891
3055.3 95249891 95416546 95585847 95797437 96075779 96401322 96757436 97152847 97604078 98094016 98571289
3065.5 98571289 99018151 99465579 99925637 100367570 100754952 101077712 101343834 101556790 101714540 101810217
3075.6 101810217 101851928 101880920 101943266 102051532 102189422 102346206 102505910 102657986 102831650 103031898
3085.8 103031898 103230226 103426468 103616226 103791928 103991342 104235053 104484451 104712236 104934168 105163205
3096 105163205 105382788 105577397 105760217 105951095 106157339 106364524 106542277 106680071 106781638 106850052
3106.2 106850052 106887007 106905258 106958032 107062495 107164180 107237363 107275569 107259977 107228935 107235956 107272482
3117.5 107272482 107305980 107322824 107351911 107433105 107546306 107638335 107695973 107746506 107802105 107845247 107870889
3128.7A07870889L8564Q6367J25170J22511J01876Q9360P2372L6478J43j681O7723
3139.9A08609772J63781J73271J12510O6435L9923K5988K6071K4414K992m2701r9694
3151.1A09102762r2113L4797J52922J49536R1994M5692K0874J5712J1766O020K909
3162.3A09542871N233J1623J1217O509P558J0061J1230J4627J5259J5342K0647K3317
3174.6A09695494J5259P725L040j7190k6179j669Q428j1491k4462k3019j7298j5115
3186.8A09593523j9491j1420N686O401O390K5785M3166M3201L2437K1124J9407J9002
3199A09785211J0347J657P16M899N913k575j2314O032L0958J6117k419M577N639n734
3213.3A09849024o235J1206J8227j1468m2582k0813K3007K8312J0049n567j8394k4283
$$ plain form
3128.7 107870889 107909453 107995820 108120990 108243501 108345377 108434737 108507109 108543587 108543730 108542049 108609772
3139.9 108609772 108773553 108946824 109059334 109125769 109165692 109191680 109217751 109242165 109245157 109202456 109102762
3151.1 109102762 109010649 109045446 109198368 109347904 109439898 109485590 109506464 109522176 109533942 109539962 109542871
3162.3 109542871 109548104 109559727 109570944 109577453 109585011 109595072 109606302 109620929 109636188 109651530 109672177 109695494
3174.6 109695494 109710753 109718478 109721518 109704328 109678149 109676480 109684908 109673417 109648955 109625936 109608638 109593523
3186.8 109593523 109574032 109562612 109568298 109574699 109581089 109606874 109650040 109693241 109725678 109746802 109766209 109785211
3199 109785211 109795558 109797215 109797931 109802830 109808743 109806168 109793854 109799886 109830844 109846961 109844542 109849119 109854758 109849024
3213.3 109849024 109842789 109853995 109872222 109860754 109818172 109797359 109820366 109848678 109858727 109853160 109834766 109810483
3225.6A09810483k8228k6131k0695l8457p8356j39236j95647j25861N5671J41621Q6152
3236.8A09441316J6308j2612j7286j6010j3971o032q416m1139q9193q0204L3629J25182
3249A09331572R3591L4130J0133j0825m9543p8642l3510N7399P5519K4891j0872k0432
3261.2A09423411k0540k0110j7882j5938k3389m1139q2350j37758j31333l1924P3683
3272.5A08974731P8189R78j8251L1364L7801K456j2517j1969j8882k4808j7679j0097
3284.7A09011316j3947k3902l3342l6824m8495q5699r9635l4654K3841L565r060K2960
3296.9A08676124M6289L6573J0610j5605m9245r4247j35422j22142n3394R037L5119
3308.2A08343697M1699O3837P3707L3295j0991j3745l46q523k6500l0005k6501k4175
$$ plain form
3225.6 109810483 109782255 109756124 109735429 109696972 109618616 109479380 109283733 109157872 109213543 109355164 109441316
3236.8 109441316 109457624 109445012 109427726 109411716 109397745 109391713 109383297 109342158 109252965 109172761 109206390 109331572
3249 109331572 109425163 109459293 109469426 109458601 109409058 109330416 109296906 109354305 109429824 109454715 109443843 109423411
3261.2 109423411 109402871 109382761 109364879 109348941 109325552 109284413 109202063 109064305 108932972 108901048 108974731
3272.5 108974731 109052920 109053898 109035647 109067011 109104812 109107268 109094751 109082782 109063900 109039092 109021413 109011316
3284.7 109011316 108997369 108973467 108940125 108903301 108854806 108769107 108669472 108634818 108658659 108662224 108653164 108676124
3296.9 108676124 108722413 108758986 108769596 108753991 108704746 108610499 108475077 108352935 108299541 108308578 108343697
3308.2 108343697 108385396 108449233 108522940 108556235 108545244 108531499 108531153 108522630 108496130 108466125 108439624 108415449
3320.4A08415449k2638l4356n9855r3305r5606k0898M7934K3771k9099m2379l2854
3331.6A08056164k9099l5787n0735p4899j08207j40512j12593j3769L8135j2552o8224
3342.8A07447922m2355J776j3804n4789r7906j54925j87838j19781J0502N6040J812
3354A06846654m5776n5468o0689p6390j04761j11580o3646j4639k7024q5104j63126
3365.3A06038451k17342j93715j46044r9778K4235J66119J72567Q0085J0240l6419
3375.5A05798399n2249Q249N4002O354r978N9533R5248O8355L8707K0469J3911P87
3387.7A06101787m4274j13738j60444p9405J24335K34282J69349R9814P1192k3294
3397.9A06379604j74820k28143q8012J62137L49485L36731J84226O3801l684n9855
$$ plain form
3320.4 108415449 108392811 108358455 108298600 108205295 108109689 108088791 108136725 108160496 108131397 108089018 108056164
3331.6 108056164 108027065 107991278 107940543 107865644 107757437 107616925 107504332 107490563 107528698 107516146 107447922
3342.8 107447922 107405567 107407343 107393539 107338750 107240844 107085919 106898081 106778300 106788802 106844842 106846654
3354 106846654 106800878 106745410 106684721 106608331 106503570 106391990 106328344 106313705 106286681 106201577 106038451
3365.3 106038451 105821109 105627394 105481350 105381572 105405807 105571926 105744493 105824578 105834818 105798399
3375.5 105798399 105746150 105754399 105808401 105814755 105804777 105864310 105959558 106027913 106066620 106087089 106101000 106101787
3387.7 106101787 106057513 105943775 105783331 105703926 105828261 106062543 106231892 106331706 106402898 106379604
3397.9 106379604 106204784 105976641 105888629 106050766 106400251 106736982 106921208 106985009 106981325 106921470
3408.1A06921470l0339Q2899R6476R632L3748J56700K01083J63638J21081Q4078N6386
3419.3A07896852N8401J00112J27196J03951P3719N4145L4106K0337K3031K5940M7600
3430.5A08565390J12820J14512M077o7639l910Q8799J36733J85633J84893J19889P8249
3441.7A09519446N5575L2735K9791K9408K4438L7372M5360L7396L3259K8050K3901
3453A09896731K4379K9206L0863J1122k2280o1381n3191M2093R6309M2105j9169o8939
3465.2A09947848j30737j34301p0786J6904J41239K11549J48689N0819k992j0454K729
3476.4A10170507k4557j03378j15502L2401J82450J49250L1424l7694p1669n4085K9731
3487.6A10188878Q3720N6672J4115r740k1171k6560j1313O998k3592l1578M4906R8383
$$ plain form
3408.1 106921470 106891131 106974030 107070506 107080138 107113886 107270586 107471669 107635307 107756388 107840466 107896852
3419.3 107896852 107955253 108055365 108182561 108286512 108360231 108414376 108448482 108468819 108491850 108517790 108565390
3430.5 108565390 108678210 108792722 108796799 108729160 108725250 108814049 108950782 109136415 109321308 109441197 109519446
3441.7 109519446 109575021 109607756 109637547 109666955 109691393 109728765 109774125 109811521 109844780 109872830 109896731
3453 109896731 109921110 109950316 109981179 109992301 109970021 109908640 109855449 109897542 109993851 110035956 110016787 109947848
3465.2 109947848 109817111 109682810 109612024 109628928 109770167 109981716 110130405 110181224 110178232 110167778 110170507
3476.4 110170507 110145950 110042572 109927070 109959471 110141921 110291171 110322595 110284901 110213232 110159147 110188878
3487.6 110188878 110272598 110329270 110343385 110333645 110312474 110285914 110274601 110281599 110258007 110226429 110271335 110369718
3499.9A10369718K6786q8977m7338J21867J65296Q1372L7027M3165M5061J4055m3201
3511.1A10724831r6333j12629l4857P6198Q7798M3881K1315L612p308j5378o0367j00482
3523.3A10530281j9264J10495J24669N6779k884l1531k6000k0540k9587l2235l9172
3534.5A10621011n5265l9017K0754N5432K7657j7893l6848j2374K1625J2278J5032
3545.8A10612392P0894P8225J6237j2958J1336L8219K4569j5390j8752N067Q142P808
3558A10825789K2364J5592j383L6002R7000J17088J25896J26231M5955r0181j70052
3569.2A11150301j31035k8968K6262J9204J1957K8217L9887K5857J2135J0514q976
3580.4A11155355l5727j9729K3150M6540R5212J62125J18303j9050j13988j03569j6117
$$ plain form
3499.9 110369718 110396504 110307527 110260189 110382056 110547352 110628724 110665751 110708916 110753977 110768032 110724831
3511.1 110724831 110628498 110515869 110481012 110557210 110645008 110688889 110710204 110713816 110706508 110691130 110630763 110530281
3523.3 110530281 110511017 110621512 110746181 110802960 110800076 110768545 110742545 110722005 110692418 110660183 110621011
3534.5 110621011 110565746 110526729 110547483 110602915 110630572 110612679 110575831 110563457 110585082 110597360 110612392
3545.8 110612392 110683286 110761511 110777748 110764790 110776126 110814345 110838914 110823524 110804772 110809839 110817981 110825789
3558 110825789 110848153 110863745 110862362 110898364 110995364 111112452 111238348 111364579 111410534 111320353 111150301
3569.2 111150301 111019266 110990298 111016560 111035764 111047721 111075938 111115825 111141682 111153817 111164331 111155355
3580.4 111155355 111119628 111099899 111123049 111169589 111264801 111426926 111545229 111526179 111412191 111308622 111292505
3591.7A11292505O5542Q1455M5204O92l2401l0017j0061R048K0110j2278l8016p594
3603.9A11384189M5419J09911J41084R0289J9407l6549l2139L6407K4902o1905p4184
3615.1A11646831J395R5820J09816J1730j17803j71089j07789k1744L3391R4986J61302
3626.3A11736846K16603K06661j4388k67124k35331p8500n543m1914o3991k5082P784
3637.5A11436021O640j3315k2400j0514M017K4152P9835J85549K72727K13945M0936
3648.8A12217593r9456j99247k42197j74403l5298Q1563Q6081o9988j99735j49667
3659A11215246m6671J5939L6466L5417L1638L3581O8164J54877K41291K22159O8068
3670.2A12076175q5115p1872J02067K92969K61998r3257k82419j65546m8589m2463
$$ plain form
3591.7 111292505 111358047 111439502 111484706 111485398 111452997 111422980 111412919 111421967 111442077 111429799 111391783 111384189
3603.9 111384189 111429608 111539519 111680603 111770892 111790299 111753750 111721611 111758018 111782920 111721015 111646831
3615.1 111646831 111648226 111744046 111853862 111865592 111747789 111576700 111468911 111447167 111480558 111575544 111736846
3626.3 111736846 111953449 112160110 112145722 111878598 111643267 111564767 111559224 111517310 111453319 111428237 111436021
3637.5 111436021 111442661 111429346 111406946 111396432 111400449 111424601 111504436 111689985 111962712 112176657 112217593
3648.8 112217593 112118137 111918890 111676693 111502290 111466992 111548555 111634636 111564648 111364913 111215246
3659 111215246 111168575 111184514 111220980 111256397 111288035 111321616 111389780 111544657 111785948 112008107 112076175
3670.2 112076175 111991060 111919188 112021255 112314224 112576222 112482965 112200546 112035000 111986411 111943948
3680.4A11943948n9032l1889J5235O3336J07908J49620J66178R9933K432k6679q3554
3691.6A12347436j45280r7359k8371m006Q333K1791M6885Q6046J11329O2001o2871
3702.8A12345934j08862l7336L7956Q1873J36018J82640J43588N7900k4653j59538
3713A12655520k05087j21451l4725K3055M8911L5155J9097M8674O8807J6129j9598
3724.2A12534487q94j7083o7806o0463K3926J28901J90711J44457O4815O7150J1909
3735.4A13020110j41036k09499j58930l9887P8428J32811J85442K79701J54554k14541
3745.6A13087153k20060J6677J91594J49941l0076r7001j87302k67434j55544r906
3755.8A12478042K9873P010J9836k038r4509r1016M351O5720O7556J7357m0913q369
$$ plain form
3680.4 111943948 111884916 111853027 111868262 111931598 112039506 112189126 112355304 112455237 112457669 112430990 112347436
3691.6 112347436 112202156 112104797 112076426 112072420 112080753 112102544 112149429 112235475 112346804 112408805 112345934
3702.8 112345934 112237072 112199736 112237692 112319565 112455583 112638223 112781811 112839711 112815058 112655520
3713 112655520 112450433 112328982 112294257 112317312 112366223 112401378 112420475 112469149 112537956 112554085 112534487
3724.2 112534487 112533593 112516510 112448704 112388241 112412167 112541068 112731779 112876236 112941051 113008201 113020110
3735.4 113020110 112879074 112669575 112510645 112470758 112549186 112681997 112867439 113147140 113301694 113087153
3745.6 113087153 112867093 112883770 113075364 113225305 113195229 113098228 112910926 112643492 112487948 112478042
3755.8 112478042 112507915 112514925 112534761 112532723 112438214 112347198 112351549 112417269 112484825 112502182 112461269 112452900
3768.1A12452900P1836L5524j04642j35564o0499j0979J573K7919O5637P8833L7479
3779.3A12460017m5073p0798k5916J8215L7956Q106m8148n8568k6619o855j1349m887
3791.5A12226081K0683L8850N8329R6214Q3661L207J156J23620K11632N7805j87659
3802.7A12733579j83142l2949Q8835O5040j18899j93024r5367q285K6989O0069J09029
3814A12451875J68836J29462n9450r9027O8676K03228R5225j90068k57218j14393l290
3825.2A12393856L2258Q392l2842m017O8867Q6618J4150k0647L4094L2329K2841J00898
3837.4A12736797O3920o7842q0204p4589p6902m9794p7796j19841p3027K0373R7334
3848.6A12298429J54448K27391L24655L08502J0371l45373l58165j87230r7704n5515
$$ plain form
3768.1 112452900 112524736 112560260 112455618 112320054 112259555 112248576 112250149 112278068 112343705 112422538 112460017
3779.3 112460017 112414944 112344146 112318230 112336445 112374401 112382507 112334359 112275791 112249172 112242317 112230968 112226081
3791.5 112226081 112246764 112285614 112343943 112440157 112523818 112527025 112528181 112651801 112863433 112921238 112733579
3802.7 112733579 112550437 112517488 112606323 112671363 112552464 112359440 112264073 112255788 112282777 112342846 112451875
3814 112451875 112620711 112750173 112690723 112591696 112660372 112863600 112958825 112768757 112511539 112397146 112393856
3825.2 112393856 112426114 112434506 112401664 112397647 112466514 112553132 112567282 112546635 112580729 112613058 112635899 112736797
3837.4 112736797 112800717 112732875 112652671 112578082 112501180 112451386 112373590 112253749 112180722 112201095 112298429
3848.6 112298429 112452877 112680268 113004923 113313425 113323796 112978423 112620258 112433028 112335324 112279809
3858.8A12279809J7797Q7214Q8596M4406M5538K7525p2598p4375O7508J74344O1405
3870.1A12747169j55807j57070j6320K9302p4518j26970m4417O6852J26315Q1706m2355
3881.3A12433887r0528l0267M3714O2632k6130j18018p7807K6214R8419N7161p9131
3892.5A12300146j25754o5792l755N8711J18339J32072R2232M3321K9003P737l1316
3903.7A12554944q2243j38986j38187q2028k9421j4854j3387m852J0169M2748P1633
3914.9A12175536P4756N4014n150m3392k1124j5020j6201K1219N2119K8908k6262l6037
3927.2A12243366L231K6715K8395K8742R036l2556n8020m0471l58J9169J3411J9956
3939.4A12260616M2534N0723K4367l1519m7422m852K1124Q500j2350j7309j9300k4593
$$ plain form
3858.8 112279809 112297606 112384820 112473416 112517822 112563360 112590885 112518287 112443912 112511420 112685764 112747169
3870.1 112747169 112591362 112434292 112417972 112447274 112372756 112245786 112201369 112268221 112394536 112476242 112433887
3881.3 112433887 112343359 112313092 112356806 112419438 112393308 112275290 112197483 112223697 112322116 112379277 112300146
3892.5 112300146 112174392 112108600 112104845 112163556 112281895 112413967 112506199 112549520 112578523 112586260 112554944
3903.7 112554944 112472701 112333715 112195528 112113500 112084079 112069225 112055838 112050986 112061155 112103903 112175536
3914.9 112175536 112250292 112304306 112299156 112255764 112234640 112219620 112203419 112224638 112276757 112305665 112279403 112243366
3927.2 112243366 112246597 112273312 112301707 112330449 112339485 112306929 112248909 112208438 112208080 112227249 112240660 112260616
3939.4 112260616 112303150 112353873 112378240 112346721 112299299 112294447 112315571 112324071 112311721 112294412 112275112 112250519
3951.6A12250519m757J0777j288p15J4424J4067N49j014P344L45j5449r167K336o008
3965.9A12261963n341Q369P951n24J359R346P414o210q870N25m435l969Q833P927J6642
3981.2A12300980K0683j8585l4344L791J8656o08j562Q703m769k3853k0695m673J3959
3994.5A12257683K1088J896k5058k5856
3998.5A12229753
$$ plain form
3951.6 112250519 112245762 112256539 112255251 112254536 112268960 112283027 112283576 112282562 112289906 112290251 112274802 112265635 112267971 112261963
3965.9 112261963 112256622 112264991 112272942 112272418 112273777 112283123 112290537 112284327 112275457 112275982 112271547 112267578 112276411 112284338 112300980
3981.2 112300980 112321663 112303078 112268734 112272525 112291181 112290573 112289011 112297714 112292945 112269092 112248397 112243724 112257683
3994.5 112257683 112278771 112280667 112255609 112229753
3998.5 112229753
##END=$$ End of the data block
