##TITLE=$$ Begin of the data block
##JCAMP-DX=5.00 $$ ACD/SpecManager v 10.08
##SPECTROMETER/DATA SYSTEM=Alpha
##DATE=10 Nov 2014 10:35:34
##DATA TYPE=INFRARED SPECTRUM
##DATA CLASS=XYDATA
##ORIGIN=
##OWNER=
##NPOINTS=1765
##FIRSTX=399.76428223
##LASTX=3997.64306641
##MAXX=3997.64306641
##MINX=399.76428223
##MAXY=0.76359320
##MINY=0.40993273
##XFACTOR=1.0000000000
##YFACTOR=1.000000000000000e-9
##FIRSTY=0.61015010
##DELTAX=2.03961372
##XUNITS=1/CM
##YUNITS=ARBITRARY UNITS
##XYDATA=(X++(Y..Y))
399.8 610150099 606216908 603869855 606009066 605130970 602148294 603323996 603587151 600103676 599783540
418.1 599783540 601478875 598566115 597426653 599331260 597727776 595906556 598451376 598685563 595737994
436.5 595737994 596846581 598449349 595822513 595546186 597991228 596130788 593780935 595520139 595317066
454.8 595317066 592546940 593423188 593910575 590658069 590071559 591893435 589856505 587842703 590060651
473.2 590060651 589852333 586993277 587939322 589252055 586652577 586042404 587874830 586011529 583961844
491.5 583961844 585914433 585722208 582708299 583142698 584018290 580907822 579704463 581289053 579228580
509.9 579228580 576276660 577218652 576865733 573469520 573326647 574638307 572581589 571591139 573606431
528.3 573606431 572801590 570574462 571920455 572965086 571353912 572521746 575440884 574798286 574194908
546.6 574194908 576654613 576822758 574773431 575867593 577187419 575158358 574822187 576962173 576082826
565 576082826 574354172 575834394 575988770 573535860 573951185 575709760 574393034 573930442 576247871
583.3 576247871 576282144 574933589 576591372 577707291 575757861 575875163 577879429 576840341 575596809
601.7 575596809 577397585 577600420 575671136 576588452 578172445 576683402 576183975 578251660 578250468
620 578250468 577471733 579943657 581998825 581215084 582274914 584858775 584444404 584045112 586758018
638.4 586758018 587949097 587016642 588753700 591215491 590875208 591599941 594461024 594704330 593735099
656.8 593735099 595418811 596281290 594643712 594597042 595802486 595002234 595971286 599468350 601017118
675.1 601017118 600615501 602644980 605064929 604556024 605003595 607552350 607714057 606791556 608467579
693.5 608467579 609389544 607756436 608157456 610327482 610172749 610209167 613063812 614697337 614469349
711.8 614469349 616614461 619454741 619693220 620947659 624713123 626531184 627147973 630261004 632999718
730.2 632999718 633109093 634574771 637434185 637693703 637592793 639987409 641159892 640340447 641676843
748.5 641676843 643706203 643017232 642703533 644384801 644214451 642867088 643971086 644934654 643488407
766.9 643488407 643353164 644803822 644026637 642808557 644182980 645256698 645197451 647836864 652091503
785.3 652091503 654281199 656643450 660867631 663321316 663990259 666371047 668635607 668342233 668575525
803.6 668575525 670003295 669182181 667436361 667760015 667608738 665816784 666049182 667872369 667749941
822 667749941 667459369 669079542 669765174 669365048 671081185 673470318 674090505 675553858 678595603
840.3 678595603 679657757 679353952 680599928 681117535 679234385 678260982 678566098 677324057 676077425
858.7 676077425 676835239 676915348 675840199 676758707 678623974 678708792 679188311 681349635 682057083 681332827
879.1 681332827 681841195 681766391 679267287 677249610 676431119 674114585 671474993 670892000 670194685
897.4 670194685 668250024 667598367 667579949 665511847 663026929 661694765 659069240 655086756 652664840
915.8 652664840 650957882 648112476 646415412 646783113 646466553 645686507 646479189 646891177 645374894
934.1 645374894 644301176 643721759 641138136 637842476 635826409 633037090 628863454 625923038 623683214
952.5 623683214 619898260 616125584 613652229 610272169 605950534 602914572 599836409 594808161
968.8 594808161 589746594 585345805 579436302 572757244 567444503 562060475 555611372 550439894
985.1 550439894 546852827 542834938 539257348 537521005 535716474 532986999 531237066 529976487
1001.4 529976487 527273595 524408340 522612453 520162165 517039657 515333652 514262378 512267947
1017.8 512267947 510887861 510780513 509960771 508673787 508745551 509069502 508434057 508485556 509394050 509097219
1038.2 509097219 508123755 507923365 507020473 504844189 503603995 503377318 502462387 501953244 503077507
1056.5 503077507 504040360 504417956 506084681 508201957 508829474 509189606 510070562 509697855 508629560
1074.9 508629560 509333789 511104047 512535930 515099347 518969953 521767437 523664057 526191175
1091.2 526191175 527773857 527391136 527251661 527683139 526940942 526312947 527568102 529000163 529875815
1109.6 529875815 532205582 535475194 537586570 539725423 542904913 544974446 545858622 547855318
1125.9 547855318 550075293 550892830 552103758 554252982 554875493 554285467 554692984 554896355 553787649
1144.2 553787649 553758800 555231810 555860698 556461215 558925211 561407745 562939346 566021562 570653796
1162.6 570653796 574622273 579249203 586018980 592412233 597636342 604130685 610936761 615591943
1178.9 615591943 619985461 625419319 629203916 631400108 634690702 637525558 637813926 638048947 639053464
1197.3 639053464 638123453 636270165 636229217 636115730 634495378 634063423 634739518 633576155 631819189
1215.6 631819189 631517947 630322278 627458453 625776052 624774575 622069061 619537592 618831158 617470026
1234 617470026 615190268 614647090 614761233 613422036 612747550 613746166 613725185 612900317 613714635 614623666
1254.4 614623666 613854766 613820910 615227640 615512848 615477502 617291212 618888378 618957222 620096087
1272.7 620096087 622169912 622468531 622280955 623599648 624235809 623456419 623934090 625014186 624180794
1291.1 624180794 623181462 623535454 622712553 620501161 619599223 618962944 616488516 614260614 613386750
1309.4 613386750 611353636 608481824 607367039 606634080 604557216 603408277 603577912 602423251 600671947
1327.8 600671947 600505948 600142062 598343074 597592056 598073602 597301364 596501291 597466707 597962081
1346.2 597962081 597063303 597116530 597731948 596737742 595666528 596016645 595545709 593653083 592811942
1364.5 592811942 592261255 590159297 588443100 588104486 586536288 583701313 581074774 575845122 568006873
1382.9 568006873 565096796 569941044 574864566 576086342 576568186 576221764 574278891 573081732 572923779
1401.2 572923779 571775377 570486069 570804715 570995688 570168257 570456028 571825325 572205365 572452307
1419.6 572452307 574025035 575119436 575542510 577270150 579663932 580565453 581200898 583136559 584467113
1437.9 584467113 584710419 586025536 587543786 587575495 587735355 588977695 589257240 588857770 590326369
1456.3 590326369 592761874 593611002 595184922 598354399 600940645 603228271 607668459 613865554
1472.6 613865554 619107068 624334097 629519641 632782340 635383725 638857365 641392171 641861081
1488.9 641861081 642471850 642978013 641481936 639114857 637682259 635472357 632349610 629866958 627143323
1507.3 627143323 623460650 621097505 619978905 618066728 615408957 614319742 613704503 611759126
1523.6 611759126 610261321 609241486 607115507 604509294 602915168 601690292 599660516 597409427
1539.9 597409427 595594406 593084514 591082513 590716600 590333462 589306355 589466929 590744317 590823293
1558.3 590823293 590209544 590499341 589993715 588734686 588423431 588458180 587215602 585929096 585344434
1576.6 585344434 583793342 581588268 580249071 578830898 576026559 573370099 571538746 568912625
1593 568912625 565860391 564036965 562311888 559579134 557395875 556048870 553834260 551204860 549602091
1611.3 549602091 548000634 545261681 542556763 540809751 538478494 535616338 533506453 531022847
1627.6 531022847 527930975 526121199 525237620 523413420 521878302 521662116 521252632 520458996 520545602
1646 520545602 521247804 521151245 521241844 522450626 522864163 523107231 524675608 527076602 529019773 531137466
1666.4 531137466 534411013 537755907 540343285 544014037 548290372 551435530 554695785 559219956
1682.7 559219956 564373910 568878174 573670745 578592360 582567990 587684035 594460785 600010872
1699 600010872 605382681 610519767 614431381 617619455 621012270 624323070 626335144 627834141 630234540
1717.4 630234540 631940126 632747471 634293079 635974407 636542380 637264550 638906240 639860749 640234053
1735.7 640234053 641717672 643541038 644861639 646976113 650273621 653309822 656523466 661081553
1752 661081553 665177464 668463469 672640562 677394927 681350112 684889138 689018428 692796230 695460320
1770.4 695460320 698659122 701939225 703674853 705317140 707926989 709922194 711015701 712927520
1786.7 712927520 715184152 716403365 717665553 719670892 720863044 721496940 723114133 724817872
1803 724817872 725466967 726506233 728295743 729197323 729641378 731108785 732507169 732965410 733918369
1821.4 733918369 735435724 735983551 736246467 737549782 738594472 738788784 739640057 740938604 741285563
1839.8 741285563 741497159 742647231 743443370 743547499 744415581 745496869 745571315 745831132 747003496
1858.1 747003496 747596383 747599542 748450577 749427080 749330759 749537230 750565529 750888288 750823915 751621664
1878.5 751621664 752266526 752005219 752328217 753362238 753562629 753485620 754304945 754773438 754427493 754815876
1898.9 754815876 755715430 755736709 755720198 756537259 756850183 756480217 756962538 757812381 757720947 757690847
1919.3 757690847 758404791 758475304 758063853 758575797 759222507 758960545 758965492 759627640 759585977 759139180
1939.7 759139180 759573221 760030568 759663224 759741187 760348797 760134697 759732544 760277450 760621071 760198355
1960.1 760198355 760370433 760961175 760659039 760303676 760869563 761085749 760609686 760796130 761267245 760883927
1980.5 760883927 760678172 761307716 761395752 760888159 761124194 761468709 760933459 760740042 761308789 761235237
2000.9 761235237 760718703 760994315 761194050 760537803 760362267 760857761 760628998 760091603 760321856 760310054
2021.3 760310054 759550929 759429991 759857833 759470224 758966923 759289742 759267569 758595526 758634806 759036481
2041.7 759036481 758595169 758230805 758641183 758549929 757904887 758049130 758419096 757963777 757748902 758251071
2062.1 758251071 758115828 757537425 757836759 758220494 757781684 757678628 758153021 757906735 757398963 757776141
2082.5 757776141 758046508 757528901 757487893 757935584 757609367 757188380 757625043 757778347 757264256 757389903
2102.9 757389903 757852972 757448256 757064879 757549763 757682443 757196009 757368386 757771552 757365167 757171690
2123.3 757171690 757753372 757803917 757386506 757725358 758114576 757686555 757605016 758220613 758220315 757852674
2143.7 757852674 758251011 758584797 758167863 758231699 758872330 758780837 758468509 758970678 759270787 758851171
2164.1 758851171 759006739 759622276 759470463 759260535 759829104 760052562 759658813 759947896 760594845 760449767
2184.5 760449767 760366261 761011600 761137068 760700941 761051357 761621118 761360943 761312366 761938572 761943579
2204.8 761943579 761521637 761941016 762456715 762159288 762145579 762680054 762520730 762111068 762598813 763025939
2225.2 763025939 762647748 762660563 763148963 762904584 762522399 763003290 763300478 762904346 763025939 763479710
2245.6 763479710 763134181 762789130 763271153 763437629 762994468 763166368 763593197 763209581 762920439 763394535
2266 763394535 763436675 762940228 763085246 763354361 762871981 762678742 763178885 763109684 762608469 762771308
2286.4 762771308 762865901 762166440 761888623 762290120 762047827 761448205 761512995 761412442 760583162 760220170
2306.8 760220170 760418534 759979963 759325445 759312868 758964717 757838011 757278919 757351160 756809175 756074309
2327.2 756074309 755944669 755581200 754711509 754473269 754599452 754053235 753564537 753725588 753715694 753629506
2347.6 753629506 753807962 753482223 752078414 750709295 750098705 749279857 748582423 749022305 749577284
2366 749577284 749506533 749867320 750553310 750543118 750588953 751426399 751934707 751694679 751770616 752040446 751515448
2388.4 751515448 750866294 750958800 750843048 750112057 749804676 749726355 748970985 748298466 748346269 748054266
2408.8 748054266 747231960 746921122 746749341 745903909 745231688 745176136 744664252 743727207 743405163 743205190
2429.2 743205190 742383301 741823494 741822302 741302609 740427375 740126312 739773512 738827765 738271475 738198340
2449.6 738198340 737563550 736713052 736445129 736026585 735103607 734628201 734476924 733723164 732878089 732576847
2470 732576847 732011735 731020272 730570078 730380237 729564488 728734255 728450119 727876186 726935387 726556659
2490.4 726556659 726361752 725564599 724856913 724613190 723983467 723104894 722835362 722631454 721837103 721212566
2510.8 721212566 720981836 720342577 719581783 719426632 719208896 718428254 717902720 717702508 717029393 716279507
2531.2 716279507 716118991 715844989 715071797 714566231 714273512 713536680 712878823 712782323 712433338 711591721
2551.6 711591721 711071849 710735500 709968865 709356010 709259808 708835840 708020270 707596004 707233548 706399679
2572 706399679 705784142 705621541 705075860 704247236 703850150 703423440 702540457 701932847 701713264 701102197
2592.4 701102197 700281262 699842751 699318349 698446512 697933018 697712719 697014451 696158648 695710540 695133924
2612.8 695133924 694232225 693682313 693322062 692517996 691710114 691284657 690641046 689740002 689230561 688817739
2633.2 688817739 687952876 687159896 686711013 685964227 685001612 684498250 684069276 683185101 682400346 681904614
2653.5 681904614 681099653 680181682 679727197 679269612 678402007 677696824 677215278 676410139 675610006 675258577
2673.9 675258577 674767911 673879504 673221350 672743917 671917737 671158135 670855463 670369923 669489443 668825984
2694.3 668825984 668316066 667532086 666877508 666593850 666041195 665125191 664460719 663912416 663084269 662397921
2714.7 662397921 662022412 661383450 660535216 660013676 659519255 658702850 658063233 657723904 657128274 656369269
2735.1 656369269 655896008 655400634 654685915 654244602 654002845 653407991 652704597 652272105 651724398 650970876
2755.5 650970876 650515974 650200129 649520099 648801506 648380935 647838831 647118032 646674097 646287560 645514190
2775.9 645514190 644705474 644147098 643463254 642660439 642131627 641620159 640764177 639907718 639203191 638304710
2796.3 638304710 637379050 636748910 636009514 634938002 634010553 633219600 632111371 630943596 630089581
2814.7 630089581 629146397 627900720 626754105 625668943 624324262 622989655 621875226 620572448
2831 620572448 618956089 617376268 615719020 613607943 611231387 608720779 605643809 602109730 598991454
2849.3 598991454 596739292 595334172 594834208 594929755 594895601 594533920 594067216 593260407 591978967
2867.7 591978967 590772331 589893103 588998556 588120639 587532878 586981118 586268425 585692406 585188448
2886.1 585188448 584357619 583357394 582485557 581511199 580337644 579283357 578286052 577015042 575606823
2904.4 575606823 574197710 572484136 570425212 568238676 565745890 562925398 560414612 558594465
2920.7 558594465 557257116 556408286 556286633 556648254 557096839 557837129 559024394 560345531 561836600
2939.1 561836600 563700795 565547705 566975355 568130493 569089055 569678724 570051014 570511878 571000695
2957.4 571000695 571519434 572389185 573600054 574933887 576557577 578540146 580470860 582177877 583886325
2975.8 583886325 585525870 586872280 588078082 589266598 590191960 590867937 591636240 592314243 592540681
2994.2 592540681 592640400 592763543 592474937 591875255 591402352 590917766 590295494 589882612 589607418 588983595
3014.5 588983595 588133514 587430418 586686969 585768342 584934115 584125221 583123326 582161605 581423402
3032.9 581423402 580527902 579390109 578498721 577770889 576743782 575572431 574520051 573432386 572310328
3051.3 572310328 571375549 570489109 569384158 568259358 567317724 566359937 565447152 564760029 563942015
3069.6 563942015 562819660 561851323 561204731 560512185 559675813 558896959 558079422 557087004 556163847
3088 556163847 555367827 554422021 553456545 552744806 552036703 551093876 550114334 549198151 548279643 547466099
3108.4 547466099 546705186 545758784 544748843 543951273 543142796 541977525 540734351 539720595 538674533
3126.7 538674533 537518919 536475241 535414934 534232020 533207953 532346845 531247318 529950082
3143 529950082 528816521 527725697 526530445 525475323 524500310 523261189 521900296 520711243 519518733
3161.4 519518733 518243790 517153859 516158640 514947176 513643801 512475431 511306107 510064065
3177.7 510064065 508943498 507886231 506688356 505467176 504350722 503180802 501952291 500872791
3194 500872791 499841928 498655111 497481346 496472895 495437652 494344652 493357241 492354214 491210997
3212.4 491210997 490119994 489147633 488120228 487108827 486253738 485329390 484200567 483135939 482238919
3230.7 482238919 481296837 480271369 479297906 478298753 477183670 476136267 475218594 474255890 473233044
3249.1 473233044 472254694 471251428 470190167 469210744 468265444 467214853 466197878 465322763 464444965
3267.5 464444965 463567525 462765664 461883307 460862458 459944636 459203094 458372355 457432210 456659138
3285.8 456659138 455995560 455288291 454683542 454129249 453408092 452603191 451885849 451249778 450667709 450132489
3306.2 450132489 449485779 448602885 447642893 446802109 445987999 445113003 444332510 443639278 442846030 441940010
3326.6 441940010 440995157 439990520 438990384 438182622 437500089 436655223 435656190 434691459 433701545
3345 433701545 432723045 431957155 431213051 430215865 429147363 428232431 427393943 426576346 425841331 425171018
3365.4 425171018 424452722 423605829 422612786 421583086 420746684 420119822 419476718 418698400 417928070
3383.7 417928070 417300433 416770518 416354388 416016340 415495157 414815396 414379895 414162159 413685709 412954271
3404.1 412954271 412437797 412161976 411836833 411459416 411047816 410588741 410309821 410252094 410136074 409955710
3424.5 409955710 409932733 410032213 410088956 410242587 410601944 410833508 410755366 410720229 410943061 411249489
3444.9 411249489 411610991 412044287 412436485 412822276 413306177 413894534 414537281 415181071 415891618 416739285
3465.3 416739285 417659760 418457508 418965578 419440538 420215011 421212614 422147036 422903359 423682988 424614340
3485.7 424614340 425561458 426542103 427614659 428633243 429649383 430738032 431775600 432812393 433947980
3504 433947980 434994310 435902297 436979085 438295752 439519316 440610528 441855013 443248510 444652259
3522.4 444652259 445971102 447161913 448351800 449728072 451312125 452956736 454503477 455950350
3538.7 455950350 457515866 459263444 461065680 462812066 464425147 465961516 467600435 469330668
3555 469330668 471076161 473016769 475163430 477097034 478817075 481018484 483481824 485527247 487498224
3573.4 487498224 489737719 492085516 494520724 497087568 499578089 501922429 504450917 507129610
3589.7 507129610 509468019 511722624 514347672 517178893 519959927 522745788 525492251 528090596
3606 528090596 530789196 533654451 536507070 539413989 542267859 545220137 548476517 551447570 553945065
3624.4 553945065 556243002 559141099 562834859 565995038 568704426 571449518 574274361 577116430
3640.7 577116430 579916179 582645833 585409164 588613629 591960132 594495475 596628964 599305868
3657 599305868 602172256 604579628 606677949 608659983 610472202 612375140 614635646 616602063 618406177
3675.4 618406177 620286047 621847987 623339415 624872208 626338005 627921343 629501700 630620360
3691.7 630620360 631514430 632423997 633297205 634181023 635218859 636265039 637081623 637758732 638358653
3710 638358653 639053226 639995873 640834033 641419947 641883910 642335474 642764568 643208444 643759549 644360781
3730.4 644360781 644971907 645546794 646142483 646753669 647033513 646961868 647266030 647979677 648224413 648315668
3750.8 648315668 648819625 649399102 649853826 650270581 650605619 650786042 650973618 651182830 651362658 651699305
3771.2 651699305 652092874 652392745 652656257 652926564 653168023 653308690 653454900 653704405 653960526 654126465
3791.6 654126465 654193103 654317558 654589832 654748917 654911220 655170083 655181468 655211985 655416250 655600369
3812 655600369 655763566 656011283 656182647 656090558 656196177 656422198 656496763 656623363 656753302 656903028
3832.4 656903028 657149374 657201111 657038510 657014012 657142222 657317519 657447398 657464921 657195508 656731904
3852.8 656731904 656995833 657584846 657755256 657638013 657451987 657410741 657406569 657380402 657601118 657777369
3873.2 657777369 657773852 657699049 657565236 657641172 657819510 657921374 657918155 657647133 657415152 657502234 657582402
3895.6 657582402 657520235 657443941 657309651 657144070 657123327 657103777 657048523 657132626 657201350 657037973 656805336
3918.1 656805336 656719685 656706452 656696558 656721473 656658471 656452835 656280279 656223595 656167686 656106174 656104267
3940.5 656104267 656118870 656032741 655824363 655652702 655555785 655476034 655453265 655428767 655345917 655264795 655201077
3962.9 655201077 655117989 655061483 655079782 655031562 654825449 654618442 654495955 654414654 654438496 654570401 654551625
3985.4 654551625 654301882 654084444 653995991 653979897 654048681 654107571
3997.6 654107571
##END=$$ End of the data block
