##TITLE=$$ Begin of the data block
##JCAMP-DX=5.00 $$ ACD/SpecManager v 10.08
##SPECTROMETER/DATA SYSTEM=Alpha
##DATE=10 Nov 2014 10:35:34
##DATA TYPE=INFRARED SPECTRUM
##DATA CLASS=XYDATA
##ORIGIN=
##OWNER=
##NPOINTS=1765
##FIRSTX=399.76428223
##LASTX=3997.64306641
##MAXX=3997.64306641
##MINX=399.76428223
##MAXY=0.76431990
##MINY=0.40890354
##XFACTOR=1.0000000000
##YFACTOR=1.000000000000000e-9
##FIRSTY=0.60937172
##DELTAX=2.03961372
##XUNITS=1/CM
##YUNITS=ARBITRARY UNITS
##XYDATA=(X++(Y..Y))
399.8F09371722l221214j766920J991391j433790l039598J590609M92990l391802j36018
418.1F00457370J702667k778411r73285J646817k059460k051293K686321L07501l308356
436.5E95629871O54578J587570k206505p9929K209365j915634k194762J698911k33888
454.8E95149577k633095J128852O81043l418207r47655J748682j756371j836538K027214
473.2E90143502n00500l032148R30667J467168k497137o51955J804948j857222k056658
491.5E83750665J882672j99198k896428N00142R38297k972842j170039J543820j977384
509.9E79399705k809286R29177n51463l572523k30789J292824j957476r16242J975774
528.3E73559701q49545k233862J300096Q68559j866579J028061L058255m14730n89430
$$ y = [609371722, 606150508, 604383588, 606374979, 604941189, 601901591, 603492200, 603985190, 600593388, 600457370, 602160037, 599381626, 598408341, 600055158, 597995698, 595944405, 598630726, 598938227, 595629871, 596284449, 597872019, 595665514, 595585585, 597794950, 595879316, 593684554, 595383465, 595149577, 592516482, 593645334, 594326377, 590908170, 589960515, 591709197, 589952826, 588116288, 590143502, 589643002, 586610854, 587541521, 589008689, 586511552, 585859597, 587664545, 585807323, 583750665, 585633337, 585434139, 582537711, 583037853, 583976150, 581003308, 579833269, 581377089, 579399705, 576590419, 577519596, 576968133, 573395610, 573164821, 574457645, 572500169, 571583927, 573559701, 572710156, 570476294, 571776390, 572644949, 570778370, 571806431, 574864686, 574449956, 573860526]
546.6E73860526K421141K53975j981675J138627J428008j888931k93612K007603j004338
565E75941324j693904J482963L6061k484560N00381J837254j280904l64304K478183
583.3E76452494K5749j480818J601219J133979j993418j09971J799226j009226j091659
601.7E75327575J939655L17454j864195R20415J545370j659751o96123K081215R9838
620E78011453p21156K501905K005636q39352J079142K566397m24862l19362K749622
638.4E86609423J180649r35495J727283K452433m28438N81145K828419L11792r09447
656.8E93417764J757443R20236j681388n6147J371681o67750Q54551L308773J427472
675.1F00652635l82543K091587K476335m53234M28259K479136R5904r63628J691699
$$ y = [573860526, 576281667, 576535642, 574553967, 575692594, 577120602, 575231671, 574938059, 576945662, 575941324, 574247420, 575730383, 575766444, 573281884, 573782265, 575619519, 574338615, 573974311, 576452494, 576478243, 574997425, 576598644, 577732623, 575739205, 575629234, 577428460, 576419234, 575327575, 577267230, 577584684, 575720489, 576640904, 578186274, 576526523, 575830400, 577911615, 578011453, 577290297, 579792202, 581797838, 580958486, 582037628, 584604025, 584179163, 583859801, 586609423, 587790072, 586854577, 588581860, 591034293, 590605855, 591187000, 594015419, 594327211, 593417764, 595175207, 596095443, 594414055, 594357908, 595729589, 595061839, 595916390, 599225163, 600652635, 600270092, 602361679, 604838014, 604384780, 604813039, 607292175, 607388079, 606424451, 608116150]
693.5F08116150R73880j586079M44173K218903j61589j9967K817154J593530k82824
711.8F14113331K108335K915085L95775J293361L702819J777411O04927L123760K746940
730.2F32781744J07586J470745K871275K38895j88648K359986J272559p26938J341700
748.5F41528904J987517p65681l56674J741230j13964j390695J077652J026451j396656
766.9F43338084j66237J383424q21114j227617J417994J171232L7789K693951M235148
785.3F52062654K140761K386331M290462K450407O15656K384782K260625l89755J96040
803.6F68397963J503050p92265j789808K97964j54972j799405K10047J776755j48177
822F67501152k43783J687884O58154m95970J699448K500832P60734J531243L040612
$$ y = [608116150, 609090030, 607503951, 607948124, 610167027, 610005438, 609985471, 612802625, 614396155, 614113331, 616221666, 619136751, 619532526, 620825887, 624528706, 626306117, 626911044, 630034804, 632781744, 632889330, 634360075, 637231350, 637470245, 637281597, 639641583, 640914142, 640187204, 641528904, 643516421, 642750740, 642394066, 644135296, 644021332, 642630637, 643708289, 644734740, 643338084, 643171847, 644555271, 643734157, 642506540, 643924534, 645095766, 645133555, 647827506, 652062654, 654203415, 656589746, 660880208, 663330615, 663946271, 666331053, 668591678, 668201923, 668397963, 669901013, 669108748, 667318940, 667616904, 667461932, 665662527, 665872574, 667649329, 667501152, 667257369, 668945253, 669603407, 669107437, 670806885, 673307717, 674068451, 675599694, 678640306]
840.3F78640306J054466k73049J256764M60565j930893r41157L73066j274944j395583
858.7F75969541O88076J30832j022339R96471J927018K1815L82781K155006P42495
877F81991696p44998M56810o2406k393663j908362p94053k327800k603769n40257p50839
897.4F70322359k092302p55966K5868j956939k430260j315415k610863l982544k440571
915.8F52763367j756311k894997j720190L54647l08454p56323Q33750M51326j563966
934.1F45402849j174748o20485k572834l285170j995623k778411m222095k989351k227486
952.5F23536646l724813l668308k403498l408253m387379l080368l066063m968882
968.8E94829082n011320m386127n929172o733000n375385n392611o400407n131423
$$ y = [678640306, 679694772, 679421723, 680678487, 681139052, 679208159, 678267002, 678640068, 677365124, 675969541, 676657617, 676788449, 675766110, 676762581, 678689599, 678711414, 679094195, 681249201, 681991696, 681246698, 681703508, 681641102, 679247439, 677339077, 676545024, 674217224, 671613455, 671073198, 670322359, 668230057, 667474091, 667499959, 665543020, 663112760, 661797345, 659186482, 655203938, 652763367, 651007056, 648112059, 646391869, 646746516, 646438062, 645681739, 646515489, 646966815, 645402849, 644228101, 643607616, 641034782, 637749612, 635753989, 632975578, 628753483, 625764132, 623536646, 619811833, 616143525, 613740027, 610331774, 605944395, 602864027, 599797964, 594829082, 589817762, 585431635, 579502463, 572769463, 567394078, 562001467, 555601060, 550469637]
985.1E50469637l565312l984928l564417j790702j867295k713620j709223j272082
1001.4E30002058k728403k830505j699806k358913l112793j793444j161516k015054
1017.8E12301624j380444j43051q40187j248360J15097L37064o28114O4135R20057
1036.1E09497821k84254r95040k63691r30369k143085j215935k72393r83834n10693
1054.5E01898527J190663J026630L98278J663029K103150O09637L48389Q77917l32535
1072.8E09783685r94205P25388J725912J393915K555430L874421K822041J919329K506376
1091.2E26312292J560092l49760j04785M07397p71999o25908J274943J461089Q73744
1109.6E30037105K271772L211081K097010K145767L208757K122104R06408J972616
$$ y = [550469637, 546904325, 542919397, 539354980, 537564278, 535696983, 532983363, 531274140, 530002058, 527273655, 524443150, 522743344, 520384431, 517271638, 515478194, 514316678, 512301624, 510921180, 510778129, 509937942, 508689582, 508804679, 509141743, 508513629, 508577764, 509497821, 509213567, 508218527, 507954836, 507024467, 504881382, 503665447, 503393054, 502409220, 501898527, 503089190, 504115820, 504514098, 506177127, 508280277, 508889914, 509238303, 510116220, 509783685, 508789480, 509514868, 511240780, 512634695, 515190125, 519064546, 521886587, 523805916, 526312292, 527872384, 527522624, 527417839, 527825236, 527053237, 526427329, 527702272, 529163361, 530037105, 532308877, 535519958, 537616968, 539762735, 542971492, 545093596, 546000004, 547972620]
1125.9E47972620K208292Q44240J234532K150297O13153o10531L82126K18332j070977
1144.2E53942084k7120J477778O40512N72323K442599K480626J518071L086745M649699
1162.6E70783317L961146M611313O785453O406843N194903O480336O832600M669308
1178.9F15725219M383803N438387L794670K182067L271997K828061L01182K58029R98139
1197.3F39181554r67025j868070q463p2182j613974m52400O79672j127600j732827
1215.6F32018685l09646j213252k892733j736879j038671k695203k506256p00176j349568
1234F17576301k251387n28037J13666j350224o68466J028776r596q36373P92980Q75354
1254.4F14742994q01682l0875J437664K94566n2870J806975J626849R4414J135647
$$ y = [547972620, 550180912, 551025152, 552259684, 554409981, 555023134, 554412603, 554794729, 555013061, 553942084, 553914964, 555392742, 556033254, 556605577, 559048176, 561528802, 563046873, 566133618, 570783317, 574744463, 579355776, 586141229, 592548072, 597742975, 604223311, 611055911, 615725219, 620109022, 625547409, 629342079, 631524146, 634796143, 637624204, 637925386, 638183415, 639181554, 638214529, 636346459, 636337996, 636265814, 634651840, 634199440, 634879112, 633751512, 632018685, 631709039, 630495787, 627603054, 625866175, 624827504, 622132301, 619626045, 618925869, 617576301, 615324914, 614796877, 614910543, 613560319, 612891853, 613920629, 613911033, 613074660, 613867640, 614742994, 613941312, 613910437, 615348101, 615642667, 615589797, 617396772, 619023621, 619118035, 620253682]
1272.7F20253682K087891L28183k01523J275063O43909p34270M88639J058936q63612
1291.1F24336898j026690L48449q21471k227128q99553n96523k451778k249837r16898
1309.4F13495469k063155k858639j077175p16567k098262j185119J81555j098513j726330
1327.8F00853264j95741m10021j820981p69615M49001p74383p61628J014471N35071
1346.2E98119438q89957N5015O31273j015544j111925L40104m95612j929641q23736
1364.5E92879415n15640k093077j725674l83734j603246k780795k507568n089640p734776
1382.9E68445265k927005M743278M880726J201094L86714m37498j944482j152456j14798
1401.2E73080838j155079j329660L13580K11179q33154K52426J326680L22402K15411
$$ y = [620253682, 622341573, 622669756, 622468233, 623743296, 624387205, 623652935, 624141574, 625200510, 624336898, 623310208, 623658657, 622837186, 620610058, 619710505, 619113982, 616662204, 614412367, 613495469, 611432314, 608573675, 607496500, 606779933, 604681671, 603496552, 603678107, 602579594, 600853264, 600657523, 600247502, 598426521, 597656906, 598105907, 597331524, 596569896, 597584367, 598119438, 597229481, 597284496, 597915769, 596900225, 595788300, 596128404, 595632792, 593703151, 592879415, 592363775, 590270698, 588545024, 588161290, 586558044, 583777249, 581269681, 576180041, 568445265, 565518260, 570261538, 575142264, 576343358, 576730072, 576292574, 574348092, 573195636, 573080838, 571925759, 570596099, 570909679, 571120858, 570287704, 570540130, 571866810, 572189212, 572404623]
1419.6E72404623J605630J150131M63903J707316K354323R15111O34074J885831J345337
1437.9E84466279L13580J365423J515209m7504R5725J275658L02255n16474J255989
1456.3E90026140K442539J039743J658023L154218K626121K346993M359960O029308
1472.6F13683045N226612N340517N283534L298283K584099L422499K442539L93748
1488.9F41674876O79434O03556j526296k441585j408160k169788l213226k760530k901137
1507.3F26537144l475427k173722j101911j979947k688289j121521o60002j898349
1523.6F11437976j431703r50158k070665k623916j604915j234531k204299k515435
1539.9E96802354j760245k248466j808822l11613l88801j028120R9718J096249j41025
$$ y = [572404623, 574010253, 575160384, 575624287, 577331603, 579685926, 580601037, 581235111, 583120942, 584466279, 584779859, 586145282, 587660491, 587612987, 587708712, 588984370, 589286625, 588770151, 590026140, 592468679, 593508422, 595166445, 598320663, 600946784, 603293777, 607653737, 613683045, 618909657, 624250174, 629533708, 632831991, 635416090, 638838589, 641281128, 641674876, 642354310, 642957866, 641431570, 638989985, 637581825, 635412037, 632198811, 629438281, 626537144, 623061717, 620887995, 619786084, 617806137, 615117848, 613996327, 613336325, 611437976, 610006273, 609056115, 606985450, 604361534, 602756619, 601522088, 599317789, 596802354, 595042109, 592793643, 590984821, 590673208, 590284407, 589256287, 589356005, 590452254, 590311229]
1558.3E90311229n03421N15879m06146j267851l84331L6359j221537j388193o21736
1576.6E85070252j381933k059818j292347j420737k825200k680779j851380k649843
1593E68908215l080845j836956j727760k779483k264083j386464k226948k654434j632213
1611.3E49319029j641154k807677k756357j749337k345741k856493k072871k470612
1627.6E30618787l065944j805127r96172j963079j478434r9361l81767q79169l6299
1646E19913435P24435n1916L219J274049O60181L83496J606524K408267J955151K068222
1666.4E30945063L161788L326833K660572L733635M353404L172636L176928M363239
1682.7E58894098N123019M656374M892648M963159L940702M987001O650984N491734
$$ y = [590311229, 589807808, 590323687, 589917541, 588649690, 588265359, 588301718, 587080181, 585691988, 585070252, 583688319, 581628501, 580336154, 578915417, 576090217, 573409438, 571558058, 568908215, 565827370, 563990414, 562262654, 559483171, 557219088, 555832624, 553605676, 550951242, 549319029, 547677875, 544870198, 542113841, 540364504, 538018763, 535162270, 533089399, 530618787, 527552843, 525747716, 524751544, 522788465, 521310031, 521210670, 520828903, 519949734, 519913435, 520637870, 520585954, 520589173, 521863222, 522523403, 522906899, 524513423, 526921690, 528876841, 530945063, 534106851, 537433684, 540094256, 543827891, 548181295, 551353931, 554530859, 558894098, 564017117, 568673491, 573566139, 578529298, 582470000, 587457001, 594107985, 599599719]
1699E99599719N466521N288064L994704L281176L485858L339887J954794J357555K312064
1717.4F30080342J825869R64404J618266J704394N68271O64950J497387Q48711M52161
1735.7F40224755J559079J854419J380682K144516L254473K963066L196001M647255
1752F61224246M192174L308355M167259M758060M017413L621697M102826L644407K513826
1770.4F95550263L172934L434241J876354J670420K592087K000153J119554J942992
1786.7G13358998K223730J101017J199127K065181J252234O32465J620174J773357
1803G25226283P13945J044094J772404R00686M53651J479923J425386M85301R37223
1821.4G34438896J450420M84645K27690J300692J127422K80202Q63373J297593L34203
$$ y = [599599719, 605066240, 610354304, 614349008, 617630184, 621116042, 624455929, 626410723, 627768278, 630080342, 631906211, 632870615, 634488881, 636193275, 636761546, 637426496, 638923883, 639772594, 640224755, 641783834, 643638253, 645018935, 647163451, 650417924, 653380990, 656576991, 661224246, 665416420, 668724775, 672892034, 677650094, 681667507, 685289204, 689392030, 693036437, 695550263, 698723197, 702157438, 704033792, 705704212, 708296299, 710296452, 711416006, 713358998, 715582728, 716683745, 717882872, 719948053, 721200287, 721832752, 723452926, 725226283, 725940228, 726984322, 728756726, 729657412, 730111063, 731590986, 733016372, 733501673, 734438896, 735889316, 736373961, 736601651, 737902343, 739029765, 739309967, 740173340, 741470933, 741805136]
1839.8G41805136J17779J052976Q37385J98961R35077J132131Q6903K22505J136541
1858.1G47525394O05762L5584Q28683Q68440j92761K60651J146257L52859r5010Q11935
1878.5G52147794O99043k50041K93672J007497J73747q8810Q25405M85122l18647M07815
1898.9G55382597R17793L1233k9505Q02517L13819l71099M71652Q30531j17898l0160
1919.3G58201480P32183Q5831l94463N29825O76930k39968L934O34312q3983m50253
1939.7G59695828M48644M49658l73841Q1420O36578j60754l85523N17905L15845m45724
1960.1G60780036J64509O03617k95818l61443N62668K25186m54306K07066M76361l99650
1980.5G61508226k32875O08265P4208n11765K41160L61323n14626j79052N84781o2049
$$ y = [741805136, 741922915, 742975891, 743813276, 744012237, 744947314, 746079445, 746166348, 746388853, 747525394, 748131156, 748166740, 748995423, 749863863, 749671102, 749931753, 751078010, 751430869, 751335859, 752147794, 752846837, 752596796, 752890468, 753897965, 754071712, 753982902, 754808307, 755293429, 754974782, 755382597, 756300390, 756331623, 756302118, 757104635, 757418454, 757047355, 757519007, 758349538, 758231640, 758201480, 758933663, 759019494, 758625031, 759154856, 759831786, 759591818, 759595752, 760230064, 760146081, 759695828, 760144472, 760594130, 760220289, 760301709, 760938287, 760777533, 760392010, 760909915, 761225760, 760780036, 760944545, 761548162, 761252344, 760890901, 761453569, 761678755, 761224449, 761431515, 761907876, 761508226, 761275351, 761883616, 761957824, 761446059, 761687219, 762048542, 761533916, 761354864, 761939645, 761877596]
2000.9G61877596n04493K90393K02656o79254k10226M94242k25723n52177K51889L3915
2021.3G60978818p30872j07765M13715m16994n03301L28481m5180o86944N8293M12345
2041.7G59700596m73797m16875L92020o9857o27398J72972M24147m43637k70069M60327
2062.1G58848429j21415n54204L09646L89874m49300j21712M85599k30968n17369L72947
2082.5G58411527K83479n03599l0041M53472l32951m23611M58062J82808n13852Q8155
2102.9G58073449M31538l90709l42309M92155J04010m90069J98186M15027m05193j80363
2123.3G57905722N95987M1425m49598L18766L95000m33147j02699O12259L57l77595
2143.7G58506477M10676L49998m43041K8074O39617p2837k95281N26011L32177m07935
$$ y = [761877596, 761373103, 761663496, 761866152, 761186898, 760976672, 761470914, 761245191, 760693014, 760944903, 760978818, 760247946, 760140181, 760553896, 760136902, 759633601, 759962082, 759916902, 759229958, 759288251, 759700596, 759226799, 758809924, 759201944, 759132087, 758504689, 758677661, 759101808, 758658171, 758388102, 758848429, 758727014, 758172810, 758482456, 758872330, 758423030, 758301318, 758786917, 758555949, 758038580, 758411527, 758695006, 758191407, 758161366, 758614838, 758281887, 757858276, 758316338, 758499146, 757985294, 758073449, 758504987, 758114278, 757771969, 758264124, 758368134, 757878065, 758076251, 758491278, 758086085, 757905722, 758501709, 758543134, 758093536, 758412302, 758807302, 758374155, 758271456, 758883715, 758884072, 758506477, 758917153, 759267151, 758824110, 758852184, 759491801, 759418964, 759123683, 759649694, 759981871, 759573936]
2164.1G59573936J36972N94199j58430j84237O28769K50995m19617K63513O38186j50740
2184.5G61173546j12056O04152J18435m22180L58760O05762k08735m9114N90384M77
2204.8G62659431l86298M46677M92513l57806o0022N54800q6248l65794M78447M02748
2225.2G63778448l97921P332M90069k46227l67403N16296L11196m29035Q4818M53651
2245.6G64201224l28720l28421N04911J85489m50909J35183M01140l64542k52426M75049
2266G64177978R060n10216J77384K98321n21422k50876M94302m0889m60684J93953
2286.4G63566911J17362o68228k63095M09365k30909o08146N9367q1659p98702l23713
2306.8G61178553K28047m65095p10487k7060l20256j083076n07117J24693n14745p18355
$$ y = [759573936, 759710908, 760305107, 760146677, 759962440, 760591209, 760842204, 760422587, 760686100, 761324286, 761173546, 761061490, 761665642, 761784077, 761361897, 761720657, 762326419, 762117684, 762068570, 762658954, 762659431, 762273133, 762719810, 763212323, 762854517, 762794495, 763349295, 763263047, 762897253, 763375700, 763778448, 763380527, 763387859, 763877928, 763631701, 763264298, 763780594, 764091790, 763662755, 763747573, 764201224, 763872504, 763544083, 764048994, 764234483, 763783574, 763918757, 764319897, 763955355, 763702929, 764177978, 764187038, 763676822, 763854206, 764152527, 763631105, 763380229, 763874531, 763833642, 763372958, 763566911, 763684273, 763016045, 762752950, 763162315, 762931406, 762323260, 762382627, 762300968, 761502266, 761178553, 761406600, 760941505, 760231018, 760203958, 759883702, 758800626, 758293509, 758418202, 757903457, 757185102]
2327.2G57185102q6606l14534q48412k83182L6895n74290m23611K56718K0146j73688
2347.6G54794538O4373l40044j299859j253366n21600p71284p39038L82483N41448
2366G50857651p0154L43680O16074j03176k9564P75397M60684k85983K0325K31266
2386.4G52816200n18083o16432R6262j58370p79628l18587o4969p38621o39915P7843
2406.8G49155700k89380q49963l55482k05278q56936o48975q047n09083r80318l39031
2427.2G44113207j88291q18312n61297J0550n04196q73446l05295l61681r56059n50270
2447.6G39004910n3346o07789q31604k86340m62532r61841m88579j27852p27653q47161
2467.9G33610213l09348n66006r92477m33385j72377q29220q48353k94208n81920r39012
$$ y = [757185102, 757098496, 756783962, 755935550, 755652368, 755689263, 755114973, 754691362, 754948080, 754968226, 754794538, 754858911, 754518867, 753219008, 751965642, 751444042, 750672758, 749933720, 750316203, 750857651, 750787497, 751131177, 751747251, 751644075, 751614511, 752389908, 752850592, 752564609, 752584934, 752816200, 752298117, 751681685, 751777947, 751619577, 750839949, 750521362, 750456393, 749717772, 749077857, 749155700, 748866320, 748016357, 747660875, 747455597, 746598661, 745949686, 745941639, 745432556, 744452238, 744113207, 743924916, 743106604, 742545307, 742555857, 742051661, 741178215, 740872920, 740511239, 739555180, 739004910, 738951564, 738343775, 737512171, 737225831, 736763299, 735801458, 735312879, 735185027, 734457374, 733610213, 733300865, 732734859, 731742382, 731308997, 731136620, 730307400, 729459047, 729164839, 728582919, 727643907]
2488.3G27643907l78966k08378q14617p17520k39492o12557q53062k55703k19822q14736
2508.7G22529054o16551k04682o32107p73192j69813k40863p97689n15878j84715o70314
2529.1G17723250p45296j58727l06547q29756n24104k62737p10547o44505q9169l52859
2549.5G13099003q27074m87507l29732p86067o31213j11460m35055q10563m26352l78788
2569.9G07875192q24928n82099j31130n26905q56459m81904m97162q73030n57243j88768
2590.3G02355564o02425q26954m41671n11586q70586n31673k31564o92070q51512m51147
2610.7F96344376n56112q58962n11825l24965p98344q41856m47810o73950r67622n38706
2631.1F89824224l78132q50380q36015m78267p18415r12726m75109m41372r30548q13722
$$ y = [727643907, 727264941, 727056563, 726241946, 725524426, 725284934, 724672377, 723819315, 723563612, 723343790, 722529054, 721912503, 721707821, 721075714, 720302522, 720132709, 719891846, 719094157, 718578279, 718393564, 717723250, 716977954, 716819227, 716512680, 715682924, 715158820, 714896083, 714185536, 713541031, 713451862, 713099003, 712271929, 711784422, 711454690, 710668623, 710037410, 709925950, 709490895, 708680332, 708253980, 707875192, 707050264, 706468165, 706337035, 705810130, 704953671, 704471767, 703974605, 703101575, 702544332, 702355564, 701753139, 700926185, 700484514, 699972928, 699102342, 698570669, 698339105, 697647035, 696795523, 696344376, 695788264, 694929302, 694417477, 694092512, 693294168, 692452312, 692004502, 691330552, 690362930, 689824224, 689446092, 688595712, 687759697, 687281430, 686563015, 685650289, 685175180, 684733808, 683803260, 682989538]
2651.5F82989538m80295p88152q97169m14073m45485q88646p34270n04851q10683q13305
2671.9F76212609l72648m84944q84414o83307m81129q01206p70688l36408m64738q05080
2692.3F70128047n98907m96686q26418p28369l35991n55337q95619o54459n46873q30292
2712.7F63659096o80864l45290o07729q51750n58436n14329p92562o17505l35574n84304
2733.1F57770753p39694m65750n05209p42257m84407k51114n60046o99579m67837n48065
2753.5F52306795p09474m47214l61204o97195o95765m12643n57244p33316m47631l86000
2773.9F46859109p58111p85828n69582p32302q30830n18798m99845q67486q71062o93321
2794.3F39731944q83699r27925o28948p14719j059771r67324q20815j086355j151025
$$ y = [682989538, 682509243, 681721091, 680823922, 680409849, 679964364, 679075718, 678341448, 677836597, 677025914, 676212609, 675839961, 675355017, 674470603, 673787296, 673306167, 672504961, 671734273, 671397865, 670933127, 670128047, 669529140, 669032454, 668206036, 667477667, 667141676, 666586339, 665690720, 665036261, 664489388, 663659096, 662978232, 662632942, 662025213, 661173463, 660615027, 660100698, 659308136, 658690631, 658355057, 657770753, 657031059, 656565309, 656060100, 655317843, 654833436, 654582322, 654022276, 653322697, 652854860, 652306795, 651597321, 651150107, 650788903, 650091708, 649395943, 648983300, 648426056, 647692740, 647245109, 646859109, 646100998, 645315170, 644745588, 644013286, 643182456, 642663658, 642163813, 641296327, 640425265, 639731944, 638848245, 637920320, 637291372, 636576653, 635516882, 634549558, 633728743, 632642388, 631491363]
2812.6F31491363q46386r09448j223921j152516j079142j350283j389802j180649j340389
2831F21018827j621127j548171j585484k035618k370774k574623l117800l497600l073216
2849.3E99594414k265036j449346n26190R2625m3571l67343m54366p89702j265168
2867.7E92526317j196862q65578q76963q89481o19292n74291p29024n73099m89056
2886.1E85712671q36670j013398q53539r32157j174569j107335j028955j252770j378239
2904.4E76135039j399874j731396k089441k190888k448320k762020k469182j783967
2920.7E59259951j341700q92938j30415L60787M10617P11381J179278J297414J450420
2939.1E62304795J833021J847148J470626J200020R73344O16610L89040M14550M51386
$$ y = [631491363, 630644977, 629735529, 628511608, 627359092, 626279950, 624929667, 623539865, 622359216, 621018827, 619397700, 617849529, 616264045, 614228427, 611857653, 609283030, 606165230, 602667630, 599594414, 597329378, 595880032, 595353842, 595446467, 595402896, 595035553, 594581187, 593791485, 592526317, 591329455, 590463877, 589586914, 588697433, 588078141, 587503850, 586774826, 586201727, 585712671, 584876001, 583862603, 583009064, 582076907, 580902338, 579795003, 578766048, 577513278, 576135039, 574735165, 573003769, 570914328, 568723440, 566275120, 563513100, 561043918, 559259951, 557918251, 557025313, 556894898, 557255685, 557666302, 558377683, 559556961, 560854375, 562304795, 564137816, 565984964, 567455590, 568655610, 569628954, 570245564, 570634604, 571049154, 571500540]
2957.4E71500540N33044R01818J247526J342833J609027J977146J935005J720965J710117
2975.8E84478021J633286J344681J173854J155078R53257P20024P61211O64711K38359
2994.2E93122482Q8811J01805k71022n50688m63307n38408o52612l88741k59698o26921
3014.5E89561701q40306p04706p77483r56655q47220p95186r87410r71437p68542r12786
3034.9E80999970j134693q83103o89685r87709j176536j053154j059651j098812r29236
3053.3E71987391r06766j162052j185119r51708r40084r44734p71165q59379j079083
3071.7E63187301q96931o10768p02143q36551p37787p91192j017689r46284p92324
3090E55855632r53615r88960p36296p30038r43244r58800r10282r48906q47697p35581
$$ y = [571500540, 572033584, 572935402, 574182928, 575525761, 577134788, 579111934, 581046939, 582767904, 584478021, 586111307, 587455988, 588629842, 589784920, 590738177, 591458201, 592219412, 592884123, 593122482, 593211293, 593313098, 593042076, 592491388, 592028081, 591489673, 590837061, 590448320, 590188622, 589561701, 588721395, 588016689, 587239206, 586282551, 585435331, 584640145, 583652735, 582681298, 581912756, 580999970, 579865277, 578982174, 578292489, 577304780, 576128244, 575075090, 574015439, 572916627, 571987391, 571080625, 569918573, 568733454, 567781746, 566841662, 565896928, 565125763, 564266384, 563187301, 562290370, 561679602, 560977459, 560140908, 559403121, 558611929, 557594240, 556647956, 555855632, 554902017, 553913057, 553176761, 552446723, 551503479, 550544679, 549634397, 548685491, 547837794, 547102213]
3110.4E47102213q70466r72510q40246q87216j226067j248598r72033j028299j185834
3128.8E37870944j058460j034736j173675j034737q47757j099527j348615j203835
3145.1E29069602j126587j157284r86755r56177j250923j350880j164972j176596j294434
3163.4E18604994j148105j039028j226246j306355j159370j190782j284778j108170
3179.8E09142160j026928j217663j252711j098931j099706j172363j093030j071752
3196.1E00109076j204997j213163j095414j107335j117289r71824r60767j115978j078278
3214.4D90244031r64403j076967j102358r10908r28163j116276j045644q33482q92580
3232.8D81373250j073181j050711j021087j101285j031339r13382j005232j070261
$$ y = [547102213, 546231747, 545259237, 544418991, 543531775, 542305708, 541057110, 540085077, 539056778, 537870944, 536812484, 535777748, 534604073, 533569336, 532721579, 531622052, 530273437, 529069602, 527943015, 526785731, 525798976, 524842799, 523591876, 522240996, 521076024, 519899428, 518604994, 517456889, 516417861, 515191615, 513885260, 512725890, 511535108, 510250330, 509142160, 508115232, 506897569, 505644858, 504545927, 503446221, 502273858, 501180828, 500109076, 498904079, 497690916, 496595502, 495488167, 494370878, 493399054, 492438287, 491322309, 490244031, 489279628, 488202661, 487100303, 486189395, 485261232, 484144956, 483099312, 482265830, 481373250, 480300069, 479249358, 478228271, 477126986, 476095647, 475182265, 474177033, 473106772]
3249.1D73106772r62705r75609j089185j031429r60081j037598r99630q38905q55386
3267.5D64356244r00001q21680q64416r91881r24110p70033q31037r27031p97511o87927
3287.8D55840617o81251n90712n63681p33584q36939p29769o40154o05226n46813o73413
3308.2D49239075r38684r64492q03381q13157q92937p90298p32601q90553r97990r39310
3328.6D40475672r22620r52601q32230p12246q44806j014114j002341r97871r48966
3347D32247877p46637p93100j089662j115024r05037q47578q75831p79658o81788p31081
3367.4D23682481q41737r62943j015573q45582o31272o60420q40574q21829o25193
3385.7D16437358n11289m01437l45081n68718p27117m46767k30193n15103p48158m99844
$$ y = [473106772, 472144067, 471168458, 470079273, 469047844, 468087763, 467050165, 466050535, 465211630, 464356244, 463456243, 462634563, 461770147, 460778266, 459854156, 459084123, 458253086, 457326055, 456528544, 455840617, 455159366, 454568654, 454004973, 453271389, 452434450, 451704681, 451064527, 450459301, 449912488, 449239075, 448300391, 447335899, 446532518, 445719361, 444826424, 444036126, 443303525, 442412972, 441414982, 440475672, 439553052, 438600451, 437768221, 437055975, 436211169, 435197055, 434194714, 433196843, 432247877, 431501240, 430708140, 429618478, 428503454, 427598417, 426750839, 425875008, 425095350, 424413562, 423682481, 422840744, 421877801, 420862228, 420016646, 419385374, 418724954, 417884380, 417062551, 416437358, 415926069, 415524632, 415179551, 414610833, 413883716, 413436949, 413206756, 412691653, 411943495, 411443651]
3406.1D11443651k89381l65287l91304m16428m73202k87622n9217j06960j50711J2070
3426.5D08915609J14501M4703J45227L84897K46763j19775j25915J38730K90811L97235
3446.9D10432786M66853L90113L56704M85032O23882O68526O55889P27147Q83311R46373
3467.3D16636616P88003M92513M82470Q01563J027525R52691P43150P50512R11147
3485.7D23586190R41097R94266J103192J088262J081705J065075J005590J087547J177996
3504D33130920J041114R15200J080513J308322J238972J121699J257599J383126J417458
3522.4D43894923J354724J179069J185417J426727J633465J681239J580208J493514
3538.7D55429286J608610J759320J802504J737088J579464J512140J666605J787514
$$ y = [411443651, 411154270, 410788983, 410397679, 409981251, 409508049, 409220427, 409161210, 409054250, 408903539, 408915609, 409030110, 409074813, 409220040, 409604937, 409851700, 409731925, 409606010, 409744740, 410035551, 410432786, 410899639, 411289752, 411646456, 412131488, 412755370, 413423896, 414079785, 414806932, 415690243, 416636616, 417424619, 417917132, 418399602, 419201165, 420228690, 421181381, 421924531, 422675043, 423586190, 424527287, 425521553, 426624745, 427713007, 428794712, 429859787, 430865377, 431952924, 433130920, 434172034, 435087234, 436167747, 437476069, 438715041, 439836740, 441094339, 442477465, 443894923, 445249647, 446428716, 447614133, 449040860, 450674325, 452355564, 453935772, 455429286, 457037896, 458797216, 460599720, 462336808, 463916272, 465428412, 467095017, 468882531]
3555D68882531J800716J964062K122104J908035J682609K153396K536983K190858K057463
3573.4D87298757K321154K421140K406985K512157K474576K310276K504528K763271
3589.7E07012844K462566K313554K656341K884865K831101K838552K762914K526104
3606E28288841K635062K880990K876640K925038K861738K952815L345012L106475K528191
3624.4E54400802K214968K869487L824889L289700K820134K842844K885758K927423
3640.7E78076005K838552K601564K495289L022611L515661K802848K235234K692819
3657F00280583K940774K480864K085448J914024J714110J820267K266109J951098J775980
3675.4F19229257K008259J744688J580298J515508J382172J447916J518070J259506
$$ y = [468882531, 470683247, 472647309, 474769413, 476677448, 478360057, 480513453, 483050436, 485241294, 487298757, 489619911, 492041051, 494448036, 496960193, 499434769, 501745045, 504249573, 507012844, 509475410, 511788964, 514445305, 517330170, 520161271, 522999823, 525762737, 528288841, 530923903, 533804893, 536681533, 539606571, 542468309, 545421124, 548766136, 551872611, 554400802, 556615770, 559485257, 563310146, 566599846, 569419980, 572262824, 575148582, 578076005, 580914557, 583516121, 586011410, 589034021, 592549682, 595352530, 597587764, 600280583, 603221357, 605702221, 607787669, 609701693, 611415803, 613236070, 615502179, 617453277, 619229257, 621237516, 622982204, 624562502, 626078010, 627460182, 628908098, 630426168, 631685674]
3691.7F31685674J087249J031816Q87811P87019R58324J091361Q34823N49793M64856
3710F39378726P48516J108467R61721O12676L88027L53097L56853M34638N92589N33104
3730.4F45468414M09067M67956P21514P91609L33250j53542K45571P29799J90318P9334
3750.8F49283290O36816O46770L99351L90232M35829K76923K21491K58028K31445L80099
3771.2F53160274M33624K84314K06590K33769K06947J23144K38657L41534K31982J19030
3791.6F55579865Q047K5749J79350P7486J48475L60251J28031J50621L25918J78098
3812F57161891m6670L2604J72317l9160J22308K75433J45138J79410J44720J05798
3832.4F58253789J20223m5777r7394J09196K00391J93894R6976j13666n12063o12080
$$ y = [631685674, 632772923, 633804739, 634692550, 635479569, 636437893, 637529254, 638364077, 638913870, 639378726, 640127242, 641235709, 642197430, 642810106, 643198133, 643551230, 643908083, 644342721, 644935310, 645468414, 645877481, 646345437, 647066951, 647858560, 648191810, 648038268, 648283839, 649013638, 649203956, 649283290, 649920106, 650566876, 650966227, 651356459, 651792288, 652069211, 652290702, 652548730, 652780175, 653160274, 653593898, 653878212, 654084802, 654318571, 654525518, 654648662, 654887319, 655228853, 655460835, 655579865, 655587912, 655613661, 655793011, 655870497, 656018972, 656379223, 656507254, 656657875, 656983793, 657161891, 657115221, 657147825, 657320142, 657280982, 657403290, 657678723, 657823861, 658003271, 658147991, 658253789, 658374012, 658328235, 658230841, 658340037, 658540428, 658734322, 658831298, 658717632, 658205569, 657593489]
3852.8F57593489N16295R39906L32534j62661l04162q8811m9949j25706J47998J92463
3873.2F58991396R2090K0265j36792J5079J39058J13189O9261k17021k15888J06812
3893.6F58977449N4777j50323j09554l8564o2108N8115R7453k4855m7564n7638j54674
3916F58542514j55389r4295j28627o4313J20938K9206k35617k07365j0013l0697r0360
3938.5F57675982n6267m0829n0664j31727j81377r9301L0816Q8513k3544j66357j71900
3960.9F56873345j00672o7949m2677n007n8889j55151j69754j35362q7381J8001J12235
3983.3F56180739N484j68681j58191j00255r3937j0788J00374
3997.6F55754745
$$ y = [657593489, 658109784, 659049690, 659382224, 659219563, 658915401, 658826590, 658776641, 658650935, 658798933, 658991396, 659083486, 659103751, 658966959, 658982038, 659121096, 659234285, 659303546, 659086525, 658870637, 658977449, 659032226, 658881903, 658772349, 658733785, 658671677, 658729792, 658827245, 658802390, 658754826, 658697188, 658542514, 658387125, 658292830, 658164203, 658099890, 658220828, 658250034, 658014417, 657807052, 657797039, 657766342, 657675982, 657619715, 657578886, 657528222, 657396495, 657215118, 657115817, 657146633, 657235146, 657211602, 657045245, 656873345, 656772673, 656704724, 656662047, 656657040, 656598151, 656443000, 656273246, 656137884, 656050503, 656068504, 656180739, 656186223, 656017542, 655859351, 655759096, 655665159, 655654371, 655754745]
##END=$$ End of the data block
