##TITLE=$$ Begin of the data block
##JCAMP-DX=5.00 $$ ACD/SpecManager v 10.08
##SPECTROMETER/DATA SYSTEM=Alpha
##DATE=10 Nov 2014 10:35:34
##DATA TYPE=INFRARED SPECTRUM
##DATA CLASS=XYDATA
##ORIGIN=
##OWNER=
##NPOINTS=1765
##FIRSTX=399.76428223
##LASTX=3997.64306641
##MAXX=3997.64306641
##MINX=399.76428223
##MAXY=0.76466548
##MINY=0.40822512
##XFACTOR=1.0000000000
##YFACTOR=1.000000000000000e-9
##FIRSTY=0.60781968
##DELTAX=2.03961372
##XUNITS=1/CM
##YUNITS=ARBITRARY UNITS
##XYDATA=(X++(Y..Y))
399.8 607819676 604955196 603353798 605659127 604568541 601563692 602953494 603315055 599832773 599444568
418.1 599444568 600981534 597937286 596612990 598220170 596455395 594681144 597275078 597596586 594790101
436.5 594790101 595857561 597352147 594903052 594851613 597198546 595198870 592822075 594542205 594397485
454.8 594397485 591719449 592720330 593410790 590162039 589315593 591034830 589154959 587205231 589275599
473.2 589275599 588866234 585884333 586947858 588590026 586163402 585469484 587210953 585339189 583303094
491.5 583303094 585199356 584882796 581841528 582431197 583509624 580525756 579346180 580918252 578929961
509.9 578929961 576083541 576984346 576386809 572782576 572620451 573911309 571740568 570722997 572916269
528.3 572916269 572300851 570139706 571473360 572406352 570538282 571558535 574687541 574274242 573643267
546.6 573643267 576047540 576239765 574164569 575185716 576476574 574510932 574268937 576402962 575478435
565 575478435 573759317 575177908 575162470 572681189 573215365 575004220 573686123 573304594 575716555
583.3 575716555 575774848 574412763 576015234 577004373 574971855 575083196 577158272 576238811 574994802
601.7 574994802 576713741 576972306 575168550 576095760 577583790 575942039 575350761 577496648 577581525
620 577581525 576754868 579137385 581131518 580355346 581494629 584169328 583858669 583454490 586017489
638.4 586017489 587165117 586353779 588175893 590595424 590206385 590948343 593852758 594114780 593052804
656.8 593052804 594662964 595609605 594017029 593940437 595186532 594436884 595392883 598840773 600309908
675.1 600309908 599841893 601841807 604315579 603903413 604393363 606983066 607203722 606265306 607904613
693.5 607904613 608871758 607279658 607628882 609767199 609623134 609610379 612407625 614029527 613844931
711.8 613844931 616067886 618960023 619199097 620398581 624115348 625911474 626536191 629714131 632510185
730.2 632510185 632627726 634068489 636897147 637132466 636970937 639340222 640613973 639879644 641194224
748.5 641194224 643176436 642430425 642076135 643809199 643744409 642454684 643530190 644422174 642927706
766.9 642927706 642778099 644253731 643506825 642272651 643668175 644837976 644838035 647427320 651570499
785.3 651570499 653740287 656226575 660545766 662954330 663565099 666001439 668310285 667950869 668161333
803.6 668161333 669673085 668905079 667105794 667379916 667271554 665521443 665689468 667404830 667262077
822 667262077 667037308 668708026 669368505 668922007 670665503 673136652 673818350 675328672 678449810
840.3 678449810 679585516 679259479 680422664 680893242 679017961 678064942 678347588 677038968 675717652
858.7 675717652 676494002 676691413 675679982 676615775 678532183 678634286 679075539 681226254 681926250
877 681926250 681165099 681672037 681611359 679118454 677144825 676342487 673963308 671301305 670801580 670156956
897.4 670156956 668133974 667411685 667418957 665374935 662900507 661633193 659080267 655106783 652656674
915.8 652656674 650918782 648050368 646337211 646706283 646410525 645600080 646332502 646743298 645212173
934.1 645212173 644072354 643497229 640984774 637721419 635720730 632960796 628761232 625755668 623500168
952.5 623500168 619760275 616063654 613649249 610263109 605865479 602760971 599722028 594790995
968.8 594790995 589768589 585373759 579472840 572749674 567363143 561954498 555514157 550330937
985.1 550330937 546733975 542730510 539153099 537402093 535614908 532925427 531190336 529929757
1001.4 529929757 527240336 524397552 522616327 520179868 517066538 515342534 514252782 512263834
1017.8 512263834 510909319 510828733 509994864 508667588 508733332 509087443 508461714 508481324 509379387 509140074
1038.2 509140074 508226395 508018196 507086694 504923403 503691196 503386974 502380788 501895368 503085017
1056.5 503085017 504047990 504412055 506096601 508230865 508849561 509179115 510064483 509769201 508774877
1074.9 508774877 509481430 511193693 512560308 515114188 519036055 521886766 523791552 526286542
1091.2 526286542 527817667 527416945 527328134 527832270 527115226 526441514 527641833 529059589 529930115
1109.6 529930115 532239079 535494089 537622929 539799213 543015778 545109391 545996785 547983229
1125.9 547983229 550177336 550983489 552224040 554388106 554987252 554382503 554793775 555001795 553887665
1144.2 553887665 553845882 555341303 556012154 556599855 559018314 561482549 563010097 566087425 570734739
1162.6 570734739 574725151 579370439 586165071 592542410 597705960 604170799 610986352 615634441
1178.9 615634441 620012581 625482917 629333198 631545961 634807348 637627780 637929916 638176560 639189482
1197.3 639189482 638279080 636444151 636403859 636284351 634677589 634265900 634944379 633782864 632035792
1215.6 632035792 631725609 630492330 627571225 625839651 624832630 622151971 619652212 618978441 617643952
1234 617643952 615380704 614842594 614948452 613577843 612877727 613896608 613921702 613121152 613926589 614817679
1254.4 614817679 614032507 614001334 615436018 615717769 615627766 617407262 619018435 619082272 620190024
1272.7 620190024 622276843 622609496 622417271 623728991 624375999 623590350 624058902 625156283 624345064
1291.1 624345064 623354197 623708069 622862756 620611608 619694471 619070470 616598487 614352167 613455951
1309.4 613455951 611412942 608545065 607421815 606666923 604596913 603477895 603680253 602560520 600798070
1327.8 600798070 600567281 600175083 598399878 597642422 598085403 597312987 596559286 597575903 598101079
1346.2 598101079 597209990 597283363 597920001 596886277 595764637 596117258 595631778 593706012 592927754
1364.5 592927754 592462599 590352654 588590562 588207066 586629450 583872557 581391752 576381564 568737686
1382.9 568737686 565802753 570436060 575210750 576369882 576747954 576289833 574312329 573169887 573099077
1401.2 573099077 571960151 570611000 570909917 571128666 570307612 570565522 571858585 572103143 572306812
1419.6 572306812 573974907 575147331 575599790 577305734 579674006 580586791 581184030 583034456 584384680
1437.9 584384680 584723175 586102962 587632537 587599039 587685108 588931561 589201927 588651180 589875281
1456.3 589875281 592356026 593469799 595150411 598297834 600924790 603245914 607545495 613554895
1472.6 613554895 618843734 624253154 629568934 632889092 635492682 638882041 641252041 641596556
1488.9 641596556 642281830 642927289 641404927 638927758 637538254 635415196 632200181 629349172 626326442
1507.3 626326442 622864783 620773792 619737327 617753983 615018964 613870502 613196433 611302137
1523.6 611302137 609898627 609007657 606993139 604354322 602681339 601382375 599092305 596505761
1539.9 596505761 594803274 592625558 590835094 590525031 590150297 589149296 589240193 590260625 590035081
1558.3 590035081 589583218 590172768 589776754 588493288 588100016 588174701 586999476 585600793 584976912
1576.6 584976912 583653152 581623733 580309689 578850687 575996459 573318183 571500838 568863153
1593 568863153 565743148 563858569 562120855 559382558 557164490 555768728 553497910 550831139 549226820
1611.3 549226820 547566295 544657707 541842341 540126622 537781179 534866154 532775998 530340075
1627.6 530340075 527287364 525455892 524396360 522377849 520940840 520922601 520582676 519676626 519576073
1646 519576073 520275116 520223081 520209074 521544158 522340477 522795916 524384499 526751518 528719902 530807495
1666.4 530807495 533951223 537269235 539941907 543673635 548052490 551267266 554421842 558710277
1682.7 558710277 563822865 568546355 573496938 578511357 582482994 587435186 594021678 599491715
1699 599491715 604965329 610252261 614233494 617548943 621111453 624491870 626416504 627700031 630016685
1717.4 630016685 631951094 632974386 634593368 636281073 636809230 637438655 638932049 639807403 640336394
1735.7 640336394 641941488 643756211 645076096 647207439 650461972 653393567 656555772 661233604
1752 661233604 665497184 668837011 672985077 677729130 681754112 685383856 689491570 693141699 695636392
1770.4 695636392 698773146 702216029 704126775 705828488 708473861 710527778 711640775 713550150
1786.7 713550150 715759456 716838479 718032420 720127165 721364081 721937239 723550200 725385487
1803 725385487 726142108 727173030 728930414 729854405 730331242 731812656 733231366 733706355 734633207
1821.4 734633207 736086071 736598253 736829996 738104343 739248276 739559889 740424514 741723537 742069066
1839.8 742069066 742172956 743195713 744044065 744274199 745211303 746319890 746385992 746627748 747821927
1858.1 747821927 748443663 748422921 749193728 750053406 749908268 750220001 751373351 751727581 751643002 752450228
1878.5 752450228 753139138 752891600 753193855 754206836 754376769 754289687 755132020 755634427 755327642 755745232
1898.9 755745232 756661892 756663501 756587327 757354438 757652044 757287800 757788539 758637846 758500874 758447289
1919.3 758447289 759192228 759309053 758926094 759444296 760092974 759823859 759830296 760515630 760475457 759984136
1939.7 759984136 760370851 760825932 760485530 760584652 761210203 761022329 760634840 761179447 761521697 761087656
1960.1 761087656 761244237 761826217 761512756 761160493 761747062 761972785 761511803 761728287 762228966 761857927
1980.5 761857927 761627972 762220383 762293696 761785507 762009561 762352467 761846542 761695206 762308240 762238979
2000.9 762238979 761679411 761928797 762147665 761515439 761330664 761808813 761567652 761024833 761272371 761274934
2021.3 761274934 760518372 760425031 760895371 760502577 759961069 760269821 760234416 759531617 759566247 759990335
2041.7 759990335 759536982 759120822 759522557 759483278 758881748 759060442 759470522 759003580 758719742 759176910
2062.1 759176910 759051442 758489251 758787036 759164751 758713782 758591354 759059966 758820057 758326590 758743644
2082.5 758743644 759038866 758498609 758445978 758911967 758592188 758180618 758664429 758852661 758300841 758362174
2102.9 758362174 758798838 758403957 758060336 758587062 758719623 758213341 758381307 758781016 758358002 758153081
2123.3 758153081 758757472 758850276 758439779 758741856 759092033 758651972 758591294 759235620 759235501 758853018
2143.7 758853018 759258509 759616494 759186208 759192526 759817243 759766459 759478509 759976327 760274172 759852946
2164.1 759852946 760009229 760647357 760520339 760319650 760901690 761127770 760716617 760994613 761644125 761499345
2184.5 761499345 761388242 762009919 762162089 761755764 762109518 762694538 762445867 762382030 763005316 763031542
2204.8 763031542 762633264 763050854 763532341 763204575 763186812 763744652 763625801 763227761 763698697 764127314
2225.2 764127314 763746500 763736188 764216125 763978839 763621449 764147937 764469564 764037490 764103889 764565527
2245.6 764565527 764256001 763894022 764343917 764512360 764079511 764246225 764665484 764297485 764053106 764566183
2266 764566183 764601648 764075100 764218092 764505327 764012992 763778031 764256120 764213145 763739467 763905704
2286.4 763905704 764036238 763405919 763169229 763580441 763325155 762701690 762786865 762741268 761948884 761598170
2306.8 761598170 761780620 761303425 760626733 760629535 760335445 759307444 758841932 758933008 758367240 757634521
2327.2 757634521 757514119 757121205 756216943 755958438 756050766 755478442 755027115 755290806 755343914 755197406
2347.6 755197406 755294383 755015731 753741562 752392769 751738787 750917375 750248253 750736952 751334012
2366 751334012 751260877 751542568 752143025 752079964 752053618 752809167 753248692 752943039 752961218 753187299 752640247
2388.4 752640247 752008915 752118289 751975119 751211584 750909626 750851631 750090003 749425948 749518037 749227583
2408.8 749227583 748349249 747999191 747823656 746975482 746292293 746245801 745760441 744824648 744491100 744281650
2429.2 744281650 743441582 742881358 742897987 742393374 741527081 741215825 740849137 739923954 739410281 739355326
2449.6 739355326 738697469 737812817 737519026 737071931 736116767 735625625 735489428 734753370 733912408 733626068
2470 733626068 733083129 732083380 731603503 731410980 730620980 729805350 729485631 728857219 727917612 727579236
2490.4 727579236 727410436 726617336 725880444 725598991 724973440 724122047 723859429 723656833 722877085 722258627
2510.8 722258627 722027123 721382380 720596373 720407307 720173180 719406247 718899310 718697429 718003869 717246234
2531.2 717246234 717115104 716860771 716061532 715537369 715257287 714520931 713847518 713747561 713419318 712626696
2551.6 712626696 712147236 711805105 711013138 710373461 710263550 709866524 709082961 708644986 708244801 707382917
2572 707382917 706750214 706601799 706086457 705236435 704779744 704333842 703469276 702871501 702662826 702059448
2592.4 702059448 701223373 700775623 700251937 699356854 698826313 698629797 697959363 697101235 696633101 696053863
2612.8 696053863 695167899 694652975 694346070 693547606 692690969 692247331 691603243 690659583 690119028 689732313
2633.2 689732313 688880086 688042223 687558532 686836064 685918629 685436666 685012877 684111416 683285475 682783425
2653.5 682783425 682009339 681129396 680718362 680286646 679380059 678581059 678059638 677298725 676517844 676120937
2673.9 676120937 675596654 674720407 674066424 673567295 672746539 672005534 671694100 671209276 670365214 669749618
2694.3 669749618 669258416 668458581 667768478 667425036 666817248 665905416 665282607 664756238 663934112 663243413
2714.7 663243413 662851214 662223458 661416054 660910487 660400987 659558833 658890963 658550143 657971859 657225549
2735.1 657225549 656761765 656260431 655523658 655073166 654861033 654308379 653602481 653128445 652558446 651825607
2755.5 651825607 651398242 651085854 650402486 649680078 649254858 648706377 647960722 647500575 647131920 646372378
2775.9 646372378 645551264 644970298 644252241 643412292 642873883 642362356 641485214 640618980 639950335 639089704
2796.3 639089704 638137341 637460709 636734366 635689735 634757042 633976638 632899582 631740034 630877972
2814.7 630877972 629936099 628693938 627538145 626444817 625097990 623746336 622604251 621265531
2831 621265531 619609773 618036032 616456449 614439487 612090886 609525561 606384873 602849483 599763870
2849.3 599763870 597510278 596074104 595577657 595714688 595697105 595319271 594832122 594006062 592718303
2867.7 592718303 591533780 590694249 589822054 588924527 588302910 587756634 587078154 586506069 585963428
2886.1 585963428 585083306 584063768 583206058 582235098 581059396 580017507 579022110 577753901 576363504
2904.4 576363504 574974895 573282540 571223974 569021583 566527307 563706934 561192095 559404314
2920.7 559404314 558097780 557234764 557105362 557455838 557862163 558572590 559776187 561126173 562613666
2939.1 562613666 564460158 566292465 567707837 568855882 569811642 570420265 570816994 571260810 571737885
2957.4 571737885 572283268 573175192 574406445 575742364 577337563 579295337 581233621 582980812 584717214
2975.8 584717214 586366236 587729692 588951707 590126634 591017723 591684103 592473865 593174279 593404770
2994.2 593404770 593493581 593596280 593283653 592689812 592252851 591772854 591117144 590687752 590421975 589803100
3014.5 589803100 588945270 588219821 587441325 586497247 585672736 584890306 583884478 582886934 582112491
3032.9 582112491 581216395 580105782 579221368 578478634 577428818 576242805 575223386 574194431 573076785
3051.3 573076785 572105467 571208000 570103109 568980694 568062544 567104995 566123545 565361381 564538538
3069.6 564538538 563435256 562460899 561800003 561096728 560269892 559517384 558710158 557714343 556809187
3088 556809187 556036115 555055559 554023743 553295672 552609742 551665425 550668120 549751401 548814416 547960341
3108.4 547960341 547186553 546249688 545265317 544497252 543671429 542452931 541188300 540201664 539192796
3126.7 539192796 538037717 536955416 535858870 534648538 533613801 532770693 531661570 530312002
3143 530312002 529140890 528043866 526866555 525853813 524914443 523670793 522281766 521079183 519912601
3161.4 519912601 518646777 517502606 516477466 515268683 513934076 512723982 511536300 510304391
3177.7 510304391 509203374 508141041 506902516 505642056 504513502 503353715 502164483 501131177
3194 501131177 500095963 498856515 497639298 496580601 495474756 494345576 493382394 492438585 491331667
3212.4 491331667 490236998 489232540 488132566 487039477 486134171 485198706 484105676 483073652 482157886
3230.7 482157886 481192112 480167568 479203016 478212088 477092773 476035982 475098163 474067122 472977728
3249.1 472977728 472023159 471092105 470048249 469026923 468028128 466929018 465905398 465068668 464188010
3267.5 464188010 463254660 462430567 461563200 460534394 459592789 458857000 458075970 457180947 456390560
3285.8 456390560 455700666 454996109 454362363 453774899 453049004 452236414 451515466 450869530 450260371 449710011
3306.2 449710011 449077368 448166668 447126001 446268082 445486158 444587648 443764240 443072736 442236006
3324.6 442236006 441240668 440292090 439327329 438318282 437487692 436800092 435927629 434859693 433818698
3342.9 433818698 432769954 431752771 430961072 430198193 429202080 428147525 427218199 426317275 425431252
3361.3 425431252 424680322 424006909 423245877 422350496 421338797 420323282 419497758 418849885 418157846
3379.6 418157846 417330295 416532129 415878087 415344208 414955944 414619714 414079845 413367361 412856340 412552059
3400 412552059 412016362 411278456 410778373 410475373 410109907 409739196 409360796 408905268 408599436 408528566
3420.4 408528566 408411920 408227235 408225119 408360332 408429652 408572733 408917487 409147471 409045011 408921152
3440.8 408921152 409068793 409400135 409808695 410234898 410605013 411004722 411556005 412199378 412847310 413493007
3461.2 413493007 414215058 415083021 416021168 416807622 417315602 417831033 418626845 419616371 420549721 421335667
3481.6 421335667 422170579 423108101 423999250 424928308 425998241 427073032 428164631 429291308 430340230
3500 430340230 431394964 432541013 433610082 434558004 435647726 436981797 438248426 439362377 440606594
3518.3 440606594 441998661 443419069 444768846 445985585 447239041 448695987 450328410 452015787
3534.6 452015787 453588933 455057561 456664950 458442420 460253000 461982608 463544071 465041041
3551 465041041 466724753 468559414 470390201 472372532 474522740 476441294 478131235 480314046 482858747
3569.3 482858747 485039711 487130255 489514738 491964012 494367361 496884346 499362379 501658678
3585.6 501658678 504181802 507008374 509523511 511848092 514459133 517290533 520100296 522976637
3601.9 522976637 525838792 528432488 531028092 533825278 536685586 539654851 542586923 545626998
3618.3 545626998 549017906 552120030 554652572 556881607 559723914 563516140 566861510 569791377
3634.6 569791377 572688580 575565636 578507602 581383586 583983541 586420953 589411199 592958570
3650.9 592958570 595759392 597969472 600714982 603755713 606258154 608350754 610322595 612024963
3667.2 612024963 613728404 615937054 617919505 619735301 621782303 623548627 625140429 626653254
3683.5 626653254 628013790 629464924 631014884 632275641 633340776 634379208 635316074 636150777 637124360
3701.9 637124360 638227105 639090538 639649630 640077710 640773356 641849101 642812312 643453419 643860877
3720.2 643860877 644235075 644664228 645135760 645664573 646138728 646529615 646952629 647633374 648435652 648792744
3740.6 648792744 648657203 648886979 649592280 649791896 649845362 650453985 651161790 651638269 652040899 652462542
3761 652462542 652730167 652896643 653064311 653251290 653668582 654191673 654556036 654796958 655048430 655285954
3781.4 655285954 655409336 655608237 655930996 656162560 656302154 656384051 656450450 656597257 656664014 656805992
3801.8 656805992 657089710 657133818 657236934 657570839 657817900 657869339 657969356 658068717 657915175 658094049
3822.2 658094049 658485115 658632517 658727527 658810973 658939898 659093797 658998430 658811986 658900738 659159303
3842.6 659159303 659424067 659570932 659517050 659053802 658390760 658773541 659621477 659921527 659772575 659530044
3863 659530044 659538805 659546196 659413517 659569323 659859776 660068989 660049617 659720421 659627140 659820199 659990311
3885.4 659990311 660058618 659837425 659632325 659747183 659834802 659721911 659574568 659428298 659281194 659349263
3905.8 659349263 659540296 659616590 659617245 659576774 659422696 659230232 659134150 659030497 658919454 659014285 659135580
3928.3 659135580 658976555 658733308 658644915 658541679 658395290 658359587 658414900 658387184 658197105 658009410
3948.7 658009410 657897174 657840431 657900214 657963157 657859564 657660782 657512844 657413304 657387972 657476664 657498896
3971.1 657498896 657330692 657139659 657020271 656893730 656846702 656973600 657027781 656826019 656606615 656542778
3991.5 656542778 656528175 656543851 656595111
3997.6 656595111
##END=$$ End of the data block
