##TITLE=$$ Begin of the data block
##JCAMP-DX=5.00 $$ ACD/SpecManager v 10.08
##SPECTROMETER/DATA SYSTEM=Alpha
##DATE=11 Nov 2014 09:02:30
##DATA TYPE=INFRARED SPECTRUM
##DATA CLASS=XYDATA
##ORIGIN=
##OWNER=
##NPOINTS=1765
##FIRSTX=399.76428223
##LASTX=3997.64306641
##MAXX=3997.64306641
##MINX=399.76428223
##MAXY=0.78607768
##MINY=0.36972767
##XFACTOR=1.0000000000
##YFACTOR=1.000000000000000e-9
##FIRSTY=0.59607989
##DELTAX=2.03961372
##XUNITS=1/CM
##YUNITS=ARBITRARY UNITS
##XYDATA=(X++(Y..Y))
399.8E96079886k601266j741052m98592o00994j504719j132667j64986l83675j815021
418.1E85636914k289474o47962J94013p37071j761616j116096K19762K24352p86901
436.5E78935921q09431M10915Q95500j89126r67026k31742O75916J33813j240254j667797
456.9E75946689p79093j34885q30412j572609r81450l4749l93212j494766j349628
475.2E68375885k16841J28627m15862o99520m22597j24037k07603q18312j243055p15614
495.6E63641071k06887o73592j468361j399279o53564o86229j603484j977324j368106
514E53604245r34601j448094k018393j510441n16832l36230r13441j083255m49657
532.3E44393301K78950L99470K09868N96285J545668J733958O05107l82901r5129M13776
$$ y = [596079886, 593478620, 591737568, 591238976, 590637982, 589133263, 588000596, 587835610, 587451935, 585636914, 583347440, 582699478, 582893491, 582156420, 580394804, 579278708, 579498470, 579722822, 578935921, 578126490, 578537405, 579432905, 579243779, 578276753, 578045011, 578720927, 578854740, 577614486, 575946689, 575167596, 575032711, 574202299, 572629690, 571648240, 571613491, 571220279, 569725513, 568375885, 568159044, 568287671, 567871809, 567172289, 566749692, 566625655, 566418052, 565599740, 564356685, 563641071, 563434184, 562760592, 561292231, 559892952, 559239388, 558553159, 556949675, 554972351, 553604245, 552669644, 551221550, 549203157, 547692716, 547175884, 546839654, 545926213, 544842958, 544393301, 544672251, 545071721, 545281589, 545877874, 547423542, 549157500, 549762607, 549379706, 549284577, 549698353]
552.7E49698353K6643p68721q32140R775L02255n62728j151979p88688l97802n73337
573.1E44961631q29458k95520Q67069J228690N10395J22547O29246R62317L92318l87669
593.5E48161566l74913K54273N01454P391m05550o5624L58045J49548k78354j84953
613.9E48122883M29749R20952R73344J018703J403391J800775J740396J244188R52422
632.3E58606803J137972J283348J154899J039506J182198J479745J513004J331985
648.6E68729460J317024J414717J347542R82224N00679K59996M40001O96838Q74281
667E76562762J024425R93729J273155J601994J519084J454115J606762J541079J120984
685.3E88698089P23243O59048P19905N12362P7009j39415J76728O81459R47357J062095
$$ y = [549698353, 549724996, 548956275, 548124135, 548133910, 548436165, 547873437, 546721458, 545932770, 545534968, 544961631, 544132173, 543836653, 544703722, 545932412, 546442807, 546565354, 547194600, 548156917, 548549235, 548161566, 547786653, 548040926, 548542380, 548549771, 548144221, 548078597, 548436642, 548586190, 548307836, 548122883, 548552632, 549473584, 550446928, 551465631, 552869022, 554669797, 556410193, 557654381, 558606803, 559744775, 561028123, 562183022, 563222528, 564404726, 565884471, 567397475, 568729460, 570046484, 571461201, 572808743, 573790967, 574291646, 574551642, 574991643, 575688481, 576562762, 577587187, 578580916, 579854071, 581456065, 582975149, 584429264, 586036026, 587577105, 588698089, 589421332, 590080380, 590800285, 591312647, 591389656, 591250241, 591426969, 592108428, 593055785, 594117880]
705.7E94117880J285016J594544J755774J721144J765012K099038K473235K514004
722F09325647K358199K452194K641320K458096J890063J401842J405597J516461J159251
740.4F26608670O87659P43150J011193Q23438K40386n1916J31309J76311j37329k90573
760.8F29942298j1742L54111L93987J44422J84834O37293R29772Q56042J003266J850784
781.2F36285067K843260L208518L002525K894521L061175K877951K103745J400292
797.5F57677054J254201J261115P36058j87158n59628j76430J7822l91663n66601N0723
817.9F59115493P71940O84083p511k33650M35233J133144J039922P33793J095653J779496
838.3F66547596J737655Q60154R6560r0540k39551q26955j444518j302660n42163j68920
$$ y = [594117880, 595402896, 596997440, 598753214, 600474358, 602239370, 604338408, 606811643, 609325647, 611683846, 614136040, 616777360, 619235456, 621125519, 622527361, 623932958, 625449419, 626608670, 627296329, 628039479, 629050672, 629874110, 630114496, 630062580, 630193889, 630370200, 630232871, 629942298, 629930556, 630284667, 630678654, 630823076, 631007910, 631645203, 632574975, 633431017, 634434283, 636285067, 639128327, 642336845, 645339370, 648233891, 651295066, 654173017, 656276762, 657677054, 658931255, 660192370, 660928428, 660741270, 660181642, 660005212, 660023034, 659631371, 659064770, 659115493, 659887433, 660571516, 660564005, 660330355, 660765588, 661898732, 662938654, 663672447, 664768100, 666547596, 668285251, 669145405, 669241965, 669151425, 668911874, 668084919, 666640401, 665337741, 664795578, 664626658]
858.7F64626658l54946k73704M86016J341283J475990R57608N76914O44147O18816
877F70098782p7844j165092j766861j777589j981020k527416k670049k059102j267732
895.4F54806077j028776j244068j228034r54807j097024j921236k817631l085554k899766
913.7F38529181k894938l071904k740621j666069o29843l69548o22392o46591l96669
932.1F25490606o05583j510680k318382k437771k353668k786577l547012l791810l408551
950.5F02730572l260255l796517m340172m214347l776252l834128m456342m901230
966.8E70151329m909158n195021o176472p173657p413328p134020p102490p356226
983.1E17690957p150472o194770n071819m376679m038811l558010k886683k529055
$$ y = [664626658, 664271712, 663998008, 664484024, 665825307, 667301297, 668258905, 668835819, 669479966, 670098782, 670020938, 668855846, 667088985, 665311396, 663330376, 660802960, 658132911, 656073809, 654806077, 653777301, 652533233, 651305199, 650350392, 649253368, 647332132, 644514501, 641428947, 638529181, 635634243, 632562339, 629821718, 628155649, 627525806, 627156258, 626533866, 625887275, 625490606, 624885023, 623374343, 621055961, 618618190, 616264522, 613477945, 609930933, 606139123, 602730572, 599470317, 595673800, 591333628, 587119281, 583343029, 579508901, 575052559, 570151329, 565242171, 560047150, 553870678, 546697021, 539283693, 532149673, 525047183, 517690957, 510540485, 504345715, 499273896, 494897217, 490858406, 487300396, 484413713, 481884658]
999.4D81884658k665996k908439k906978k747386k694905k793283k701610k157360
1015.7D60308701j510382j211673j139671q75562l66032r567J2517l0458M8101J10478
1036.1D55336452j24693o57708j078248j066714q39144p58738o71923j82032O28739
1054.5D50585991J279265J534849J615703J826346J997829J633316O33806l97027q03619
1072.8D59906459n76914J0521Q60929J963616L058761L674537L632307L198802K693952
1091.2D78422970K146095J403540N41866J0788J25110O12677J043140J449943K037644
1109.6D87793773K726198L214746L248841K963632K746582K627969K326846J932979
1125.9E09581566J861513K162098K290547J803160R54866K58446j32143l90590o02245
$$ y = [481884658, 479218662, 476310223, 473403245, 470655859, 467960954, 465167671, 462466061, 460308701, 458798319, 457586646, 456446975, 455571413, 455205381, 455195814, 455208331, 455177873, 455225974, 455336452, 455211759, 454554051, 453475803, 452409089, 451569945, 450811207, 450139284, 449957252, 450585991, 451865256, 453400105, 455015808, 456842154, 458839983, 460473299, 461107105, 460710078, 459906459, 459329545, 459340066, 460200995, 462164611, 465223372, 468897909, 472530216, 475729018, 478422970, 480569065, 481972605, 482514471, 482525259, 482650369, 483263046, 484306186, 485756129, 487793773, 490519971, 493734717, 496983558, 499947190, 502693772, 505321741, 507648587, 509581566, 511443079, 513605177, 515895724, 517698884, 518653750, 518912196, 518780053, 518389463, 517787218]
1144.2E17787218n51164l9160P20858J349867J788497K314031L130853M092991M925251
1162.6E35519242N603910O341457P164359P749081P805347P495761P215798O981552
1178.9E91876507O416440N453288M529834L960788L459990K544880J298607K83003
1195.2F19823337k29717n43654r83059j329899j160741o23464m08411q08001j295566
1213.6F12440825j426459j484036j876653k443969k645969k361238k053201k085150
1229.9E96064150k138257j721501j056075p41363p90953o68526j40846L91722N07116
1248.2E89705467L76106M25815O88732Q10444O52135N74886R01878J332700J394392
1266.6E96862555J163244J062512J259327J376331J032412M74155K63274M70996N59032
$$ y = [517787218, 517236054, 517196894, 517917752, 519267619, 521056116, 523370147, 526501000, 530593991, 535519242, 541123152, 547464609, 554628968, 562378049, 570183396, 577679157, 584894955, 591876507, 598292947, 603746235, 608276069, 612236857, 615696847, 618241727, 619540334, 619823337, 619593620, 619049966, 618066907, 616737008, 615576267, 614952803, 614544392, 613736391, 612440825, 611014366, 609530330, 607653677, 605209708, 602563739, 600202501, 598149300, 596064150, 593925893, 592204392, 591148317, 590406954, 589616001, 588947475, 588806629, 589198351, 589705467, 590081573, 590507388, 591196120, 592006564, 592658699, 593233585, 594135463, 595468163, 596862555, 598025799, 599088311, 600347638, 601723969, 602756381, 603230536, 603493810, 603964806, 604523838]
1285F04523838K16722j97470l11256l67760p54655j375198j768410j744569j686215
1303.3E96535027j975298k395093k486050k233863j990497j942754j847923j409531
1319.6E80254018q93950q24154j124680j289129j110136q88586r22382j028896p82489
1338E71389616r3341M09543L37005J96695L60549N15937K98143j08600l10838l19839
1358.4E72674870m82380q38220j062989j075030r58323q43048j000524j135528r68993
1376.7E64309835j077652j822352k387464j643479j23322L88563m09842j329303j756250
1395.1E54148734j634181j514733j458287j389921j165986p28309n12123m59433k91705
1413.5E44994056m1485L25025R55641J216054J346349J692832J762748J641929J358628
$$ y = [604523838, 604740560, 604543090, 604231834, 603864074, 603109419, 601734221, 599965811, 598221242, 596535027, 594559729, 592164636, 589678586, 587444723, 585454226, 583511472, 581663549, 580254018, 579360068, 578535914, 577411234, 576122105, 575011969, 574123383, 573201001, 572172105, 571389616, 571296275, 571705818, 572042823, 572239518, 572600067, 573116004, 573414147, 573305547, 572994709, 572674870, 572192490, 571354270, 570291281, 569216251, 568257928, 567414880, 566414356, 565278828, 564309835, 563232183, 561409831, 559022367, 557378888, 557255566, 557644129, 557234287, 555904984, 554148734, 552514553, 550999820, 549541533, 548151612, 546985626, 546257317, 545745194, 545285761, 544994056, 544952571, 545277596, 546233237, 547449291, 548795640, 550488472, 552251220, 553893149, 555251777]
1431.8E55251777R55641J032591J365900J032889O86646O11901N82457N33282M07517
1450.2E62460601K29776K74182J140534K686203K691746K367854L126681L984093L944636
1468.5E82906306M502117O617785P557213O391227N120397M164636L432393K320350
1484.9F23012424J004278q5532p17998j235366k231598l414929l648758l265440l199816
1503.2F06217265m092574n177021l538430k513408k741158k843976k386988j519978
1519.5E81403732r51707q68559j224756j532912j448155j512885j657963j465559j490235
1537.9E69251001j595020q85964k98858q1598J64091M99606P44522O69301M19318R61781
1558.3E69848180K234101J321972L14474k1875j28210j91152o30498j393914j890123
$$ y = [555251777, 556207418, 557240009, 558605909, 559638798, 560325444, 560937345, 561519802, 562053084, 562460601, 562690377, 562964559, 564105093, 566791296, 569483042, 571850896, 574977577, 578961670, 582906306, 587408423, 594026208, 601583421, 607974648, 613095045, 617259681, 620692074, 623012424, 624016702, 623931170, 623213172, 621977806, 619746208, 616331279, 612682521, 609417081, 606217265, 602124691, 596947670, 593409240, 590895832, 588154674, 585310698, 582923710, 581403732, 580452025, 579583466, 578358710, 576825798, 575377643, 573864758, 572206795, 570741236, 569251001, 567655981, 566770017, 566471159, 566389561, 566553652, 567053258, 567797780, 568467081, 568886399, 569848180, 572082281, 573404253, 573718727, 573696852, 573568642, 573377490, 572746992, 571353078, 569462955]
1576.6E69462955j720011j998365k768755l257334l450334l664315m042745m242480
1593E44318616m074394l692985l533065l709018l799916l620088l520369l704608l821730
1611.3E10842443l769517m053832m372060l557950l330737l785819l590197l489762
1627.6D80892569l474891k800137k186269j843869j014114m76688k90990j08927K35557
1646D68932241P41869O44535P54833J999975K021849J518398J772643K556681L084809
1664.3D84027833K726018L023893M150986M235775M550725N209088M790008M350126
1680.7E17064452N115211P458985P091463N925715O305694N889774O264746P108390
1697E68224430P254243Q360147O650269N191625N311966M480421L414869K561152K116740
$$ y = [569462955, 567742944, 565744579, 562975824, 559718490, 556268156, 552603841, 548561096, 544318616, 540244222, 536551237, 533018172, 529309154, 525509238, 521889150, 518368781, 514664173, 510842443, 507072926, 503019094, 498647034, 495089084, 491758347, 487972528, 484382331, 480892569, 477417678, 474617541, 472431272, 470587403, 469573289, 469096601, 468805611, 468696684, 468932241, 469674110, 470318645, 471073478, 473073453, 475095302, 476613700, 478386343, 480943024, 484027833, 486753851, 489777744, 493928730, 498164505, 502715230, 507924318, 512714326, 517064452, 522179663, 529638648, 536730111, 542655826, 548961520, 554851294, 561116040, 568224430, 575478673, 583838820, 590489089, 595680714, 600992680, 605473101, 608887970, 611449122, 613565862]
1715.3F13565862K603173K757967J938879J490415J467108J287461J033604P93814
1731.7F26938283J167417J804411J597584J767456K291203K627730L024817L528416
1748F44747317M418433N130291M790723M762292N007922M796803N124152M942536M158736
1766.3F87879205L749430L504634L851354L851056K957463K428353K406001K381861
1782.6G13009357K252520K018630J567185J468301K052128K060235J531064J428306
1799G27387726J736939J857400J549423J292169J318157J491785J431525J194715J141429
1817.3G40401268J249015J155734R15230Q74281Q95798J077235J308262J077115Q25227
1835.7G49779165R00864Q44002N18680N62191J032531J116276Q97765O78480N97238
$$ y = [613565862, 616169035, 618927002, 620865881, 622356296, 623823404, 625110865, 626144469, 626938283, 628105700, 629910111, 631507695, 633275151, 635566354, 638194084, 641218901, 644747317, 649165750, 654296041, 659086764, 663849056, 668856978, 673653781, 678777933, 683720469, 687879205, 691628635, 695133269, 698984623, 702835679, 705793142, 708221495, 710627496, 713009357, 715261877, 717280507, 718847692, 720315993, 722368121, 724428356, 725959420, 727387726, 729124665, 730982065, 732531488, 733823657, 735141814, 736633599, 738065124, 739259839, 740401268, 741650283, 742806017, 743721247, 744595528, 745491326, 746568561, 747876823, 748953938, 749779165, 750680029, 751524031, 752042711, 752604902, 753637433, 754753709, 755651474, 756329954, 756927192]
1854G56927192P01606P36237O37174N30362M35710L44515M85062P51198P11619O05941
1874.4G62866616N91159N23448M03822M05550N11050M60326L36886M07159M83513M64499
1894.8G67454028M39108L41236L07977L88146M03344K85507K36630L49939L68595J93656
1915.2G70768166J11579K50519L25262L93808M07756K35438J54018K02001K09748J45316
1935.6G73203611O8903L040O4492K26975K14934R9838J06335J66952J58668J19030
1956G74432778Q8692J04785J37389Q0406O0O9380J79052J61648P4446K6107P5817J36972
1980.5G75567532J16825L8206k2292m5180N245Q7440O7174J4127L7074P0095l874j02759
2005G75829613q5592r418j8894j13428j67966r1791m411p9631j84656j85251j22011
$$ y = [756927192, 757628798, 758365035, 759002209, 759532571, 759968281, 760312796, 760797858, 761549056, 762260675, 762866616, 763457775, 763981223, 764385045, 764790595, 765301645, 765761971, 766098857, 766506016, 766989529, 767454028, 767893136, 768234372, 768542349, 768930495, 769333839, 769619346, 769855976, 770205915, 770574510, 770768166, 770879745, 771130264, 771455526, 771849334, 772257090, 772492528, 772646546, 772848547, 773058295, 773203611, 773272514, 773275554, 773340046, 773567021, 773781955, 773881793, 773988128, 774155080, 774313748, 774432778, 774521470, 774626255, 774763644, 774844050, 774844110, 774913490, 775092542, 775254190, 775328636, 775354743, 775430560, 775567532, 775684357, 775722563, 775700271, 775655091, 775660336, 775747776, 775814950, 775829077, 775866151, 775936246, 775932372, 775829613, 775744021, 775734603, 775715709, 775602281, 775434315, 775342524, 775338113, 775258482, 775073826, 774888575, 774766564]
2027.4G74766564o6518r5606j81258j54555k0146J2338q4877j60515j17183L040M2140
2049.8G73943424n9187r2507M0234J33693M2557q2910k6643J43051J68383J848q5413
2072.3G74126530O0916K22087J37388o4969o8903J26958K29180N8949j11580K0802
2092.7G74737358K45392J88709o1691j13487J23858K96831J30952j14739m2856K41220
2113.1G75631547K72036q703j47938J01804L55482K00987j03295o1929K62976L63707
2133.5G76866674R5070j01090R3520L56913K61426k5154l2067K29657L36945J42097
2153.9G78223991m2677P9215L33726L42906R4593K98K34544M35412K98917N2512R6678
2176.3G80150115L44217M03881J84954K8193K10046M14133K58685k563M3749L01660
$$ y = [774766564, 774700046, 774604440, 774423182, 774268627, 774248481, 774260819, 774175942, 774015427, 773898244, 773901284, 773943424, 773884237, 773791730, 773831964, 773965657, 774008214, 773925304, 773898661, 774041712, 774210095, 774211943, 774126530, 774187446, 774409533, 774546921, 774481952, 774413049, 774540007, 774769187, 774828136, 774716556, 774737358, 774982750, 775171459, 775109768, 774996281, 775120139, 775416970, 775547922, 775433183, 775390327, 775631547, 775903583, 775894880, 775746942, 775848746, 776204228, 776405215, 776301920, 776239991, 776502967, 776866674, 776961744, 776860654, 776954174, 777311087, 777572513, 777547359, 777515292, 777744949, 778081894, 778223991, 778181314, 778260529, 778594255, 778937161, 779031754, 779032052, 779266596, 779702008, 780000925, 780053437, 780150115, 780494332, 780898213, 781083167, 781111360, 781321406, 781735539, 781994224, 781991661, 782035410, 782337070]
2196.7G82337070M07814K13922m650Q3447L22640L07977N3585k4736J71244L15606
2217.1G84183919J84417m3571j4722K31683K93970P4387p5698M9055K17318J58906
2237.5G85259664k2590m7386J06514K04801R6262n6029l695J69396J65284j9491q2671
2259.9G85770059O5565J67548P3195o9440p1227M8876R3102j2219j21176o8068P2002
2282.3G85948217O4731j06812k03609j08242j4008q3148k14160k17855r1850k9862
2302.7G84943402j24514k53558k74837j66357r9957k10643l21150k77578j59145j17481
2323.1G82938182j82926k35677k09034j69873k35975l23355k62141j43051j38700j50502
2343.5G80886948j03652k99394o03438o19292m25518l12566k02239j19448k11596k92421
$$ y = [782337070, 782744884, 782958806, 782954156, 783037603, 783360243, 783668220, 783721805, 783697069, 783868313, 784183919, 784368336, 784324765, 784310043, 784541726, 784835696, 784910083, 784834385, 784883440, 785100758, 785259664, 785237074, 785189688, 785296202, 785501003, 785597265, 785541236, 785537541, 785706937, 785872221, 785852730, 785770059, 785835624, 786003172, 786076367, 786006927, 785935700, 785984576, 786077678, 786065459, 785944283, 785876215, 785948217, 786012948, 785906136, 785702527, 785594285, 785580277, 785497129, 785282969, 785065114, 784973264, 784943402, 784818888, 784565330, 784290493, 784124136, 784024179, 783813536, 783492386, 783214808, 783055663, 782938182, 782755256, 782519579, 782310545, 782140672, 781904697, 781581342, 781319201, 781176150, 781037450, 780886948, 780783296, 780483902, 779880464, 779261172, 778835654, 778523088, 778320849, 778201401, 777989805, 777697384]
2363.9G77697384k32279j11341j2577q2552k41101k25842j09077j37210k86996l38078
2384.3G75920331k49862k10643l25441m47870m27961l06964k50518l63291n06877m88401
2404.7G72342503l72112l59237m70281n27918m57704m10140m66167n57900n76019m71294
2425.1G67673731m01795m89473o02842n67913m51803m46498n46873o01351n68390n36084
2445.5G62460709n56410o05046o06537n19157m57883n31971o36399o48320n79536n51164
2465.9G56768286o39498o91891n89549m92931n61893o83188o81222n99622n63920o12378
2486.3G50652194o52969n96762n15759To15418o61075n23805m11213n05030o33895
2506.7G45020509n84901m37080m05789n25594o37412n67019m06027m21524n63085n76555
$$ y = [777697384, 777465105, 777353764, 777341187, 777258635, 777017534, 776791692, 776682615, 776545405, 776258409, 775920331, 775670469, 775459826, 775134385, 774686515, 774258554, 773951590, 773701072, 773337781, 772830904, 772342503, 771970391, 771611154, 771140873, 770612955, 770155251, 769745111, 769278944, 768721044, 768145025, 767673731, 767271936, 766782463, 766179621, 765611708, 765159905, 764713407, 764166534, 763565183, 762996793, 762460709, 761904299, 761299253, 760692716, 760173559, 759715676, 759183705, 758547306, 757898986, 757319450, 756768286, 756128788, 755436897, 754847348, 754354417, 753792524, 753109336, 752428114, 751828492, 751264572, 750652194, 749999225, 749402463, 748886704, 748370945, 747755527, 747094452, 746570647, 746159434, 745654404, 745020509, 744435608, 743998528, 743592739, 743067145, 742429733, 741862714, 741456687, 741035163, 740472078, 739895523]
2527.1G39895523m61638m02034m72307n70834n75900m92453m41253m99666n89132n68808
2547.5G34821498m59671m40478n30362n67794n15461m86791n37455n95093n74291m80771
2567.9G29633331m31060n27740o65963o63101n53370n29051o17265o46711n77748n48362
2588.3G23872960n98967o37651o17742n63264n48304o29901p06971o52790n52893n74648
2608.7G17789829o83964p16388o55412n95093o07789p07566p59185o85036o55830p51436
2629.1G10972130q21948p73310o57738o33180p35700p94291p14362o32942p30157q52585
2649.5G03625917p87258o69658o63698p48217p97212p28130o40214o93023p98464p48574
2669.9F96351469o25492o21616p25687p87497p17520o18100o27101p19547p51376o48320
$$ y = [739895523, 739433885, 739031851, 738559544, 737988710, 737412810, 736920357, 736479104, 735979438, 735390306, 734821498, 734361827, 733921349, 733390987, 732823193, 732307732, 731820941, 731283486, 730688393, 730114102, 729633331, 729202271, 728674531, 728008568, 727345467, 726792097, 726263046, 725645781, 724999070, 724421322, 723872960, 723273993, 722636342, 722018600, 721455336, 720907032, 720277131, 719570160, 718917370, 718364477, 717789829, 717105865, 716389477, 715734065, 715138972, 714531183, 713823617, 713064432, 712379396, 711723566, 710972130, 710150182, 709376872, 708719134, 708085954, 707350254, 706555963, 705841601, 705208659, 704478502, 703625917, 702838659, 702169001, 701505303, 700757086, 699959874, 699231744, 698591530, 697898507, 697100043, 696351469, 695725977, 695104361, 694378674, 693591177, 692873657, 692255557, 691628456, 690908909, 690157533, 689509213]
2690.3F89509213n58019o31094p60138p65741o60896o29187p40528q28147p72595o89030
2710.7F82473838p23123p97212p57397o84857p10070p60377p47621o98626o62028o60360
2731.1F75272167o92606p03395o16908n09977n23150n94616n99325n68092n67436n99563
2751.4F69297099o20723n85377n60105o06000o45995o40273o15597n94855o18875o84082
2771.8F63125217p14600o86228o84500p53701q18252q02398p51972p79689q65936r06706
2792.2F55361235q99434r09507r68337j037777j079082j087904j093626j126051j172364
2810.6F45987153j219153j251698j287460j349271j402914j461446j570523j705587
2826.9F34739101j807749j865208j947046k128601k404988k747893l160000l660560
$$ y = [689509213, 688951194, 688320100, 687559962, 686794221, 686133325, 685504138, 684763610, 683935463, 683162868, 682473838, 681750715, 680953503, 680196106, 679511249, 678801179, 678040802, 677293181, 676594555, 675932527, 675272167, 674579561, 673876166, 673259258, 672749281, 672226131, 671631515, 671032190, 670464098, 669896662, 669297099, 668676376, 668090999, 667530894, 666924894, 666278899, 665638626, 665023029, 664428174, 663809299, 663125217, 662410617, 661724389, 661039889, 660286188, 659467936, 658665538, 657913566, 657133877, 656267941, 655361235, 654461801, 653552294, 652583957, 651546180, 650467098, 649379194, 648285568, 647159517, 645987153, 644768000, 643516302, 642228842, 640879571, 639476657, 638015211, 636444688, 634739101, 632931352, 631066144, 629119098, 626990497, 624585509, 621837616, 618677616, 615017056]
2843.2F15017056m209101m559219m362106l483951k193630j001417k35022M7088j42991
2861.6E94876707o24717j100421j443624j582563j431942j145184r05693o89149n79834
2879.9E85373580o82055q47936r78112j104772j202405j283705j365483j430988j535416
2898.3E74942708j653790j739145j845360k013802k305627k751172l260433l701091
2914.6E55672288l876329l605067k929628k050996j131237k32756N35429J093805J585900
2933E45061409K071202K411127K592385K695143K639771K327740J830816J316727R42528
2951.3E63888848P28667O72578Q29697J174092J571119J895786K189338K463460K633989
2969.7E78047574K738416K756238K630055K507925K428949K228796J933575J709938
$$ y = [615017056, 610807955, 606248736, 601886630, 598402679, 596209049, 595207632, 594972610, 595019698, 594876707, 594251990, 593151569, 591707945, 590125382, 588693440, 587548256, 586642563, 585953414, 585373580, 584691525, 583843589, 582865477, 581760705, 580558300, 579274595, 577909112, 576478124, 574942708, 573288918, 571549773, 569704413, 567690611, 565384984, 562633812, 559373379, 555672288, 551795959, 548190892, 545261264, 543210268, 542079031, 541846275, 542381704, 543475509, 545061409, 547132611, 549543738, 552136123, 554831266, 557471037, 559798777, 561629593, 562946320, 563888848, 564617515, 565290093, 566119790, 567293882, 568865001, 570760787, 572950125, 575413585, 578047574, 580785990, 583542228, 586172283, 588680208, 591109157, 593337953, 595271528, 596981466]
2986E96981466J581490J453698J208126Q53002N64754L22044K2888k01404l07321l67701
3006.4F02111042m02689m25756m75884n84781p16448q17478q73625r30428j014471
3024.7E95869482j077414j076400j032591j001060j051128j154542j157463j103818
3041.1E87215066j136243j220704j296162j298070j221299j177192j212716j273096
3057.4E77379584j257837j155912j071036j043201j042723j046241j016855r59933
3073.7E68785846q97765q51035r19044j005650r72807r40442r31263r32574j015604
3092.1E60319662j075208r79364q58188q99076j029968j075805j019060r96173j076162
3110.4E51310658j118183j049578j006186j075387j233160j381338j377046j267612
$$ y = [596981466, 598562956, 600016654, 601224780, 602077782, 602642536, 602964580, 602987468, 602786064, 602478743, 602111042, 601708353, 601282597, 600806713, 600221932, 599505484, 598688006, 597814381, 596883953, 595869482, 594792068, 593715668, 592683077, 591682017, 590630889, 589476347, 588318884, 587215066, 586078823, 584858119, 583561957, 582263887, 581042588, 579865396, 578652680, 577379584, 576121747, 574965835, 573894799, 572851598, 571808875, 570762634, 569745779, 568785846, 567888081, 567037046, 566118002, 565112352, 564139545, 563199103, 562267840, 561335266, 560319662, 559244454, 558265090, 557406902, 556507826, 555477858, 554402053, 553382993, 552386820, 551310658, 550192475, 549142897, 548136711, 547061324, 545828164, 544446826, 543069780, 541802168]
3126.7E41802168j253903j341462j363695j282215j212835j259089j410782j501024
3143E31177163j451492j372934j325845j327277j414716j516521j533210j528919j533150
3161.4E18173099j490891j448155j444876j447380j458346j482964j498163j514435
3177.7E06387889j506209j464784j451969j477361j496255j499206j484007j445204
3194D94562894j410931j396060j383275j384765j413047j400948j342356j296490j263559
3212.4D82271463j248122j277566j329273j323044j276791j292914j309782j245380
3228.7D71968591j186788j215994j326084j390994j339555j306444j317799j308918
3245D61576015j308680j314282j314223j320303j296460j269728j280397j295954j290411
$$ y = [541802168, 540548265, 539206803, 537843108, 536560893, 535348058, 534088969, 532678187, 531177163, 529725671, 528352737, 527026892, 525699615, 524284899, 522768378, 521235168, 519706249, 518173099, 516682208, 515234053, 513789177, 512341797, 510883451, 509400487, 507902324, 506387889, 504881680, 503416896, 501964927, 500487566, 498991311, 497492105, 496008098, 494562894, 493151963, 491755903, 490372628, 488987863, 487574816, 486173868, 484831512, 483535022, 482271463, 481023341, 479745775, 478416502, 477093458, 475816667, 474523753, 473213971, 471968591, 470781803, 469565809, 468239725, 466848731, 465509176, 464202732, 462884933, 461576015, 460267335, 458953053, 457638830, 456318527, 455022067, 453752339, 452471942, 451175988, 449885577]
3263.4D49885577j232266j151443j120538j141369j183897j215398j185298j111657
3279.7D40543711j056790j037568j010090r43303q78603q60393q78185r04053r45777
3298D32028949r33945q33839p64519q42929j026094j137227j108050j047850j062393
3316.4D23272103j097888j089304j079917j113475j223921j329124j307160j238465
3332.7D13792849j214266j228154j317352j420736j417905j370371j332551j301110
3349D03190404j362145j482188j524479j453131j338959j304269j340806j302034j241922
3367.4C90840471j314491j424849j391143j258373j177848j144528j135409j100480
3383.7C80893350r53436p48486o21825o82980q73148r05305o39976m42683o28263q53002
$$ y = [449885577, 448653311, 447501868, 446381330, 445239961, 444056064, 442840666, 441655368, 440543711, 439486921, 438449353, 437439263, 436495960, 435617357, 434756964, 433878779, 432974726, 432028949, 431095004, 430261165, 429496646, 428653717, 427627623, 426490396, 425382346, 424334496, 423272103, 422174215, 421084911, 420004994, 418891519, 417667598, 416338474, 415031314, 413792849, 412578583, 411350429, 410033077, 408612341, 407194436, 405824065, 404491514, 403190404, 401828259, 400346071, 398821592, 397368461, 396029502, 394725233, 393384427, 392082393, 390840471, 389525980, 388101131, 386709988, 385451615, 384273767, 383129239, 381993830, 380893350, 379939914, 379191428, 378569603, 377886623, 377013475, 376108170, 375468194, 375025511, 374397248, 373544246]
3404.1C73544246p50899n41360m42832m13299m32491m43429l76463k71737j44065K057
3424.5C69729728J25914K37674K60621K51174L25859L29643K21074K34693M47869O75887
3444.9C72840136P61807P64191Q15481Q78871R30726J049281J201123J166462J111716
3463.2C81519794J333058J514554J305849J017838J122535J402408J546263J502902
3479.6C92265201J352220J387418J562923J553893J470655J536191J647800J757085
3495.9D04533386J772195J687825J657277J669109J649410J703828J889140K046764
3512.2D18608934J990109J822770J831234J988619K155632K127528J966417K027750
3528.5D34518993K232760K331585K398222K404184K307117K364993K542913K622157
$$ y = [373544246, 372793347, 372251987, 371809155, 371395856, 370963365, 370519936, 370143473, 369871736, 369727671, 369729728, 369855642, 370093316, 370353937, 370605111, 370930970, 371260613, 371481687, 371716380, 372164249, 372840136, 373601943, 374366134, 375181615, 376060486, 376991212, 378040493, 379241616, 380408078, 381519794, 382852852, 384367406, 385673255, 386691093, 387813628, 389216036, 390762299, 392265201, 393617421, 395004839, 396567762, 398121655, 399592310, 401128501, 402776301, 404533386, 406305581, 407993406, 409650683, 411319792, 412969202, 414673030, 416562170, 418608934, 420599043, 422421813, 424253047, 426241666, 428397298, 430524826, 432491243, 434518993, 436751753, 439083338, 441481560, 443885744, 446192861, 448557854, 451100767, 453722924]
3544.8D53722924K542168K445280K523184K741397K813548K781778K869129K845139
3561.1D75284547K576530K670616L537535L890634L329783L067106L291786L539026
3577.5E01187563L684819L679096L446341L433168M010618M211306L652215L559947
3593.8E30865073L941834M129768M156529M088700L807009L637194L982961M204870
3610.1E62813938M034698L948927L804028M177332M872739M238665L081501K802371
3626.4E93774199M221440N361795M201412L587544L645719L555297L447891L107130
3642.7F24902427K563954K719163M333973M998863L305078K628267L512859L547013
3659F52511597K789974K440452K102256J773536K247692K673685J981795K431989L192603
$$ y = [453722924, 456265092, 458710372, 461233556, 463974953, 466788501, 469570279, 472439408, 475284547, 477861077, 480531693, 484069228, 487959862, 491289645, 494356751, 497648537, 501187563, 504872382, 508551478, 511997819, 515430987, 519441605, 523652911, 527305126, 530865073, 534806907, 538936675, 543093204, 547181904, 550988913, 554626107, 558609068, 562813938, 566848636, 570797563, 574601591, 578778923, 583651662, 587890327, 590971828, 593774199, 597995639, 603357434, 607558846, 611146390, 614792109, 618347406, 621795297, 624902427, 627466381, 630185544, 634519517, 639518380, 642823458, 645451725, 648964584, 652511597, 655301571, 657742023, 659844279, 661617815, 663865507, 666539192, 668520987, 670952976, 674145579]
3677.4F74145579K317369J743555J590729J349390J606703K271711K143681J555443
3693.7F88724160J230240J073659J067638J323640J336038P82609L83497P16865J599133
3712.1F98237479J665532Q79824M41254N06043O64592P02083P37846N58436J21772
3730.4G04514861J54257R24528J497209R24825j31964l88444O01590Q58426K42710
3748.8G09197998Q52406J372159O63638K50578N39720P29024L88444K40624L40819
3767.1G14575410N28932P92980N49972J36494J66715M89950N04195K50638L31700M88996
3787.5G18815982M05133J89424o3241p2062l5941q762N74827O62684L16620O60062
3807.9G21444726N10514j70827l43204R8348J81496J29759P61092N80430Q1599L7491
$$ y = [674145579, 676462948, 678206503, 679797232, 681146622, 682753325, 685025036, 687168717, 688724160, 689954400, 691028059, 692095697, 693419337, 694755375, 695537984, 695921481, 696638346, 698237479, 699903011, 700782835, 701224089, 701730132, 702394724, 703096807, 703834653, 704393089, 704514861, 704669118, 705593646, 707090855, 708015680, 707883716, 707495272, 708096862, 708955288, 709197998, 710050404, 711422563, 712086201, 712336779, 712876499, 713605523, 713993967, 714234591, 714575410, 715104342, 715897322, 716447294, 716583788, 716750503, 717240453, 717744648, 717995286, 718326986, 718815982, 719221115, 719410539, 719347298, 719275236, 719239295, 719230533, 719805360, 720468044, 720784664, 721444726, 721955240, 721784413, 721441209, 721539557, 721721053, 721850812, 722611904, 723192334, 723273933, 723311424]
3828.3G23311424o1691k5510O4730R6679L68416N22375M86374M86732Q5413o84797
3848.7G24650145j055837J60336J800955Q05080l11733m18067o4969K29180l3200o2525
3869.1G25699365M67777M84884J90973j69873k30193K09570K17438K20954K40922j05321
3889.5G27226496R6440L36826k00927o23227l45289K11656O15358O60360K07245j64032
3909.9G28020906j86324k09033j58012J09851J60933k4021Q881J13189o1571j34885
3930.3G27639914J82211L18408K6107k17557k09272k8312N1915k7060N9366J72079
3950.7G27967799P0452n3286k1160O2347M8816R894j4186j2934K9922J6451l2902O079
3975.2G28077292N2035k980j2517R0718J03593l0517j03712n5671j3590J3888Q1003
$$ y = [723311424, 723249733, 723224223, 723288953, 723385632, 723754048, 724276423, 724762797, 725249529, 725334942, 724650145, 723594308, 723754644, 725555599, 726360679, 726048946, 725630879, 725565910, 725795090, 725761890, 725699365, 726167142, 726652026, 726842999, 726673126, 726442933, 726652503, 726869941, 727090895, 727331817, 727226496, 727322936, 727659762, 727458835, 726835608, 726490319, 726701975, 727317333, 727977693, 728184938, 728020906, 727834582, 727625549, 727467537, 727577388, 727738321, 727714300, 727723181, 727836370, 727774799, 727639914, 727822125, 728140533, 728166640, 727949083, 727739811, 727711499, 727763414, 727736354, 727795720, 727967799, 728038251, 727984965, 727963805, 728026152, 728074968, 728084862, 728070676, 728057742, 728087664, 728104115, 728071213, 728077292, 728129327, 728126347, 728113830, 728204548, 728308141, 728277624, 728173912, 728118241, 728104651, 728118539, 728199542]
3997.6G28199542
$$ y = [728199542]
##END=$$ End of the data block
