##TITLE=$$ Begin of the data block
##JCAMP-DX=5.00 $$ ACD/SpecManager v 10.08
##SPECTROMETER/DATA SYSTEM=Alpha
##DATE=11 Nov 2014 09:02:30
##DATA TYPE=INFRARED SPECTRUM
##DATA CLASS=XYDATA
##ORIGIN=
##OWNER=
##NPOINTS=1765
##FIRSTX=399.76428223
##LASTX=3997.64306641
##MAXX=3997.64306641
##MINX=399.76428223
##MAXY=0.78862464
##MINY=0.36813220
##XFACTOR=1.0000000000
##YFACTOR=1.000000000000000e-9
##FIRSTY=0.59490591
##DELTAX=2.03961372
##XUNITS=1/CM
##YUNITS=ARBITRARY UNITS
##XYDATA=(X++(Y..Y))
399.8E94905913k671421j482188o79076j122713j720727j158595k6464J14739j294136
$$ 594905913 592234492 590752304 590073228 588950515 587229788 586071193 586044729 586159468 584865332
418.1E84865332k310574r33409m3094q27492j499891q80480J37151L17454m63545p40886
$$ 584865332 582554758 581621349 581578255 580750763 579250872 578370392 578507543 578824997 578361452 577620566
438.5E77620566K19285O98328k41577q80063j03354O35385j69039j421391j383305
$$ 577620566 577839851 578538179 578296602 577416539 577313185 577948570 577779531 576358140 574974835
456.9E74974835m32491j82867r57132j523316q98182j71661p36118j608312j166165
$$ 574974835 574542344 574359477 573402345 571879029 570980847 570809186 570073068 568464756 567298591
475.2E67298591p6413K38717l82185q97646n67913r4772k67863q51810j080453n32151
$$ 567298591 567222178 567460895 567078710 566181064 565613151 565518379 565250516 564398706 563318253 562786102
495.6E62786102m6253o67334j620173j379490o28590q51632j707792j948833j444221
$$ 562786102 562739849 562072515 560452342 559072852 558444262 557592630 555884838 553936005 552491784
514E52491784j186550j550614j783073j258493m74334l39388q46446r88424l12090
$$ 552491784 551305234 549754620 547971547 546713054 546238720 545899332 545052886 544064462 543752372
532.3E43752372M30823L73661K5690M95076J472711J605690N73158k68936K3842M03106
$$ 543752372 544183195 544556856 544582546 545077622 546550333 548156023 548729181 548460245 548484087 548887193
552.7E48887193q4758p73787o74665Q5413J80126p19488j198828p09415k08497m31776
$$ 548887193 548802435 548028648 547353983 547439396 547619522 546900034 545701206 544991791 544783294 544351518
573.1E44351518q33988l21329Q01504J152575N23150J57654O59883R39250L06547l85284
$$ 544351518 543517530 543196201 543997705 545150280 545673430 545831084 546490967 547430217 547736764 547351480
593.5E47351480k71619L43621N23269L3021k85625r239K78532J19269k33590j38223
$$ 547351480 547079861 547423482 547946751 547979772 547694147 547684908 547963440 548082709 547849119 547710896
613.9E47710896M53233R17733R92835J095891J515984J865566J650631J103044R65178
$$ 547710896 548164129 549081862 550074697 551170588 552686572 554552138 556202769 557305813 558270991
632.3E58270991J255095J401782J229882J048625J178324J486361J572251J382113
$$ 558270991 559526086 560927868 562157750 563206375 564384699 565871060 567443311 568825424
648.6E68825424J237511J315654J368522J072646N62191K75909L89874O28770R44137
$$ 568825424 570062935 571378589 572747111 573819757 574381948 574657857 575047731 575676501 576620638
667E76620638J209736J049400J201212J538277J573324J488268J577258J582861J180828
$$ 576620638 577830374 578879774 580080986 581619263 583192587 584680855 586258113 587840974 589021802
685.3E89021802P03692N99802P21157O10530J83105j10209J84894P21812R40919R69708
$$ 589021802 589725494 590325296 591046453 591656983 591840088 591729879 591914773 592636585 593577504 594547212
705.7E94547212J220226J661957J860797J734197J743675K125322K509773K497375
$$ 594547212 595767438 597429395 599290192 601024389 602768064 604893386 607403159 609900534
722F09900534K321661K451300K623081K381504J847804J484513J501322J500845J159668
$$ 609900534 612222195 614673495 617296576 619678080 621525884 623010397 624511719 626012564 627172232
740.4F27172232P70569P65800R54330P61092J76668p1049J55628J63138j58251k74241
$$ 627172232 627942801 628708601 629662931 630424023 630600691 630529642 630685270 630848408 630690157 630415916
760.8F30415916J2219L65496M05848J66178K21491P00533R31621P35104Q74102J822233
$$ 630415916 630428135 630793631 631199479 631365657 631587148 632287681 633219302 633954406 634828508 636650741
781.2F36650741K878487L185690K956986K949357L150106K898335K062023J365065
$$ 636650741 639529228 642714918 645671904 648621261 651771367 654669702 656731725 658096790
797.5F58096790J308322J338840P12633k27273n16116j80304j00792m48823m99487
$$ 658096790 659405112 660743952 661456585 661229312 660713196 660532892 660432100 659983277 659483790
815.8F59483790R0719P50899O62923k6047k31803M35174J074314J003086P98345J164734
$$ 659483790 659574509 660325408 660988331 660962284 660730481 661165655 662239969 663243055 664041400 665206134
836.2F65206134J798332J711547P52151l1352j09076j73807q05438j424432j244008
$$ 665206134 667004466 668716013 669468164 669436812 669327736 669153929 668348491 666924059 665680051
854.6F65680051n60641k27392l17812j86265M95315J266658J393855R17733N90443
$$ 665680051 665119410 664892018 664574206 664387941 664883256 666149914 667543769 668461502 669051945
873F69051945O85096O06060j98722j283586j780808j758098j997173k542734k647043
$$ 669051945 669737041 670343101 670144379 668860793 667079985 665321887 663324714 660781980 658134937
891.3F58134937k019763j271724j092077j295566j212180q84056j050711j948774k859413
$$ 658134937 656115174 654843450 653751373 652455807 651243627 650359571 649308860 647360086 644500673
909.7F44500673l107369k912879k911031l097892k734065j601100n76675m10020p35701
$$ 644500673 641393304 638480425 635569394 632471502 629737437 628136337 627559662 627149642 626413941
928F26413941p30097m03881o11842j555383k337456k384007k250850k692818l515900
$$ 626413941 625683844 625279963 624668121 623112738 620775282 618391275 616140425 613447607 609931707
946.4F09931707l846347l482699l270328l758192m317165m217028l780008l836453
$$ 609931707 606085360 602602661 599332333 595574141 591256976 587039948 583259940 579423487
962.7E79423487m457950m931868m972398n226314o185651p192671p411301p139504
$$ 579423487 574965537 570033669 565061271 559834957 553649306 546456635 539045334 531905830
979E31905830p125080p325709p093727o164789n067379m404694m054963l518134k823085
$$ 531905830 524780750 517455041 510361314 504196525 499129146 494724452 490669489 487151355 484328270
997.4D84328270k478480k626539k881407k898366k738982k721369k858758k697051
$$ 484328270 481849790 479223251 476341844 473443478 470704496 467983127 465124369 462427318
1013.7D62427318k093106j481772j215070j157195r14067m00811j3322M232p0721N931
$$ 462427318 460334212 458852440 457637370 456480175 455566108 455165297 455151975 455156207 455085486 455091417
1034.1D55091417Q1092j35452o43372j057595j064360q58516p40796n89550r7304O92159
$$ 455091417 455172509 455037057 454393685 453336090 452271730 451413214 450672418 450082868 449985564 450677723
1054.5D50677723J298725J480431J548290J814693K019704J643687O80387l17037p85172
$$ 450677723 451976448 453456879 455005169 456819862 458839566 460483253 461163640 460846603 460061431
1072.8D60061431n82129j341P88421J897186L045171L689498L629327L167539K709181
$$ 460061431 459479302 459477961 460266382 462163568 465208739 468898237 472527564 475695103 478404284
1091.2D78404284K201408J426011N55545N5641J56552O30349J079648J453609K012223
$$ 478404284 480605692 482031703 482587248 482642889 482799441 483429790 484509438 485963047 487975270
1109.6D87975270K737551L244430L263325K977252K765655K653957K364397J948118
$$ 487975270 490712821 493957251 497220576 500197828 502963483 505617440 507981837 509929955
1125.9E09929955J820743K090395K230107J782060R81689L13520n5671l34143o11723
$$ 509929955 511750698 513841093 516071200 517853260 518834949 519148469 519092798 518758655 518146932
1144.2E18146932n80132n9366P00951J347720J795828K314330L136813M106641M931152
$$ 518146932 517566800 517507434 518208385 519556105 521351933 523666263 526803076 530909717 535840869
1162.6E35840869N611360O335914P102370P666767P777751P508635P216156O984174
$$ 535840869 541452229 547788143 554890513 562557280 570335031 577843666 585059822 592043996
1178.9E92043996O446719N475044M518986L951252L471255K548814J260280K37465
$$ 592043996 598490715 603965759 608484745 612435997 615907252 618456066 619716346 619953811
1195.2F19953811k15828n19693j005829j343071j131296n96047m04596q22365j329720
$$ 619953811 619737983 619218290 618212461 616869390 615738094 615142047 614737451 613915086 612585366
1213.6F12585366j451016j491189j882255k418399k593517k337158k068042k101541
$$ 612585366 611134350 609643161 607760906 605342507 602748990 600411832 598343790 596242249
1229.9E96242249k128899j698434j046956p28309p59185o38842j13726M12107N02705
$$ 596242249 594113350 592414916 591367960 590639651 589880466 589241624 589127898 589540005 590042710
1248.2E90042710L44575L87132O78360Q30949O70552N77211Q85427J330972J443446
$$ 590042710 590387285 590774417 591452777 592283726 592954278 593531489 594416916 595747888 597191334
1266.6E97191334J203298J059294J248837J365542J022339M84943K80559M42028M98116
$$ 597191334 598394632 599453926 600702763 602068305 603090644 603575587 603856146 604298174 604796290
1285F04796290J84477k10405l25620l62754p43150j374185j750827j714886j684248
$$ 604796290 604980767 604770362 604444742 604081988 603338838 601964653 600213826 598498940 596814692
1303.3E96814692k010107k430379k474308k184749j965642j953006j847684j397014
$$ 596814692 594804585 592374206 589899898 587715149 585749507 583796501 581948817 580551803
1319.6E80551803q85188q12889j121342j280367j075268q61287r31978j068354q22127
$$ 580551803 579666615 578853726 577732384 576452017 575376749 574515462 573583484 572515130 571693003
1338E71693003j09553M08053L57807K45571M04000N28634K94805q9765k66671l12746
$$ 571693003 571583450 571991503 572349310 572594881 572998881 573527515 573822320 573732555 573465884 573153138
1358.4E73153138n27024q47221j012682j049459r55761q13842r75668j150191r81390
$$ 573153138 572626114 571778893 570766211 569716752 568760991 567947149 566971481 565821290 564839900
1376.7E64839900j022935j658082k186120j601994k91407K09153m99428j395464j812935
$$ 564839900 563816965 562158883 559972763 558370769 558079362 558288515 557789087 556393623 554580688
1395.1E54580688j657068j496434j411140j342774j132429p16328n13852m60207l01659
$$ 554580688 552923620 551427186 550016046 548673272 547540843 546824515 546310663 545850456 545548797
1413.5E45548797p8321K74837R55224J259268J382410J714587J738847J577138J330376
$$ 545548797 545470476 545745313 546700537 547959805 549342215 551056802 552795649 554372787 555703163
1431.8E55703163R65715J015603J350880J065194P25866O18338N67615N48065M42624
$$ 555703163 556668878 557684481 559035361 560100555 560826421 561444759 562012374 562560439 563003063
1450.2E63003063K24710K35498J127004K716124K734959K405048L149986M002154L930092
$$ 563003063 563227773 563463271 564590275 567306399 570041358 572446406 575596392 579598546 583528638
1468.5E83528638M436970O572067P585824O416321N112111M133582L384710K271354
$$ 583528638 587965608 594537675 602123499 608539820 613651931 617785513 621170223 623441577
1484.9F23441577R61602j32144p54416j247346k256870l445387l640652l241539l211320
$$ 623441577 624403179 624271035 623516619 622269273 620012403 616567016 612926364 609684825 606473505
1503.2F06473505m163801n233705l488064k424300k692580k865672k408564j507104
$$ 606473505 602309704 597075999 593587935 591163635 588471055 585605383 583196819 581689715
1519.5E81689715r25839q32080j199902j486659j383364j476347j619697j398980j450062
$$ 581689715 580763876 579931796 578731894 577245235 575861871 574385524 572765827 571366847 569916785
1537.9E69916785j612187q33988j61946K683J89065N33462P88212O62267L75688R12547
$$ 569916785 568304598 567470610 567308664 567311347 567500412 568033874 568822086 569484353 569860041 570772588
1558.3E70772588K165497J289546L28481M709j45674k41279o53923j415253j939713
$$ 570772588 572938085 574227631 574556112 574560821 574415147 574173868 573519945 572104692 570164979
1576.6E70164979j770795k044916k802372l271461l486156l719211m074812m276812
$$ 570164979 568394184 566349268 563546896 560275435 556789279 553070068 548995256 544718444
1593E44718444m145145l790200l636479l777504l828287l646851l571987l804505l947377
$$ 544718444 540573299 536783099 533146620 529369116 525540829 521893978 518321991 514517486 510570109
1611.3E10570109l869772m103243m369110l555268l357232l833801l619551l461987
$$ 510570109 506700337 502597094 498227984 494672716 491315484 487481683 483862132 480400145
1627.6D80400145l437161k804220k204448j805037r03190l52352j73718k1875L04997
$$ 480400145 476962984 474158764 471954316 470149279 469246089 468893737 468720019 468698144 469003141
1646D69003141Q29726P31439Q22544K082795K141833J615375J809895K566755L131181
$$ 469003141 469832867 470564306 471386850 473469645 475611478 477226853 479036748 481603503 484734684
1664.3D84734684K777189L026515M120529M221708M557550N233586M816711M346847
$$ 484734684 487511873 490538388 494658917 498880625 503438175 508671761 513488472 517835319
1680.7E17835319N074620P472813P182062N972207O305575N867183O199420P025540
$$ 517835319 522909939 530382752 537564814 543537021 549842596 555709779 561909199 568934739
1697E68934739P233679Q419633O741404N274177N358517M481077L394068K543687K079428
$$ 568934739 576168418 584588051 591329455 596603632 601962149 606443226 609837294 612380981 614460409
1715.3F14460409K562821K832770K056479J567841J514673J290858R88424P42733J161754
$$ 614460409 617023230 619856000 621912479 623480320 624994993 626285851 627274275 628017008 629178762
1733.7F29178762J877308J652778J753151K269626K645731L042638L518164M421651
$$ 629178762 631056070 632708848 634461999 636731625 639377356 642419994 645938158 650359809
1750F50359809N158484M802943M751503M994035M808724N179107M994929M154205L743470
$$ 650359809 655518293 660321236 665072739 670066774 674875498 680054605 685049534 689203739 692947209
1768.4F92947209L553331L905535L864347K945185K407491K408624K424538K283514
$$ 692947209 696500540 700406075 704270422 707215607 709623098 712031722 714456260 716739774
1784.7G16739774K015352J577795J494705K053738K078533J574338J432478J707554
$$ 716739774 718755126 720332921 721827626 723881364 725959897 727534235 728966713 730674267
1801G30674267J847446J561463J295685J301110J482725J437843J198888J180232J315057
$$ 730674267 732521713 734083176 735378861 736679971 738162696 739600539 740799427 741979659 743294716
1819.4G43294716J174629R02116Q87692R28461J100898J299322J056135Q42690R37402
$$ 743294716 744469345 745371461 746259153 747187614 748288512 749587834 750643969 751486659 752424061
1837.7G52424061Q48890M99308N46098J015484J088500Q85486O98328O36042P38501
$$ 752424061 753272951 753772259 754318357 755333841 756422341 757307827 758006155 758642197 759380698
1856.1G59380698P50184O19412M85182M06086L55363N04196P80880P42674O08027N85735
$$ 759380698 760130882 760750294 761235476 761641562 761996925 762501121 763282001 764024675 764632702 765218437
1876.5G65218437N24401M15624M26709N17845M47035L15428L93867M79937M55260M33803
$$ 765218437 765742838 766158462 766585171 767103016 767550051 767865479 768259346 768739283 769194543 769628346
1896.9G69628346L58999L28779L92139M02570K84731K25723L39270L58581J80006J23799
$$ 769628346 769987345 770316124 770708263 771110833 771395564 771621287 771960557 772319138 772499144 772622943
1917.3G72622943K74360L16620L71695M09901K51293J47402J93119K37107J79947J01805
$$ 772622943 772897303 773213923 773585618 773995519 774246812 774394214 774587333 774824440 775004387 775106192
1937.7G75106192K6047M3988K08199K28763J13249J11997J71899J52648R0361O3479
$$ 775106192 775132239 775176227 775384426 775613189 775726438 775838435 776010334 776162982 776253343 776316822
1958.1G76316822J09851J60277R4771l695N9902J77026J68681P6950J2517O5505J53840
$$ 776316822 776426673 776586950 776681721 776678026 776737928 776914954 777083635 777160585 777173102 777238607 777392447
1980.5G77392447J44362M0949k2650j3590J8180O7055N1141J2636O4373Q6605j9371
$$ 777392447 777536809 777577758 777555108 777541518 777559698 777626753 777677894 777690530 777754903 777841508 777822137
2002.9G77822137j02639p2420p272j0371j03891j79648j13309k4259q8393j86503j81616
$$ 777822137 777719498 777647078 777639806 777629435 777525544 777345896 777232587 777208328 777119935 776933432 776751816
2025.4G76751816r6202n0485j10745j88053j44362j6690K087j07170j77025r8765M1663
$$ 776751816 776655614 776605129 776494384 776306331 776161969 776145279 776147366 776040196 775863171 775764406 775806069
2047.8G75806069O6579l2127n2810N7757J20461J9193r5785j4603J81615J95504k2293
$$ 775806069 775872648 775840521 775787711 775845468 775965929 775985122 775889337 775874734 776056349 776251853 776229560
2070.2G76229560j30593L7849K15590J46508k7120l2723J37925K29239N5313j11103
$$ 776229560 776098967 776136816 776352406 776498914 776471794 776439071 776576996 776806235 776861548 776750445
2090.6G76750445L2545K60412J86026p2896q4698J81853L11196J02818j07825n841
$$ 776750445 776782990 777043402 777229428 777156532 777071834 777253687 777564883 777667701 777559876 777554035
2111G77554035K45154K62141K4319q9943R9063K93135J76311o2347j6391K54333L13640
$$ 777554035 777799189 778061330 778085649 777995706 778094769 778387904 778564215 778501868 778485477 778739810 779053450
2133.5G79053450P0154p6174J24752L58462K58208j0729k5034K22802L47495J75595
$$ 779053450 779123604 779047430 779172182 779530644 779788852 779778123 779753089 779975891 780323386 780498981
2153.9G80498981j9609R3996L53515L36349O8605n36K68399M55738K87294M8459R6261
$$ 780498981 780479372 780573368 780926883 781263232 781331837 781331301 781599700 782055438 782342732 782391191 782487452
2176.3G82487452L38674L88085J72914N7995K35021M11153K77340K3246N1796L04640
$$ 782487452 782826126 783214211 783387125 783445120 783680141 784091294 784368634 784391880 784443676 784748316
2196.7G84748316M03046K11060n36R4354L31283L00944N7757j7643J58190K98262J77085
$$ 784748316 785151362 785362422 785361886 785456240 785787523 786088467 786146224 786128581 786286771 786585033 786762118
2219.1G86762118k2232J5557K23934K71976P7188p5340M2140K35558J88589j2576n1797
$$ 786762118 786739886 786755443 786979377 787251353 787328541 787253201 787295341 787530899 787719488 787706912 787655115
2241.6G87655115J11044K19345J02758o7234k7776J41323J62065K2590m4942O2227
$$ 787655115 787766159 787985504 788088262 788021028 787993252 788134575 788296640 788319230 788274288 788336515
2262G88336515J49131O5148n7816n6267O6995J20938j3768j47105q3625P1108P9751
$$ 788336515 788485646 788550794 788492978 788436711 788503706 788624644 788610876 788463771 788380146 788451254 788531005
2284.4G88531005q9228k05457j35243k5749n1439j83165k05815p8022k6107j46866
$$ 788531005 788441777 788236320 788101077 788075328 788023889 787840724 787634909 787556887 787530780 787383914
2304.8G87383914k81572k64347j27196q1301k19524l42488k84970j52946j25587k04145
$$ 787383914 787102342 786837995 786710799 786629498 786409974 786067486 785782516 785629570 785503983 785299838
2325.2G85299838k61307k19643j34528j43230k65539l28481k39014j52767j17004j12355
$$ 785299838 785038531 784818888 784684360 784541130 784275591 783947110 783708096 783555329 783438325 783325970
2345.6G83325970l32117n99444o22272n09322m13835j82331j6153j20759k38120k49207
$$ 783325970 782993853 782394409 781772137 781262815 780848980 780666649 780650496 780529737 780291617 780042410
2366G80042410j68622p9631j05441j89543j78575q2910j16051k84254l52621k78831
$$ 780042410 779873788 779794157 779688716 779499173 779320598 779237688 779121637 778837383 778484762 778205931
2386.4G78205931k34723l16501m29749m30167l17454k73943m08173n52237n07354l65615
$$ 778205931 777971208 777654707 777224958 776794791 776477337 776203394 775795221 775242984 774735630 774370015
2406.8G74370015l52800m57406n11885m51565l85999m45545n63622n79357m81844m24325
$$ 774370015 774017215 773559809 773047924 772596359 772210360 771764815 771201193 770621836 770139992 769715667
2427.2G69715667n03958o07430n59628m26293m33922n72323o31214n58018m93884n35846
$$ 769715667 769211709 768604279 768044651 767618358 767184436 766612113 765980899 765422881 764928997 764393151
2447.6G64393151o22451o31810n41389n02348n83648o43731o07728n23091n24223o62148
$$ 764393151 763770700 763138890 762597501 762095153 761511505 760867774 760260046 759736955 759212732 758550584
2467.9G58550584p22110n93603m85122n69761p10308o94692n66125n21124o11007o66678
$$ 758550584 757828474 757234871 756749749 756179988 755469680 754774988 754208863 753687739 753076732 752410054
2488.3G52410054n91039n20528n45919o06358o15716n41091m73380n16057o04510n91099
$$ 752410054 751819015 751298487 750752568 750146210 749530494 748989403 748516023 747999966 747395456 746804357
2508.7G46804357m86374m37916n05864n80430n29170m28737m55319n62907n66005m55678
$$ 746804357 746317983 745880067 745374203 744793773 744264603 743835866 743380547 742817640 742251635 741795957
2529.1G41795957l97205m89474o02603n60998m36664m21524n11646n69344n43714m79281
$$ 741795957 741398752 740909278 740306675 739745677 739309013 738887489 738375843 737806499 737262785 736783504
2549.5G36783504m75108n54443n86152n21838m85599n54264o28292n91875m99010m62293
$$ 736783504 736308396 735753953 735167801 734645963 734160364 733606100 732977808 732385933 731886923 731424630
2569.9G31424630n29170o38187o20306n06997n23150o12736o07311n70119n74112o19352
$$ 731424630 730895460 730257273 729636967 729129970 728606820 727994084 727386773 726816654 726242542 725623190
2590.3G25623190o76691o60718n74767n46217o27458o82295o09219n31196o00279p36594
$$ 725623190 724946499 724285781 723711014 723164797 722537339 721855044 721245825 720714629 720114350 719377756
2610.7G19377756p51674o49571n73338o20782p35760p45415o39975o21200p51913q30412
$$ 719377756 718626082 717976511 717403173 716782391 716046631 715301216 714661241 714040041 713288128 712457716
2631.1G12457716p52747o46293o51479p36713p65026p00891o62207p57516q47518p73728
$$ 712457716 711704969 711058676 710407197 709670484 708905458 708204567 707542360 706784844 705937326 705163598
2651.5G05163598o71506p10547q08477q01385o95228o21259o74606p71224p64490o83963
$$ 705163598 704492092 703781545 702973068 702171683 701476455 700855196 700180590 699409366 698644876 697960913
2671.9F97960913o60717p09534p48157p11978o21676o15180p11501p34567o46115n97596
$$ 697960913 697300196 696590662 695842505 695130527 694508851 693893671 693182170 692447603 691801488 691203892
2692.3F91203892o56247p37786p31528o56784o54220p56025q19743p52449o85513p49350
$$ 691203892 690547645 689809859 689078331 688421547 687767327 687011302 686191559 685439110 684753597 684004247
2712.7F84004247q23319p83443p15733p00652p14600p15018o97613o76631o62089o76453
$$ 684004247 683180928 682397485 681681752 680981100 680266500 679551482 678853869 678177238 677515149 676838696
2733.1F76838696o81520o18457n33104n21720n90980o18100n56588n38886o13868o47068
$$ 676838696 676157176 675538719 675005615 674483895 673892915 673274815 672718227 672179341 671565473 670918405
2753.5F70918405n79953n30541n86033o58572o59048o17445n96165o38426p01606o90937
$$ 670918405 670338452 669807911 669221878 668563306 667904258 667286813 666690648 666052222 665350616 664659679
2773.9F64659679o58155o99579p74861q29577q10027p43330p72357q79883r39429r07541
$$ 664659679 664001524 663301945 662527084 661697507 660887480 660144150 659371793 658491910 657552481 656644940
2794.3F56644940q73327r56952j065314j071215j041770j062870j118123j182795j245141
$$ 656644940 655771613 654814661 653749347 652678132 651636362 650573492 649455369 648272574 647027433
2812.6F47027433j272857j307547j352370j375377j453221j584947j699448j780391
$$ 647027433 645754576 644447029 643094659 641719282 640266061 638681114 636981666 635201275
2828.9F35201275j844287j955390k151727k418578k773046l207148l690779m218101
$$ 635201275 633356988 631401598 629249871 626831293 624058247 620851099 617160320 612942219
2845.3F12942219m597306m411102l483712k182723j029729k83540J8657j21594n64039
$$ 612942219 608344913 603933811 600450099 598267376 597237647 596954107 596972764 596851170 596287131
2863.6E96287131j062870j476586j632332j461685j188278r42171o78360n31495o41286
$$ 596287131 595224261 593747675 592115343 590653658 589465380 588523209 587844849 587313354 586672068
2882E86672068q58009j015246j113892j187026j239479j301348j407146j527250j625717
$$ 586672068 585814059 584798813 583684921 582497895 581258416 579957068 578549922 577022672 575396955
2900.3E75396955j732111j873732k066075k355159k768159l255665l688574l847360
$$ 575396955 573664844 571791112 569725037 567369878 564601719 561346054 557657480 553810120
2916.6E53810120l565193k933025k101242j161278k20299N68927J124143J605213K075493
$$ 553810120 550244927 547311902 545210660 544049382 543829083 544398010 545522153 547127366 549202859
2935E49202859K403498K598405K715826K666473K367497J882970J368344R64105P21395
$$ 549202859 551606357 554204762 556920588 559587061 561954558 563837528 565205872 566169977 566891372
2953.4E66891372O86646Q47757J126051J495897J891971K230644K487362K680540K813458
$$ 566891372 567578018 568425775 569551826 571047723 572939694 575170338 577657700 580338240 583151698
2971.7E83151698K798021K628803K489507K422452K246023J959622J763403J651525
$$ 583151698 585949719 588578522 591068029 593490481 595736504 597696126 599459529 601111054
2988F01111054J481474J208186Q82387O14882L40879J6451j91510k91348l74794m07934
$$ 601111054 602592528 603800714 604683101 605297983 605638862 605655313 605463803 605172455 604797661 604389727
3008.4F04389727m16517m74274n78463o96183q03411q90433r38774r65654j026094
$$ 604389727 603973210 603498936 602920473 602224290 601420879 600530446 599591672 598626018 597599924
3026.8E97599924j069785j050889j017809j059174j165689j153111j066029j111388
$$ 597599924 596530139 595479250 594461441 593402267 592236578 591083467 590017438 588906050
3043.1E88906050j227677j285970j240492j191139j255930j303494j242101j152158
$$ 588906050 587678373 586392403 585151911 583960772 582704842 581401348 580159247 579007089
3059.4E79007089j106381j105070j086951j066744j070440j045823j003325r29117
$$ 579007089 577900708 576795638 575708687 574641943 573571503 572525680 571522355 570593238
3075.7E70593238q19564q32498r61661j008094r71734r45807r39846r87410j024425
$$ 570593238 569773674 568941176 567979515 566971421 565999687 565053880 564114034 563126624 562102199
3094.1E62102199r62437q79168r04083j031399j084507j001358r49561j057387j143813
$$ 562102199 561139762 560260594 559356511 558325112 557240605 556239247 555289686 554232299 553088486
3112.4E53088486j068353j015187j107573j281023j392663j346409j245022j246870
$$ 553088486 552020133 551004946 549897373 548616350 547223687 545877278 544632256 543385386
3128.8E43385386j316845j336455j293898j267195j316785j414896j453280j414537
$$ 543385386 542068541 540732086 539438188 538170993 536854208 535439312 533986032 532571495
3145.1E32571495j392484j368404j345515j410961j512706j528979j496911j474023
$$ 532571495 531179011 529810607 528465092 527054131 525541425 524012446 522515535 521041512
3161.4E21041512j432120j444757j523376j550972j521468j497806j500964j527190
$$ 521041512 519609392 518164635 516641259 515090287 513568819 512071013 510570049 509042859
3177.7E09042859j506686j447678j461863j511634j504361j473487j451671j441508
$$ 509042859 507536173 506088495 504626632 503114998 501610637 500137150 498685479 497243971
3194D97243971j470358j477658j414270j379996j402855j408428j381487j317560j280487
$$ 497243971 495773613 494295955 492881685 491501689 490098834 488690406 487308919 485991359 484710872
3212.4D84710872j318484j329184j290560j277595j298965j333713j357883j307786
$$ 484710872 483392388 482063204 480772644 479495049 478196084 476862371 475504488 474196702
3228.7D74196702j205235j201153j315981j391948j382053j368254j343608j300961
$$ 474196702 472991467 471790314 470474333 469082385 467700332 466332078 464988470 463687509
3245D63687509j309871j359791j355737j299829j286298j310914j282156j252264j274615
$$ 463687509 462377638 461017847 459662110 458362281 457075983 455765069 454482913 453230649 451956034
3263.4D51956034j252532j184702j141995j183510j259893j237691j154274j096695
$$ 451956034 450703502 449518800 448376805 447193295 445933402 444695711 443541437 442444742
3279.7D42444742j069665j056910j029640r99570r53823q76606q52972r26793j015872
$$ 442444742 441375077 440318167 439288527 438288957 437335134 436458528 435605556 434678763 433662891
3298D33662891r96977q96007q53121q97825r86605j077772j111477j094818j084656
$$ 433662891 432665914 431769907 430916786 430018961 429032356 427954584 426843107 425748289 424663633
3316.4D24663633j120269j188338j186073j168102j282096j390844j360447j319646
$$ 424663633 423543364 422355026 421168953 420000851 418718755 417327911 415967464 414647818
3332.7D14647818j323551j312226j336307j421481j455456j432419j409918j378596
$$ 414647818 413324267 412012041 410675734 409254253 407798797 406366378 404956460 403577864
3349D03577864j414060j539082j623332j557380j412332j392126j450509j365364j267165
$$ 403577864 402163804 400624722 399001390 397444010 396031678 394639552 393189043 391823679 390556514
3367.4C90556514j372307j531691j511365j347512j232207j176774j129121j085341
$$ 390556514 389184207 387652516 386141151 384793639 383561432 382384658 381255537 380170196
3383.7C80170196j018136q83818p12603p33197r71377j005918o59555m09335o27994
$$ 380170196 379152060 378268242 377555639 376822442 375851065 374845147 374185592 373776257 373148263
3402.1C73148263r11505q11338n72205m51922m21911m86643n22166l67165j84089j62065
$$ 373148263 372236758 371425420 370853215 370401293 369979382 369492739 368970573 368603408 368419319 368257254
3422.5C68257254j25050P3969K61963K57045K62498L96908L80397K18153K47776M69893
$$ 368257254 368132204 368206173 368468136 368725181 368987679 369384587 369764984 369983137 370230913 370700806
3442.9C70700806O38843P19994P88689Q53062Q88645R72897J131445J248539J197487
$$ 370700806 371339649 372059643 372848332 373701394 374590039 375562936 376694381 377942920 379140407
3461.2C79140407J180887J412928J554668J327694J040518J114786J377016J538694
$$ 379140407 380321294 381734222 383288890 384616584 385657102 386771888 388148904 389687598
3477.5C89687598J549184J450330J482427J629770J601815J511067J609654J771271
$$ 389687598 391236782 392687112 394169539 395799309 397401124 398912191 400521845 402293116
3493.8D02293116J809180J698732J656741J747310J742691J660228J778543K056509
$$ 402293116 404102296 405801028 407457769 409205079 410947770 412607998 414386541 416443050
3510.2D16443050K158075J982898J811147J845836K019555K244174K238751K066135
$$ 416443050 418601125 420584023 422395170 424241006 426260561 428504735 430743486 432809621
3526.5D32809621K097786K257645K348274K449691K503604K429247K458721K586842
$$ 432809621 434907407 437165052 439513326 441963017 444466621 446895868 449354589 451941431
3542.8D51941431K671867K636522K554983K590448K759605K847493K846956K941043
$$ 451941431 454613298 457249820 459804803 462395251 465154856 468002349 470849305 473790348
3559.1D73790348K937823K683491K723753L551275L975898L493011L245026L437191
$$ 473790348 476728171 479411662 482135415 485686690 489662588 493155599 496400625 499837816
3575.4D99837816L618240L710270L691077L464222L497243M160643M414320L825128
$$ 499837816 503456056 507166326 510857403 514321625 517818868 521979511 526393831 530218959
3591.7E30218959L689110M058242M229069M264891M215121L872693L627658M016995
$$ 530218959 533908069 537966311 542195380 546460271 550675392 554548085 558175743 562192738
3608.1E62192738M342794M178644M079580L943622M255951M910171M307150L174901
$$ 562192738 566535532 570714176 574793756 578737378 582993329 587903500 592210650 595385551
3624.4E95385551K887965M241287N372525M238426L631413L743887L675998L555178
$$ 595385551 598273516 602514803 607887328 612125754 615757167 619501054 623177052 626732230
3640.7F26732230L223181K624571K607763M097104M958153L516555K788901L550112
$$ 626732230 629955411 632579982 635187745 639284849 644243002 647759557 650548458 654098570
3657F54098570L624797K842963K399445K076327J730979K105832K612770K066254K493203
$$ 654098570 657723367 660566330 662965775 665042102 666773081 668878913 671491683 673557937 676051140
3675.4F76051140L222644K361953J770676J594960J385391J643896K250731K197623
$$ 676051140 679273784 681635737 683406413 685001373 686386764 688030660 690281391 692479014
3691.7F92479014J689077J322865J068592R78589J250029J332223P99001M15802P71343
$$ 692479014 694168091 695490956 696559548 697538137 698788166 700120389 700919390 701335192 702106535
3710G02106535J584888J604080Q82268M86851N15044O32584P04825Q02517O49333J83701
$$ 702106535 703691423 705295503 706177771 706664622 707179666 707812250 708517075 709319592 709968925 710152626
3730.4G10152626J26362Q05139J424671R55999r7156m07994N66721Q72255K23040P99060
$$ 710152626 710278988 711084127 712508798 713464797 713367641 712959647 713526368 714398623 714621663 715420723
3750.8G15420723J410305P15733K09689M54962P29979M62055K55882L13461N60522
$$ 715420723 716831028 717546761 717756450 718211412 718941391 719403446 719659328 719972789 720533311
3769.2G20533311Q58605O11425J67846J28866M35352N27143L01421L42906M92096L84569
$$ 720533311 721391916 722003341 722171187 722300053 722735405 723262548 723563969 723906875 724398971 724783540
3789.6G24783540J72496l4511p7010m5955K921N10216O32464L40522O40809N21601
$$ 724783540 724956036 724921525 724844515 724798560 724801481 725311697 725944161 726284683 726925492 727447093
3810G27447093j30952l49223O0498J78159R6142P36296O92606K09928R3698q0645p7307
$$ 727447093 727316141 726966918 727027416 727205575 727301717 728038013 728730619 728940547 729034245 728953600 728876293
3832.4G28876293L5286K2173K33352M70817N14328N05150J53243n50568j030445q0347
$$ 728876293 728911579 728933752 729167104 729637921 730152249 730657399 730810642 730260074 729229629 729149282
3852.8G29149282J634955R72093j13309l60429j37091J77562K8730j5497M42326N01752
$$ 729149282 730784237 731756330 731643021 731282592 731145501 731323063 731351793 731336296 731778622 732280374
3873.2G32280374K53021j37329k88784J51574K58148K43723K30074j19686Q9944L76284
$$ 732280374 732533395 732396066 732107282 732258856 732517004 732760727 732990801 732871115 732961059 733337343
3893.6G33337343j58727o08921m05312Q2612N35071P08938L69489k6703j90735l05116
$$ 733337343 733178616 732569695 732164383 732246995 732782066 733491004 733860493 733833790 733643055 733337939
3914G33337939k58804O9142K07066K6644M5895J69754l4690j58429J48118K96712N4180
$$ 733337939 733079135 733148277 733355343 733381987 733427882 733597636 733562946 733404517 733552635 733849347 733903527
3936.4G33903527j47998k28047j14680Q7381P2956Q4698J55508M5300q2374l7968O1631
$$ 733903527 733755529 733527482 733412802 733500183 733573139 733657837 733813345 733858645 733776271 733738303 733799934
3958.9G33799934P9394M3988l2544m2081J3888l8147o0320Q0049J48952K1458l8564
$$ 733799934 733879328 733923316 733890772 733848691 733862579 733824432 733764112 733844161 733993113 734014571 733976007
3981.3G33976007O0200L9160p9989n7459K7478L0696M3750R0122
$$ 733976007 734036207 734075367 733995378 733937919 733965397 733996093 734039843 734129965
3997.6G34129965
$$ 734129965
##END=$$ End of the data block
