##TITLE=$$ Begin of the data block
##JCAMP-DX=5.00 $$ ACD/SpecManager v 10.08
##SPECTROMETER/DATA SYSTEM=Alpha
##DATE=10 Nov 2014 10:35:34
##DATA TYPE=INFRARED SPECTRUM
##DATA CLASS=XYDATA
##ORIGIN=
##OWNER=
##NPOINTS=1765
##FIRSTX=399.76428223
##LASTX=3997.64306641
##MAXX=3997.64306641
##MINX=399.76428223
##MAXY=0.81924295
##MINY=0.47457206
##XFACTOR=1.0000000000
##YFACTOR=1.000000000000000e-9
##FIRSTY=0.66935247
##DELTAX=2.03961372
##XUNITS=1/CM
##YUNITS=ARBITRARY UNITS
##XYDATA=(X++(Y..Y))
$$ plain form
399.8 669352472 667702734 667449415 667783022 666588187 664573491 664523304 665684462 665026248 662358761
418.1 662358761 661091387 661760032 661616087 660036087 658798695 659612775 661024094 660544634 659276664
436.5 659276664 659757853 660919726 660413146 659217596 659535408 660745919 660834432 659594834 658572197
454.8 658572197 658499181 658319652 657135189 656192422 656514287 656680763 655183077 653146982 652888775
473.2 652888775 653949022 653748095 652252138 651542842 652019858 652034283 650936842 650184691 650585055
491.5 650585055 650680780 649378121 648003519 647930920 648108304 646820188 644743145 643874586 643952191 642712772
511.9 642712772 640040457 638026714 637513161 637035906 635512888 634112358 634253919 634941995 634303451
530.3 634303451 633159518 633539855 634981632 635591745 635409534 636024535 637624860 638521671 637927890
$$ packed form
399.8F69352472j649738k53319L33607j194835k014696n0187J161158o58214k667487
418.1F62358761j267374O68645j43945j580000j237392Q14080J411319m79460j267970
436.5F59276664M81189J161873n06580j195550L17812J210511Q8513j239598j022637
454.8F58572197p3016j79529j184463r42767L21865J66476j497686k036095k58207
473.2F52888775J060247k00927j495957p09296M77016J4425j097441p52151M00364
491.5F50585055R5725j302659j374602p2599J77384j288116k077043q68559P7605j239419
511.9F42712772k672315k013743n13553m77255j523018j400530J41561O88076o38544
530.3F34303451j143933L80337J441777O10113j82211O15001J600325Q96811n93781
$$ plain form
548.7 637927890 637190044 637479067 638043702 637561798 636524737 636434317 636971653 636639535 635304034 634166598
569.1 634166598 633788645 633350849 632434368 632022023 632876158 634270430 635016382 635190129 635828614 636874020
589.4 636874020 637204409 636661530 636324048 636713803 637041688 636645675 636150777 636315882 636870384 637013257
609.8 637013257 636627614 636536121 637171209 637974441 638461173 639133394 640635073 642493546 643731534
628.2 643731534 644361436 645306826 646833599 648083448 648535430 649022400 650422812 652061820 652910411
646.6 652910411 653519809 654970229 656897843 658102036 658324897 658587217 659513533 660296261 660271525
664.9 660271525 660116196 661293805 663026750 663933873 664520204 665806353 667595327 668739259 668984473
683.3 668984473 669449210 670715392 671628177 671419144 671037674 671409667 671993017 671917975 671652079 672282875
$$ packed form
548.7F37927890p37846K89023N64635m81904j037061r0420N37336l32118j335501j137436
569.1F34166598l77953m37796r16481m12345Q54135J394272P45952J73747O38485J045406
589.4F36874020L30389n42879l37482L89755L27885l96013m94898J65105N54502J42873
609.8F37013257l85643r1493O35088Q03232M86732O72221J501679J858473J237988
628.2F43731534O29902R45390J526773J249849M51982M86970J400412J639008Q48591
646.6F52910411O09398J450420J927614J204193K22861K62320R26316P82728k4736
664.9F60271525j55329J177609J732945R07123N86331J286149J788974J143932K45214
683.3F68984473M64737J266182R12785k09033l81470L71993N83350p5042k65896O30796
$$ plain form
703.7 672282875 673722148 674819171 675217927 676053405 678082705 680323958 681746423 683046043 685350180
722 685350180 688172996 690309048 691745102 693489194 695727587 697393119 698076546 698849499 700368643
740.4 700368643 701753855 702233493 702379644 703015924 703897893 704147100 703666627 703350484 703594625 703681111
760.8 703681111 703074515 702372372 702423453 702941597 703008115 702635765 702698886 703542471 704761684 706216514
781.2 706216514 708476543 711886168 715666592 718736708 721029103 723331392 725774050 727522671
797.5 727522671 728261471 728753090 729505062 729862928 729146957 727862537 726964235 726498246 725895286 725233972
817.9 725233972 725224733 725938439 726463735 726318479 726439774 727699280 729421914 730551302 731242239 732396603
838.3 732396603 733981788 734894037 734618545 733935773 733534992 732815444 731114268 729236603 728316665
$$ packed form
703.7F72282875J439273J097023L98756Q35478K029300K241253J422465J299620K304137
722F85350180K822816K136052J436054J744092K238393J665532O83427P72953J519144
740.4G00368643J385212M79638J46151O36280Q81969K49207m80473l16143K44141Q6486
760.8G03681111o06596p02143N1081N18144O6518l72350O3121Q43585J219213J454830
781.2G06216514K260029L409625L780424L070116K292395K302289K442658J748621
797.5G27522671P38800M91619P51972L57866p15971j284420q98302m65989o02960o61314
817.9G25233972r239P13706N25296j45256J21295J259506J722634J129388O90937J154364
838.3G32396603J585185R12249k75492o82772m00781p19548j701176j877665r19938
$$ plain form
856.6 728316665 728041589 727429628 726691723 727026761 728648424 730306029 731164575 731940925 733417273
875 733417273 734904408 735291839 734708905 734055042 733383596 731872439 729444683 727171540 725733638
893.4 725733638 724531591 722876787 721218646 720234096 719395399 717630982 714960217 712305248 709886789
911.7 709886789 707000732 703503370 700422049 698630750 697693169 696756065 696006298 696101665 696669579
930.1 696669579 696635365 695749223 694767475 694064736 692939520 690840185 688371420 686217964 683937490
948.4 683937490 680794060 677141428 673843682 670802772 667158008 662762463 658498704 654802024
964.7 654802024 650845408 645826638 640138984 634527445 628840685 622494400 615714908 609358311
981.1 609358311 603668988 598200679 592903078 588422835 585129559 582481325 579847813 577366829
$$ packed form
856.6G28316665k75076o11961p37905L35038J621663J657605Q58546P76350J476348
875G33417273J487135L87431n82934o53863o71446j511157k427756k273143j437902
893.4G25733638j202047j654804j658141r84550q38697j764417k670765k654969k418459
911.7G09886789k886057l497362l081321j791299r37581r37104p49767R5367N67914
930.1F96669579l4214q86142r81748p02739j125216k099335k468765k153456k280474
948.4F83937490l143430l652632l297746l040910l644764m395545m263759l696680
964.7F54802024l956616n018770n687654n611539n686760o346285o779492o356597
981.1F09358311n689323n468309n297601m480243l293276k648234k633512k480984
$$ plain form
997.4 577366829 575445771 573811054 571771443 569267571 566887200 564912379 563018143 561046243
1013.7 561046243 559436440 558548987 558042884 557455957 556960881 556981444 557440221 557851136 558034420 558259845
1034.1 558259845 558596671 558556199 557722688 556370199 555043936 553873062 552738786 551877379 551822424
1052.4 551822424 552701831 554059505 555584669 557408035 559552729 561547518 562819123 563194692 562829196
1070.8 562829196 561988175 561025083 560563445 561325133 563471913 566489756 569783807 573071182 576184511
1089.2 576184511 578720391 580256522 580841601 580895007 580742240 580524862 580475092 580923259 582071126
1107.5 582071126 583831728 585936844 588243961 590690374 593073666 595165014 596899927 598386407
1123.8 598386407 599813998 601324856 602974892 604652345 606112480 607155442 607632697 607522368 607051551
$$ packed form
997.4E77366829j921058j634717k039611k503872k380371j974821j894236j971900
1013.7E61046243j609803q87453n06103n86927m95076K0563M58777M10915J83284K25425
1034.1E58259845L36826m0472q33511j352489j326263j170874j134276q61407n4955
1052.4E51822424Q79407J357674J525164J823366K144694J994789J271605L75569l65496
1070.8E62829196q41021r63092m61638P61688K146780L017843L294051L287375L113329
1089.2E76184511K535880J536131N85079N3406j52767k17378m9770M48167J147867
1107.5E82071126J760602K105116K307117K446413K383292K091348J734913J486480
1123.8E98386407J427591J510858J650036J677453J460135J042962M77255j10329m70817
$$ plain form
1142.2 607051551 606584132 606369257 606468797 606935322 607892990 609440863 611593127 614282489 617535770
1160.5 617535770 621606112 626627684 632341683 638425350 644805372 651425779 657950163 663945079
1176.9 663945079 669332147 674333572 678921163 682787776 685899973 688544035 690775096 692291498
1193.2 692291498 692929447 692964315 692800462 692512214 691985548 691405416 691114783 691079378 690882266 690288484
1213.6 690288484 689478993 688583851 687390208 685719669 683803320 682026207 680428386 678765893 677078485
1231.9 677078485 675728202 674831510 674107373 673387647 672915578 672946930 673309565 673642635 673939645 674460232
1252.3 674460232 675184548 675774097 676139414 676646531 677553654 678606987 679499447 680365205 681473434
1270.7 681473434 682694137 683623195 684178352 684634626 685133576 685474157 685499966 685452282 685561121 685547411
$$ packed form
1142.2F07051551m67419k14875R9540M66525R57668J547873K152264K689362L253281
1160.5F17535770M070342N021572N713999O083667O380022O620407O524384N994916
1176.9F63945079N387068N001425M587591L866613L112197K644062K231061J516402
1193.2F92291498O37949L4868j63853k88248n26666n80132k90633l5405j97112n93782
1213.6F90288484q09491q95142j193643j670539j916349j777113j597821j662493j687408
1231.9F77078485j350283q96692p24137p19726m72069L1352L62635L33070K97010N20587
1252.3F74460232P24316N89549L65317N07117R07123J053333Q92460Q65758J108229
1270.7F81473434J220703R29058N55157M56274M98950L40581K5809m7684J08839j3710
$$ plain form
1291.1 685547411 685013175 684074640 683102846 682097495 680740297 678981721 677148879 675431311 673612177
1309.4 673612177 671471775 669294178 667524397 666100740 664713800 663384914 662312865 661435843
1325.8 661435843 660407603 659122705 657926559 657086670 656397998 655560315 654913068 654986501 655493438
1344.1 655493438 655840814 655915976 656018436 656244278 656301141 656045020 655639827 655136168 654506743 653851807
1364.5 653851807 653131723 652389407 651798844 650959015 649665594 648366392 646473348 642420232 637105584
1382.9 637105584 634823561 637504995 641407549 642983317 642436922 640932441 639531732 638303101
1399.2 638303101 637185633 636139572 635205030 634683669 634304464 633921087 633836269 633978188 634003043 634340465
1419.6 634340465 635474741 637002945 638654053 640125811 641383946 642771125 644025922 644747794
$$ packed form
1291.1F85547411n34236r38535r71794j005351j357198j758576j832842j717568j819134
1309.4F73612177k140402k177597j769781j423657j386940j328886j072049q77022
1325.8F61435843j028240j284898j196146q39889o88672q37683o47247P3433N06937
1344.1F55493438L47376P5162J02460K25842N6863k56121m05193n03659o29425o54936
1364.5F53851807p20084p42316n90563q39829j293421j299202j893044m053116n314648
1382.9F37105584k282023K681434L902554J575768n46395j504481j400709j228631
1399.2F38303101j117468j046061r34542n21361l79205l83377q4818J41919K4855L37422
1419.6F34340465J134276J528204J651108J471758J258135J387179J254797P21872
$$ plain form
1435.9 644747794 645499587 646607757 647604287 648233294 648416340 648391664 648630321 648982108 648999035 648701489
1456.3 648701489 649730921 652290046 654691160 656919360 659795702 663237870 666935444 671572924
1472.6 671572924 677102864 682511330 687337518 691374719 694611132 696915329 698257804 698814273
1488.9 698814273 699126601 699230611 698337078 696263850 694166601 692549646 690831721 687725961 683296800
1507.3 683296800 681198895 680224299 678656042 676546276 674567282 673144281 671899199 671133995 670459330
1525.6 670459330 669400871 668380439 667003691 665226161 664061725 662651181 659856915 658091307
1542 658091307 658143401 658545434 658926368 659352362 660056233 660867572 661317110 661396682 663118780 665504098
1562.4 665504098 666933477 667628467 667745948 667742014 667913795 667314649 665798545 664772868 663803339
$$ packed form
1435.9F44747794P51793J108170R96530O29007J83046k4676K38657L51787J6927k97546
1456.3F48701489J029432K559125K401114K228200K876342L442168L697574M637480
1472.6F71572924N529940N408466M826188M037201L236413K304197J342475N56469
1488.9F98814273L12328J04010q93533k073228k097249j616955j717925l105760m429161
1507.3F83296800k097905r74596j568257k109766j978994j423001j245082p65204o74665
1525.6F70459330j058459j020432j376748j777530j164436j410544k794266j765608
1542F58091307N2094M02033L80934M25994P03871Q11339M49538P9572J722098K385318
1562.4F65504098J429379O94990J17481l934J71781n99146j516104j025677r69529
$$ plain form
1580.7 663803339 662056804 659746647 657082915 654097676 650850058 647509575 644264519 641295552
1597 641295552 638495862 635622263 632721305 629902661 627007008 623924077 620954096 618098140 614492655
1615.4 614492655 610327840 607513607 604906738 601398528 598124743 595176518 592363179 590125382
1631.7 590125382 587756574 584816992 583309293 583100915 582971454 582579792 581695795 581394613 581953704
1650.1 581953704 581710637 581565976 583314717 585205555 586808026 588594377 590980649 593367338 595625699
1668.4 595625699 598694801 602275252 605937541 610107660 614377022 618201852 621810853 626816094
1684.7 626816094 632757604 638214231 643645823 648564339 653367579 658702552 664074183 670126081
1701.1 670126081 675589263 680079579 684464335 688237906 691041410 693037510 694421411 695804179
$$ packed form
1580.7F63803339j746535k310157k663732k985239l247618l340483l245056k968967
1597F41295552k799690k873599k900958k818644k895653l082931k969981k855956l605485
1615.4F14492655m164815k814233k606869l508210l273785k948225k813339k237797
1631.7E90125382k368808k939582j507699k08378j29461l91662q83997l01182N59091
1650.1E81953704k43067j44661J748741J890838J602471J786351K386272K386689K258361
1668.4E95625699L069102L580451L662289M170119M269362L824830L609001N005241
1684.7F26816094N941510N456627N431592M918516M803240N334973N371631O051898
1701.1F70126081N463182M490316M384756L773571K803504J996100J383901J382768
$$ plain form
1717.4 695804179 697946846 700172305 701933026 703422546 704540730 705254197 705696344 706095159 707374871
1735.7 707374871 708972275 710325301 712069809 714346170 716750979 719268918 722523212 726796031
1752 726796031 730959833 734655261 738395691 742142379 745980382 749679863 752777815 755424261 757722974
1770.4 757722974 759954154 762541592 765080571 767187119 768926084 770481288 771968663 773537517
1786.7 773537517 774923027 775698245 776509404 778031468 779602349 780693889 781612694 782866657 784274578
1805.1 784274578 785436571 786261022 787061453 788130224 789247155 790134490 790898144 791636705 792244852
1823.4 792244852 792814136 793344438 793780923 794637620 795777619 796555877 797098875 797711015 798127532
1841.8 798127532 798196554 798567176 799402177 800267637 800973356 801468134 801867366 802299798 802815080 803300202
$$ packed form
1717.4F95804179K142667K225459J760721J489520J118184P13467M42147L98815J279712
1735.7G07374871J597404J353026J744508K276361K404809K517939L254294M272819
1752G26796031M163802L695428L740430L746688L838003L699481L097952K646446K298713
1770.4G57722974K231180K587438K538979K106548J738965J555204J487375J568854
1786.7G73537517J385510P75218Q11159J522064J570881J091540R18805J253963J407921
1805.1G84274578J161993Q24451Q00431J068771J116931Q87335P63654P38561O08147
1823.4G92244852N69284N30302M36485Q56697J139999P78258N42998O12140M16517
1841.8G98127532O9022L70622Q35001Q65460P05719M94778L99232M32432N15282M85122
$$ plain form
1862.2 803300202 803580105 803568900 803552806 804071605 804865122 805433929 805845857 806274831 806627214 806847632
1882.6 806847632 807094812 807401478 807589293 807793021 808150172 808522165 808915913 809247613 809451342 809673727
1903 809673727 809956491 810129046 810181260 810385764 810792387 811057925 811015785 811037064 811251104 811498284
1923.4 811498284 811808705 812084377 812254608 812411845 812568963 812659740 812717557 812755525 812709451 812710404 812863529
1945.8 812863529 813077629 813291132 813417435 813437343 813481510 813609362 813752770 813834369 813826323 813783109 813870668
1968.3 813870668 814074755 814191699 814219296 814280033 814388096 814467251 814497352 814518094 814533412 814501882 814392626
1990.7 814392626 814353049 814510345 814660251 814642489 814574540 814574420 814601600 814541161 814399242 814297795 814274430
2013.1 814274430 814203322 814021051 813858807 813800871 813787520 813687146 813464642 813285112 813263535 813250780
$$ packed form
1862.2H03300202K79903j1205j6094N18799P93517N68807M11928M28974L52383K20418
1882.6H06847632K47180L06666J87815K03728L57151L71993L93748L31700K03729K22385
1903H09673727K82764J72555N2214K04504M06623K65538m2140K1279K14040K47180
1923.4H11498284L10421K75672J70231J57237J57118R0777N7817L7968m6074R53J53125
1945.8H12863529K14100K13503J26303J9908M4167J27852J43408Q1599q046m3214Q7559
1968.3H13870668K04087J16944K7597O0737J08063P9155L0101K0742J5318l1530j09256
1990.7H14392626l9577J57296J49906j7762o7949j20K7180o0439j41919j01447k3365
2013.1H14274430p1108j82271j62244n7936j3351j00374k22504j79530k1577j2755
$$ plain form
2033.5 813250780 813103199 812930763 812873840 812872410 812788188 812629640 812551022 812613487 812666893 812601864 812513351
2056 812513351 812527835 812585652 812544763 812450171 812482536 812649906 812740862 812678456 812627137 812700689 812760890 812687218
2080.4 812687218 812637985 812742233 812846243 812786698 812674701 812707663 812848389 812899709 812843680 812843680 812964797
2102.9 812964797 813085794 813079715 813018858 813050389 813136876 813156366 813141644 813214660 813367665 813434541 813391089
2125.3 813391089 813421965 813576162 813712597 813753366 813781977 813886940 814033151 814118624 814137936 814194202 814328074
2147.7 814328074 814456463 814511597 814564288 814702451 814866900 814945459 814973831 815089583 815304279 815483689
2168.1 815483689 815573215 815664768 815827250 816021085 816173673 816290677 816429555 816587985 816709757 816795826
2188.5 816795826 816924155 817120850 817293644 817364752 817411721 817547858 817737758 817885578 817970932 818028629
$$ packed form
2033.5H13250780j47581j72436n6923j430q4222j58548p8618O2465N3406o5029q8513
2056H12513351J4484N7817m0889r4592L2365J67370R0956o2406n1319P3552O0201p3672
2080.4H12687218m9233J04248J04010n9545j11997L2962J40726N1320n6029%J21117
2102.9H12964797J20997o079o0857L1531Q6487J9490j4722P3016J53005O6876m3452
2125.3H13391089L0876J54197J36435M0769K8611J04963J46211Q5473J9312N6266J33872
2147.7H14328074J28389N5134N2691J38163J64449P8559K8372J15752K14696J79410
2168.1H15483689Q9526R1553J62482J93835J52588J17004J38878J58430J21772Q6069
2188.5H16795826J28329J96695J72794P1108M6969J36137J89900J47820Q5354N7697
$$ plain form
2208.9 818028629 818116188 818241119 818326771 818364203 818440497 818559051 818625450 818628907 818665445 818764687 818830132
2231.4 818830132 818804979 818765938 818818986 818946898 819003463 818977952 819006085 819097579 819134772 819074869 819045246
2253.8 819045246 819121480 819193900 819175065 819137514 819183111 819242954 819211721 819151878 819146037 819173336 819159329 819077194
2278.3 819077194 819014430 819019437 819002271 818897247 818762422 818689525 818663120 818610311 818545938 818475246 818352997
2300.7 818352997 818211198 818080306 817952037 817849398 817741752 817591190 817447484 817301154 817098975 816844583
2321.1 816844583 816575348 816373825 816175044 815856993 815504014 815223753 814998031 814739883 814426541 814145625
2341.5 814145625 813900828 813761592 813927293 814169884 814045846 813452601 812769115 812290609 811926842 811598003
2361.9 811598003 811334848 811093390 810901999 810764253 810595274 810487628 810540080 810589492 810512900 810405254
$$ packed form
2208.9H18028629Q7559J24931Q5652L7432P6294J18554O6399L457L6538R9242O5445
2231.4H18830132k5153l9041N3048J27912N6565k5511K8133R1494L7193n9903k9623
2253.8H19045246P6234P2420j8835l7551M5597N9843l1233n9843n841K7299j4007q2135
2278.3H19077194o2764N007j7166j05024j34825p2897k6405n2809o4373p0692j22249
2300.7H18352997j41799j30892j28269j02639j07646j50562j43706j46330k02179k54392
2321.1H16844583k69235k01523j98781l18051l52979k80261k25722k58148l13342k80916
2341.5H14145625k44797j39236J65701K42591j24038n93245o83486m78506l63767l28839
2361.9H11598003k63155k41458j91391j37746j68979j07646N2452M9412p6592j07646
$$ plain form
2382.3 810405254 810326159 810188234 809918225 809597135 809360623 809188068 808933854 808553219 808178723 807912052
2402.7 807912052 807651520 807277322 806874573 806575596 806308627 805920362 805446565 805043578 804691732 804240882
2423.1 804240882 803700626 803231835 802927375 802665770 802282572 801853180 801503479 801153660 800702572 800182760
2443.5 800182760 799693286 799297869 798917174 798450530 797971725 797583520 797218025 796747148 796210229 795731962
2463.9 795731962 795287132 794802547 794304430 793848455 793433130 792984366 792465687 791930199 791441262 790989757
2484.3 790989757 790510774 790010989 789559245 789162099 788760483 788313568 787836671 787375867 786933124 786480606
2504.7 786480606 786028862 785609305 785231292 784850180 784415126 783960402 783562243 783214927 782840431 782424688
2525.1 782424688 782033026 781674445 781264842 780785859 780330956 779950142 779600382 779213309 778774858 778335690
$$ packed form
2382.3H10405254p9095j37925k70009l21090k36512j72555k54214l80635l74496k66671
2402.7H07912052k60532l74198m02749k98977k66969l88265m73797m02987l51846m50850
2423.1H04240882n40256m68791l04460k61605l83198m29392l49701l49819m51088n19812
2443.5H00182760m89474l95417l80695m66644m78805l88205l65495m70877n36919m78267
2463.9G95731962m44830m84585m98117m55975m15325m48764n18679n35488m88937m51505
2484.3G90989757m78983m99785m51744l97146m01616m46915m76897m60804m42743m52518
2504.7G86480606m51744m19557l78013l81112m35054m54724l98159l47316l74496m15743
2525.1G82424688l91662l58581m09603m78983m54903l80814l49760l87073m38451m39168
$$ plain form
2545.5 778335690 777906358 777447104 776975393 776547492 776164234 775789022 775377631 774914980 774475098 774077892
2565.8 774077892 773603380 773031235 772516310 772121549 771731257 771267056 770789027 770349979 769877613 769293487
2586.2 769293487 768688083 768219531 767839551 767365396 766798198 766291618 765868306 765379250 764760733 764133275
2606.6 764133275 763616443 763165772 762659371 762096465 761569738 761103868 760580897 759905457 759217739 758666337
2627 758666337 758152485 757541776 756900787 756358385 755847931 755212009 754490316 753860295 753334880 752746344
2647.4 752746344 752062619 751442969 750947773 750431776 749772668 749059200 748438478 747917116 747379541 746750593
2667.8 746750593 746123314 745593488 745078385 744500577 743898213 743315637 742762923 742207110 741633534 741075754
2688.2 741075754 740560591 740035594 739411294 738752067 738176286 737651408 737090051 736480772 735889196 735336304
$$ packed form
2545.5G78335690m29332m59254m71711m27901l83258l75212m11391m62651m39882l97206
2565.8G74077892m74512n72145n14925l94761l90292m64201m78029m39048m72366n84126
2586.2G69293487o05404m68552l79980m74155n67198n06580m23312m89056o18517o27458
2606.6G64133275n16832m50671n06401n62906n26727m65870n22971o75440o87718n51402
2627G58666337n13852o10709o40989n42402n10454o35922p21693o30021n25415n88536
2647.4G52746344o83725o19650m95196n15997o59108p13468o20722n21362n37575o28948
2667.8G46750593o27279n29826n15103n77808o02364n82576n52714n55813n73576n57780
2688.2G41075754n15163n24997o24300o59227n75781n24878n61357o09279n91576n52892
$$ plain form
2708.6 735336304 734748423 734087110 733411908 732793510 732220829 731638730 731062055 730538666 730027139 729436040
2729 729436040 728786170 728197336 727715373 727265894 726762533 726232231 725791991 725433409 724997282 724429727
2749.4 724429727 723854363 723367512 722911119 722397387 721860707 721369743 720880210 720305443 719688833 719159245
2769.8 719159245 718726218 718266070 717684209 717036843 716427088 715820909 715128779 714409530 713765621 713148177
2790.2 713148177 712448835 711665332 710897088 710154116 709323049 708385825 707459509 706613004 705751956 704770327
2810.6 704770327 703735113 702752471 701781034 700727820 699575365 698376834 697180092 695940316 694598496
2828.9 694598496 693186998 691735506 690200150 688541412 686668634 684468985 681962490 679172933
2845.3 679172933 676142693 673194408 670839250 669327557 668503404 668099284 667870462 667546630 666909993
$$ packed form
2708.6G35336304n87881o61313o75202o18398n72681n82099n76675n23389n11527n91099
2729G29436040o49870n88834m81963m49479n03361n30302m40240l58582m36127n67555
2749.4G24429727n75364m86851m56393n13732n36680m90964m89533n74767o16610n29588
2769.8G19159245m33027m60148n81861o47366o09755o06179o92130p19249o43909o17444
2790.2G13148177o99342p83503p68244p42972q31067r37224r26316q46505q61048r81629
2810.6G04770327j035214r82642r71437j053214j152455j198531j196742j239776j341820
2828.9F94598496j411498j451492j535356j658738j872778k199649k506495k789557
2845.3F79172933l030240k948285k355158j511693q24153m04120k28822l23832o36637
$$ plain form
2863.6 666909993 665900290 664640009 663358450 662205219 661166668 660201848 659382045 658737063 658111691
2882 658111691 657396734 656630099 655847669 655009329 654089212 653156042 652219057 651206017 650120437 648974955
2902.4 648974955 647724926 646349430 644833386 643085957 641012490 638622165 636054158 633542776
2918.7 633542776 631315887 629600883 628555119 628169358 628321648 628819406 629622102 630794108 632241309
2937 632241309 633881092 635739625 637723088 639529049 640887022 641867578 642701149 643371403 643831909
2955.4 643831909 644304395 645060956 646146357 647406459 648774922 650319934 652079344 653962314 655785263
2973.8 655785263 657507598 659265697 661014736 662476242 663626373 664730906 665867329 666890085
2990.1 666890085 667641282 668088257 668372095 668457806 668203890 667767227 667310297 666804612 666252732 665735364
$$ packed form
2863.6F66909993j009703j260281j281559j153231j038551r64820q19803o44982o25372
2882F58111691p14957p66635p82430q38340r20117r33170r36985j013040j085580j145482
2902.4F48974955j250029j375496j516044j747429k073467k390325k568007k511382
2918.7F33542776k226889j715004j045764l85761J52290M97758Q02696J172006J447201
2937F32241309J639783J858533J983463J805961J357973R80556Q33571O70254M60506
2955.4F43831909M72486P56561J085401J260102J368463J545012J759410J882970J822949
2973.8F55785263J722335J758099J749039J461506J150131J104533J136423J022756
2990.1F66890085P51197M46975K83838Q5711k53916m36663m56930n05685n51880n17368
$$ plain form
3010.5 665735364 665290594 664817810 664186656 663400114 662570834 661793709 660985768 660017312 659005105
3028.8 659005105 658118188 657316148 656398416 655316830 654315948 653478563 652579606 651444852 650196254
3047.2 650196254 649106741 648145795 647070885 645888686 644771039 643752992 642771244 641808510 640907764
3065.5 640907764 640066326 639155686 638112903 637106299 636317968 635667503 634899378 633974075 633076787
3083.9 633076787 632260025 631434977 630514562 629493833 628484309 627578735 626768947 625927985 624959707
3102.2 624959707 623990655 623132706 622256637 621231496 620224893 619393826 618574023 617600262 616453230
3120.6 616453230 615195930 613941193 612743199 611622810 610527396 609364331 608204603 607157588
3136.9 607157588 606135845 604949176 603594661 602236450 600992143 599924624 598919213 597702086
$$ packed form
3010.5F65735364m44770m72784o31154p86542q29280p77125q07941r68456j012207
3028.8F59005105q86917q02040r17732j081586j000882q37385q98957j134754j248598
3047.2F50196254j089513r60946j074910j182199j117647j018047r81748r62734r00746
3065.5F40907764q41438r10640j042783j006604p88331o50465p68125r25303q97288
3083.9F33076787q16762q25048r20415j020729j009524r05574q09788q40962r68278
3102.2F24959707r69052q57949q76069j025141j006603q31067q19803r73761j147032
3120.6F16453230j257300j254737j197994j120389j095414j163065j159728j047015
3136.9F07157588j021743j186669j354515j358211j244307j067519j005411j217127
$$ plain form
3153.2 597702086 596288741 594941139 593660176 592331886 591013134 589743435 588489830 587233067
3169.6 587233067 585964024 584702909 583463013 582202911 580915332 579638779 578405917 577205300
3185.9 577205300 575991035 574761033 573539495 572323978 571082890 569820523 568599343 567469954
3202.2 567469954 566394866 565266490 564052641 562881529 561835825 560787857 559667706 558551550
3218.5 558551550 557468355 556393087 555301607 554205537 553172946 552246392 551321745 550215423 548969507
3236.9 548969507 547789156 546676874 545549273 544512272 543592274 542582870 541428149 540274382
3253.2 540274382 539214790 538195968 537121713 536008179 534944057 533977091 533094764 532263994 531361997
3271.5 531361997 530331969 529280484 528241396 527248621 526375294 525584817 524802446 524034202 523346066
$$ packed form
3153.2E97702086j413345j347602j280963j328290j318752j269699j253605j256763
3169.6E87233067j269043j261115j239896j260102j287579j276553j232862j200617
3185.9E77205300j214265j230002j221538j215517j241088j262367j221180j129389
3202.2E67469954j075088j128376j213849j171112j045704j047968j120151j116156
3218.5E58551550j083195j075268j091480j096070j032591r26554r24647j106322j245916
3236.9E48969507j180351j112282j127601j037001r19998j009404j154721j153767
3253.2E40274382j059592j018822j074255j113534j064122r66966q82327q30770r01997
3271.5E31361997j030028j051485j039088r92775q73327p90477p82371p68244o88136
$$ plain form
3289.9 523346066 522700429 521978140 521158934 520289242 519477010 518847048 518330932 517725289 516932011 515996039
3310.3 515996039 515025914 514133096 513297319 512435794 511581302 510784686 509952903 508943260 507830143
3328.6 507830143 506794155 505835652 504922628 504088342 503227413 502205610 501125872 500106633 499141544
3347 499141544 498234242 497258782 496092319 494930089 493988842 493146002 492212951 491277635 490514010 489840358
3367.4 489840358 488996536 487925291 486887664 486046910 485269368 484437883 483566999 482783556 482146233
3385.7 482146233 481639415 481288046 480869979 480162889 479418278 479003012 478832781 478437394 477686286 477009833
3406.1 477009833 476649016 476426661 476123780 475647628 475167930 474899381 474760592 474626511 474572062 474715799
3426.5 474715799 474986792 475166172 475319982 475599647 475820720 475807220 475723177 475863427 476292282 476811558
$$ packed form
3289.9E23346066o45637p22289q19206q69692q12232o29962n16116o05643p93278r35972
3310.3E15996039r70125q92818q35777q61525q54492p96616q31783j009643j113117
3328.6E07830143j035988r58503r13024q34286q60929j021803j079738j019239r65089
3347D99141544r07302r75460j166463j162230r41247q42840r33051r35316p63625o73652
3367.4D89840358q43822j071245j037627q40754p77542q31485q70884p83443o37323
3385.7D82146233n06818l51369m18067p07090p44611m15266j70231l95387p51108o76453
3406.1D77009833l60817k22355l02881m76152m79698k68549j38789j34081n4449J43737
3426.5D74715799K70993J79380J53810K79665K21073j3500q4043J40250M28855N19276
$$ plain form
3446.9 476811558 477281123 477791429 478399873 479043931 479744703 480545729 481318176 482105672 483159393
3465.3 483159393 484366894 485307634 485859513 486403555 487272710 488434821 489586771 490499049 491401702
3483.6 491401702 492521077 493653566 494714975 495875239 497140557 498460710 499765009 501004577
3500 501004577 502206802 503364742 504511118 505739927 507162392 508807778 510414839 511789322 513141096
3518.3 513141096 514650941 516286671 517870128 519311905 520783186 522447765 524276197 526230454
3534.6 526230454 528220534 530103803 531986594 533954144 535882592 537685335 539519012 541454911
3551 541454911 543520033 545813978 548169911 550426781 552637398 554709196 556489825 558591008 561558366
3569.3 561558366 564667404 567423224 570011795 572622538 575391412 578379571 581302047 583722949
$$ packed form
3446.9D76811558M69565N10306O08444O44058P00772Q01026P72447P87496J053721
3465.3D83159393J207501R40740N51879N44042Q69155J162111J151950R12278R02653
3483.6D91401702J119375J132489J061409J160264J265318J320153J304299J239568
3500E01004577J202225J157940J146376J228809J422465J645386J607061J374483J351774
3518.3E13141096J509845J635730J583457J441777J471281J664579J828432J954257
3534.6E26230454J990080J883269J882791J967550J928448J802743J833677J935899
3551E41454911K065122K293945K355933K256870K210617K071798J780629K101183K967358
3569.3E61558366L109038K755820K588571K610743K768874K988159K922476K420902
$$ plain form
3585.6 583722949 585969150 588947296 592180908 595032036 597892523 601087332 604315639 607485294
3601.9 607485294 610631049 613446712 616082430 618982732 622039080 625199974 628329933 631281018
3618.3 631281018 634657025 638410568 641734123 644153059 646135509 649224043 652987540 656457543
3634.6 656457543 659617305 662563562 665430963 668283284 670793712 672567308 674288690 677342832
3650.9 677342832 680913508 683759809 686335206 689214647 691850960 694025993 695973396 697430909
3667.2 697430909 698379934 699874222 701513290 702515423 704247892 706739306 708997905 710905194
3683.5 710905194 712321341 712962568 713279486 714433610 716200590 717768133 718910098 719618261 720175207
3701.9 720175207 721132874 722220421 722707033 722494781 722641110 723978221 725512922 726435244 726816297
$$ packed form
3585.6E83722949K246201K978146L233612K851128K860487L194809L228307L169655
3601.9F07485294L145755K815663K635718K900302L056348L160894L129959K951085
3618.3F31281018L376007L753543L323555K418936J982450L088534L763497L470003
3634.6F56457543L159762K946257K867401K852321K510428J773596J721382L054142
3650.9F77342832L570676K846301K575397K879441K636313K175033J947403J457513
3667.2F97430909R49025J494288J639068J002133J732469K491414K258599J907289
3683.5G10905194J416147O41227L16918J154124J766980J567543J141965P08163N56946
3701.9G20175207R57667J087547M86612k12252J46329J337111J534701R22322L81053
$$ plain form
3720.2 726816297 727025151 727299213 727791131 728577673 729093671 728870392 728448153 728852093 730123281
3738.6 730123281 731199503 731043816 730264068 730697811 731211901 730982959 731626749 733024597 733890533
3756.9 733890533 734203398 734769344 735487819 735799491 735858381 735929906 736338615 737133563 737760365 737905324
3777.3 737905324 737849414 738075078 738380730 738617301 739065528 739602566 739958942 739987910 739739418 739563048
3797.7 739563048 739185035 738751888 739251971 739803612 740107059 740915000 741643667 741476953 740770161 740524590
3818.1 740524590 740272105 740301728 741193831 741931617 742315412 742482901 742427826 742375374 741991103 741328239
3838.5 741328239 741376758 742060363 742881000 743632972 743953049 743280470 741434753 740887702 742375493
3856.9 742375493 743627787 743937016 743589461 743410528 743548870 743212879 742885232 743217707 743840575
$$ packed form
3720.2G26816297K08854K74062M91918P86542N15998k23279m22239M03940J271188
3738.6G30123281J076222j55687p79748M33743N14090k28942O43790J397848Q65936
3756.9G33890533L12865N65946P18475L11672N8890P1525M08709P94948O26802J44959
3777.3G37905324n5910K25664L05652K36571M48227N37038L56376K8968k48492j76370
3797.7G39563048l78013m33147N00083N51641L03447Q07941P28667j66714p06792k45571
3818.1G40524590k52485K9623Q92103P37786L83795J67489n5075n2452l84271o62864
3838.5G41328239M8519O83605Q20637P51972L20077o72579j845717n47051J487791
3856.9G42375493J252294L09229l47555j78933J38342l35991l27647L32475O22868
$$ plain form
3875.2 743840575 744368851 744243741 743959606 744086206 744162440 744444191 744665980 744441926 744544566 744952440
3895.6 744952440 744869351 744231880 743574023 743347406 743811429 744613051 745128751 745268404 745141029 744742751
3916 744742751 744426012 744518161 744652450 744536340 744516373 744687855 744683146 744589806 744695723 744852841 744909942
3938.5 744909942 744807422 744566500 744480848 744521856 744434416 744366884 744472980 744601548 744639933 744608283 744512975
3960.9 744512975 744464874 744519293 744530439 744479835 744446695 744406641 744358480 744349778 744350076 744356751 744402170 744410992
3985.4 744410992 744301140 744151175 744102418 744147956 744201779 744215846
3997.6 744215846
$$ packed form
3875.2G43840575N28276j25110k84135J26600P6234K81751K21789k24054J02640M07874
3895.6G44952440q3089o37471o57857k26617M64023Q01622N15700J39653j27375l98278
3916G44742751l16739R2149J34289j16110j9967J71482m709r3340J05917J57118N7101
3938.5G44909942j02520k40922q5652M1008q7440o7532J06096J28568L8385l1650r5308
3960.9G44512975m8101N4419J1146n0604l3140m0054m8161q702K98O675M5419Q822
3985.4G44410992j09852j49965m8757M5538N3823J4067
3997.6G44215846
##END=$$ End of the data block
