##TITLE=$$ Begin of the data block
##JCAMP-DX=5.00 $$ ACD/SpecManager v 10.08
##SPECTROMETER/DATA SYSTEM=Alpha
##DATE=10 Nov 2014 10:35:34
##DATA TYPE=INFRARED SPECTRUM
##DATA CLASS=XYDATA
##ORIGIN=
##OWNER=
##NPOINTS=1765
##FIRSTX=399.76428223
##LASTX=3997.64306641
##MAXX=3997.64306641
##MINX=399.76428223
##MAXY=0.82804322
##MINY=0.45745239
##XFACTOR=1.0000000000
##YFACTOR=1.000000000000000e-9
##FIRSTY=0.66388381
##DELTAX=2.03961372
##XUNITS=1/CM
##YUNITS=ARBITRARY UNITS
##XYDATA=(X++(Y..Y))
399.8 663883805 662239790 662363946 663333893 662523270 660241365 659393966 660029948 659408510 656603992
418.1 656603992 654875040 655727983 656024575 654519916 653307855 654084861 655007660 654086292 652941346
436.5 652941346 653563917 654648423 654206753 653142452 653541744 654959500 655133247 653724432 652826428
454.8 652826428 653226316 653172135 651529193 650107682 650541604 651233971 649877191 647583187 647242844
473.2 647242844 648293138 647885621 646228433 645725906 646559119 646596313 645188510 644197464 644651055
491.5 644651055 644818664 643464267 642108858 642186463 642515719 641195774 638993859 638019800 637989938
509.9 637989938 636710882 634015143 631941497 631461322 631130397 629804015 628549695 628602445 629168451
528.3 629168451 628579319 627344251 627434015 628746033 629509211 629599214 630327106 631739557 632401049 631699562
548.7 631699562 630960763 631362498 632040203 631559968 630427361 630274832 630814672 630424559 628985405
567 628985405 627823591 627544999 627302587 626557052 626175523 626912057 628163993 628927708 629119158 629637182
587.4 629637182 630650759 631138802 630821705 630644381 631078005 631360531 630931258 630529523 630914450 631691813
607.8 631691813 631964326 631648421 631639302 632395685 633369386 634067416 634953678 636633337 638538599 639721990
628.2 639721990 640404403 641534209 643197477 644494474 645017326 645667136 647235453 648963749 649948239
646.6 649948239 650699854 652103662 653907537 655074060 655377269 655839384 656962693 657909214 658100843
664.9 658100843 658171177 659435689 661122203 662039757 662686050 663997054 665886164 667182028 667476773
683.3 667476773 667927921 669262707 670363843 670299470 669954240 670373976 671065092 671050549 670715868 671263397
703.7 671263397 672689140 673848689 674407065 675393760 677465677 679724395 681211531 682578862 684958518
722 684958518 687812626 689820170 691121876 692942202 695398331 697268784 698032379 698699594 700060904
740.4 700060904 701403856 701890290 702008724 702686548 703690529 704014957 703533173 703205943 703476489
758.7 703476489 703608871 703064680 702443421 702524364 703004539 703068018 702756286 702898562 703813136 705052733
779.1 705052733 706495285 708760679 712211668 716063499 719221532 721608222 723949850 726339400
795.4 726339400 728035629 728776872 729226232 729893148 730265915 729631722 728338420 727369249 726902962
813.8 726902962 726399302 725808203 725775898 726445973 726899683 726709425 726848006 728117108 729867339 731058955
834.2 731058955 731795430 732927442 734432817 735252798 734899163 734177113 733754337 732990921 731226861
852.6 731226861 729291677 728350639 728100240 727498770 726751983 727103531 728700280 730261326 731051207
870.9 731051207 731803060 733236849 734663665 734993577 734387994 733768046 733096540 731457233 728881419
889.3 728881419 726595283 725232542 724058211 722317994 720520079 719472468 718659401 716896892 714158893
907.6 714158893 711445034 709036469 706178188 702698529 699662566 697915554 696966827 695986569 695190430
926 695190430 695231497 695743144 695632219 694640279 693568647 692830265 691713572 689623237 687162161 685055315
946.4 685055315 682889163 679883897 676271558 672899306 669755280 666009128 661551893 657275796
962.7 657275796 653569281 649604082 644553661 638805866 633156061 627465129 621181309 614534020
979 614534020 608289421 602655053 597232878 592003763 587592781 584362030 581773102 579169512 576716661
997.4 576716661 574836016 573248148 571324766 569003940 566797018 564943194 563097656 561108053
1013.7 561108053 559451163 558547854 558103681 557578385 557044804 556980610 557401538 557804704 557923257 558000624
1034.1 558000624 558164835 558014035 557179332 555902839 554705322 553729415 552800536 552076697 552101374
1052.4 552101374 553019881 554386735 555911422 557744503 559916258 561936021 563226461 563647449 563404799
1070.8 563404799 562714875 561820686 561331451 561993778 563963354 566746235 569819868 572963715 576027334
1089.2 576027334 578612566 580308139 581128478 581410944 581431150 581334174 581360877 581849694 583000600 584746003
1109.6 584746003 586873889 589216411 591661692 594053447 596202910 597994447 599485695 600882053
1125.9 600882053 602362454 604027450 605767727 607287824 608393133 608957171 608926952 608522654 608098328
1144.2 608098328 607888401 607992172 608460128 609388947 610883355 612967074 615608811 618857026 622911334
1162.6 622911334 627857924 633460820 639442921 645735621 652255535 658687651 664656937 670090854
1178.9 670090854 675142586 679741561 683610499 686725616 689349949 691560864 693091035 693724513
1195.2 693724513 693695784 693463385 693164885 692665577 692081451 691761971 691702724 691483021 690855563 689984977
1215.6 689984977 689047992 687872887 686233938 684346437 682632446 681130946 679540336 677860975
1231.9 677860975 676530480 675732613 675131738 674494684 674068511 674141765 674555898 674932837 675234497 675720334
1252.3 675720334 676418841 677015841 677382588 677867651 678758919 679813921 680707872 681552887 682619035
1270.7 682619035 683793783 684671402 685163021 685583770 686092973 686444521 686463654 686385095 686427891 686342061
1291.1 686342061 685739934 684712291 683660150 682611227 681208432 679393709 677519381 675778270
1307.4 675778270 673963368 671849072 669703305 668000340 666666090 665336251 664026558 662939370
1323.7 662939370 662041664 661048591 659824133 658655286 657848060 657220781 656435788 655834019 655956268
1342.1 655956268 656498671 656888664 657029629 657204449 657532871 657748103 657655299 657373965 656994402 656520307
1362.5 656520307 656001210 655375779 654741049 654316485 653733850 652760983 651834309 650723934 648487687
1380.8 648487687 645458221 643770576 644523263 646058381 646461964 645477176 643768907 642275631 641001105
1399.2 641001105 639834166 638731897 637735188 637165546 636756897 636318326 636164546 636299193 636363924
1417.5 636363924 636635065 637615383 639043570 640634418 642053187 643254459 644582868 645822525 646555066
1435.9 646555066 647251248 648273349 649224401 649838924 650020063 650002062 650257528 650668025 650832534 650737286
1456.3 650737286 651799321 654239118 656588852 658862650 661777079 665219665 668968737 673689067
1472.6 673689067 679192364 684481025 689205706 693192303 696392298 698670268 700026929 700575650
1488.9 700575650 700750172 700683534 699680507 697519422 695343018 693689048 692017198 689068437 684718370
1507.3 684718370 682473660 681390762 679856837 677899182 676101804 674829066 673659563 672887444
1523.6 672887444 672259271 671297789 670389593 669188380 667592824 666563511 665384710 662957489 661373913
1542 661373913 661460698 661924005 662366509 662828326 663554370 664404929 664946675 665092707 666499555 668530762
1562.4 668530762 669779718 670354545 670349181 670162559 670140743 669394612 667689264 666432083 665254116
1580.7 665254116 663294852 660747588 657810748 654530108 650986850 647352695 643798828 640478134
1597 640478134 637293637 634043097 630760014 627535939 624225497 620700777 617259800 613973498 610006809
1615.4 610006809 605502486 602448165 599737644 596150160 592739344 589633644 586728215 584569931
1631.7 584569931 582517982 580083013 578948796 579013705 579287529 579472244 579375744 579867303 580967367
1650.1 580967367 581417084 582134485 584231019 586301327 588140965 590203702 592819870 595385849 597868681
1668.4 597868681 601118743 604761124 608509898 612796903 617159605 621142983 625022054 630209565
1684.7 630209565 636102378 641519487 646969914 651933253 656865716 662384093 667932093 674136162
1701.1 674136162 679658353 684200943 688654065 692478299 695370913 697516739 699086607 700628281
1717.4 700628281 702765405 704909146 706640720 708163440 709376693 710226357 710811913 711332917 712618470
1735.7 712618470 714171469 715530992 717312217 719597936 721995890 724533737 727798879 732029259
1752 732029259 736162782 739869595 743636906 747436404 751324952 755044460 758203089 760965884 763381600
1770.4 763381600 765664101 768226087 770752311 772891521 774666190 776221097 777699172 779290259
1786.7 779290259 780762613 781665444 782501638 783947170 785498857 786663473 787648797 788865209 790221095
1805.1 790221095 791405857 792280436 793091893 794135928 795244038 796139002 796900570 797668517 798372984
1823.4 798372984 799039543 799617231 800073743 800893545 801959872 802702069 803242624 803868890 804352105
1841.8 804352105 804515779 804910064 805698872 806512594 807192504 807678938 808080375 808534861 809071243 809554219
1862.2 809554219 809841573 809897363 809951007 810431182 811134934 811663628 812098742 812567413 812928617 813126504
1882.6 813126504 813353360 813697934 813961685 814168334 814475298 814838648 815254688 815600574 815785706 815961361
1903 815961361 816229641 816439986 816520989 816697419 817071319 817359805 817358017 817371070 817559659 817803323 818092704
1925.4 818092704 818313718 818454742 818648696 818840206 818903267 818926275 818983555 819000125 819039941 819170654
1945.8 819170654 819343030 819538832 819676757 819708586 819734633 819840610 819991410 820080996 820086837 820091784 820197701
1968.3 820197701 820356846 820416451 820402801 820464492 820612967 820714056 820720434 820722997 820770204 820782542 820679605
1990.7 820679605 820601583 820719957 820889652 820925891 820872009 820846736 820874274 820840538 820706964 820603192 820589662
2013.1 820589662 820538342 820356905 820165992 820088208 820073724 819977343 819770813 819624066 819640398 819647729 819490969
2035.6 819490969 819309413 819283485 819334447 819274545 819111466 819030702 819102228 819167912 819124103 819073141 819137156
2058 819137156 819235206 819189727 819074214 819131315 819328189 819408238 819353163 819360971 819499910 819601893 819552183
2080.4 819552183 819515705 819643855 819800854 819798172 819720447 819785595 819985747 820098877 820051789 820025861 820160806
2102.9 820160806 820335507 820374072 820343673 820417821 820558250 820596695 820565939 820653081 820853889 820959091 820933938
2125.3 820933938 820965111 821143329 821348488 821443081 821485817 821607172 821785212 821882427 821890295 821967125 822162867
2147.7 822162867 822318733 822342038 822374105 822555125 822793901 822915733 822960734 823103487 823353767 823557258
2168.1 823557258 823663473 823785543 823980391 824184418 824339867 824471116 824639738 824842572 825003743 825101793
2188.5 825101793 825208843 825390279 825611234 825764120 825826108 825921953 826117039 826295733 826380312 826447248
2208.9 826447248 826599360 826799035 826910615 826932847 826983452 827101052 827182770 827174187 827202857 827335715 827450037
2231.4 827450037 827468753 827456832 827507675 827620208 827672720 827645659 827670872 827773809 827838421 827806056 827773571
2253.8 827773571 827844203 827949345 827954888 827902377 827938616 828025281 828027368 827971160 827965558 828026235 828043222 827953875
2278.3 827953875 827856600 827830970 827818990 827743173 827633560 827572584 827562988 827542484 827492058 827424765 827354610
2300.7 827354610 827267408 827124476 826973557 826869607 826762378 826607347 826452434 826323569 826176167 825960219
2321.1 825960219 825683415 825455129 825264812 824997485 824683130 824418962 824200571 823971570 823713541 823434174
2341.5 823434174 823117137 822920084 823097587 823376119 823271751 822671115 821942031 821407139 821072280 820808709
2361.9 820808709 820514977 820293784 820227146 820138454 819974005 819858730 819809854 819771171 819698274 819586694
2382.3 819586694 819462955 819297016 819031417 818716645 818479538 818309307 818061054 817689896 817313254 817030132
2402.7 817030132 816773832 816433907 816044569 815698802 815369308 814979076 814543605 814155996 813832223 813456893
2423.1 813456893 812974334 812500894 812149882 811827660 811390340 810914695 810553670 810235679 809802771 809288383
2443.5 809288383 808824599 808431208 808012724 807523131 807044685 806675613 806350231 805905223 805346847 804823101
2463.9 804823101 804366708 803906798 803444684 802996993 802526951 802006602 801452160 800929189 800490797 800087392
2484.3 800087392 799629748 799138904 798676133 798244059 797818720 797352135 796850622 796402097 796000183 795551360
2504.7 795551360 795089006 794707477 794373214 793986857 793526828 793066680 792666316 792300820 791913986 791501522
2525.1 791501522 791126072 790791452 790393233 789914191 789456487 789084256 788766503 788410842 787980974 787527680
2545.5 787527680 787088156 786662042 786244631 785835028 785436034 785021067 784534335 784014583 783591568 783253968
2565.8 783253968 782828867 782263875 781708896 781286776 780902863 780413151 779881179 779435277 779022992 778504133
2586.2 778504133 777915716 777419984 777008891 776543140 775997102 775486887 775074780 774627507 774017632 773356974
2606.6 773356974 772836685 772433162 771960974 771380007 770824134 770334184 769789279 769116759 768444538 767901063
2627 767901063 767392099 766783714 766123295 765537083 765014768 764424741 763734996 763070762 762502134 761929989
2647.4 761929989 761287510 760661900 760108292 759535372 758866489 758171678 757576287 757089436 756576359 755961895
2667.8 755961895 755354583 754838526 754321277 753715873 753077984 752485156 751915693 751344621 750797451 750272691
2688.2 750272691 749770045 749262154 748678088 748042822 747440994 746887743 746326625 745727301 745153308 744624972
2708.6 744624972 744060397 743417442 742741406 742102861 741515696 740926206 740333200 739817381 739332497 738731682
2729 738731682 738050759 737441659 736965895 736563623 736118317 735608637 735134900 734739065 734324217 733813345
2749.4 733813345 733271301 732783556 732336640 731846690 731308222 730811000 730324745 729744852 729126632 728601694
2769.8 728601694 728173375 727719307 727141380 726495326 725899279 725333691 724668622 723933935 723291457 722702622
2790.2 722702622 721991897 721176684 720428228 719738483 718924582 717954278 716977537 716093004 715225399 714246929
2810.6 714246929 713180780 712157309 711172342 710106909 708936572 707747281 706550479 705277503
2826.9 705277503 703918517 702505469 701060951 699544907 697862625 695900738 693625808 691104472
2843.2 691104472 688315272 685284436 682320118 679885089 678269625 677411020 677039027 676846921 676521420
2861.6 676521420 675844133 674799919 673512161 672187030 671024859 670018256 669080794 668292642 667677522
2879.9 667677522 667078853 666395545 665655851 664898396 664087117 663182020 662220836 661255240 660273373 659239471
2900.3 659239471 658118486 656861365 655453444 653897941 652136266 650089025 647733212 645180643
2916.6 645180643 642697990 640532672 638861477 637822151 637455344 637651145 638182998 639014304 640269399
2935 640269399 641835213 643552959 645487010 647554994 649398267 650766850 651761055 652622283 653336585
2953.4 653336585 653832316 654357076 655208647 656393051 657727182 659148276 660767794 662617326 664558530
2971.7 664558530 666451156 668275535 670099735 671896100 673443973 674680233 675848544 677062333
2988 677062333 678184628 679015875 679485500 679777980 679918408 679741919 679342389 678913295 678498089 678052127
3008.4 678052127 677570641 677111387 676650882 676061869 675277770 674412906 673629224 672845542 671901345 670920730
3028.8 670920730 670090079 669362247 668497801 667408466 666352689 665477872 664583206 663461208 662205994
3047.2 662205994 661092579 660131216 659098685 657960415 656834960 655762732 654733360 653764546 652907252
3065.5 652907252 652094126 651172578 650167286 649205267 648397088 647702456 646886289 645924449 645006895
3083.9 645006895 644165814 643306613 642368913 641372502 640416920 639571607 638764262 637867451 636876643 635926485
3104.3 635926485 635056257 634115338 633038640 632033467 631224155 630399764 629390955 628233850 627001166
3122.6 627001166 625748277 624511242 623353601 622245610 621069372 619850636 618712962 617655098
3139 617655098 616477728 615109861 613736331 612478793 611360312 610286176 609024942 607571304 606172085
3157.3 606172085 604870796 603518248 602113426 600773036 599508762 598234117 596902549 595541954
3173.6 595541954 594214916 592919588 591574788 590158463 588777840 587491393 586215734 584889770
3189.9 584889770 583558202 582255840 580934346 579575479 578234851 576964378 575738251 574494481
3206.3 574494481 573212683 571947932 570758462 569574237 568322062 567063332 565891981 564738095
3222.6 564738095 563474417 562197089 561061442 560047030 559014022 557796180 556431293 555128455
3238.9 555128455 553911626 552681863 551474869 550349653 549209177 547995567 546807349 545710742
3255.2 545710742 544641614 543504238 542299807 541113973 540034235 539091408 538214564 537237585 536127329
3273.6 536127329 535010576 533901989 532797158 531784296 530869544 529973388 529068232 528200865 527379990
3291.9 527379990 526523829 525554299 524476826 523451149 522635162 521924376 521070182 519979954 518765330
3310.3 518765330 517563939 516417444 515258312 514075875 512947977 511840522 510661602 509363830
3326.6 509363830 507968724 506574392 505209804 503886402 502655983 501388729 499940991 498388439
3342.9 498388439 496815622 495334893 494015604 492615968 490986496 489359021 487915248 486558288
3359.2 486558288 485125840 483652472 482334048 481143147 479796946 478199214 476627707 475315750
3375.5 475315750 474136949 472947389 471753508 470603615 469579518 468761772 468129277 467427880 466429234
3393.9 466429234 465357333 464626044 464175254 463509202 462491184 461535424 460911900 460492492 460041672
3412.3 460041672 459427804 458769470 458281219 457928002 457623720 457452387 457456559 457565725 457654625 457802236
3432.7 457802236 458120227 458357543 458318055 458274275 458535254 459059179 459652424 460215390 460822791 461549520
3453.1 461549520 462383151 463332236 464368969 465319991 466259360 467488825 468891412 470042795 470854163
3471.4 470854163 471682549 472788393 474173605 475592703 476807714 478023291 479408652 480776668
3487.7 480776668 482126057 483621240 485211313 486821681 488413274 489989311 491557777 493044466
3504 493044466 494461685 495967478 497704089 499668270 501618207 503369033 505092919 506976604 509020746
3522.4 509020746 510993600 512763798 514591992 516700864 518983960 521326303 523673296 525957763
3538.7 525957763 528286457 530684590 533024013 535249114 537523389 539947093 542486906 545157075
3555 545157075 547922373 550726891 553503573 556067765 558387876 561136067 564645827 568166137 571358383
3573.4 571358383 574471056 577681541 581059098 584598660 588050604 591146111 594214916 597862244
3589.7 597862244 601625681 605084538 608587325 612413585 616328239 620146811 623807847 627174497
3606 627174497 630551279 634201169 637855709 641499519 645101845 648661792 652622879 656721890 660335720
3624.4 660335720 663205504 665866852 669499397 673490644 677199244 680657029 683861434 686967969
3640.7 686967969 690048099 692806542 694903910 696963429 700223386 703876853 706839621 709591448
3657 709591448 712557495 715222239 717489123 719581783 721182048 722246587 723771930 725360215 726317823
3675.4 726317823 728031516 730527401 732816577 734752834 736219645 737041831 737611413 738867342 740630746
3693.7 740630746 742181182 743331552 744090378 744678915 745631278 746742547 747331381 747298181 747569323
3712.1 747569323 748868942 750294268 751128137 751505852 751807094 752199590 752755761 753533661 754051328
3730.4 754051328 753902316 753570497 754024625 755276680 756296456 756210029 755630851 756087184 756467700
3748.8 756467700 756167352 756837726 758250892 759080708 759352326 759890854 760607243 760976136 761098742
3767.1 761098742 761193871 761591375 762347460 762937188 763088524 763088882 763339043 763624251 763817966 764184833
3787.5 764184833 764654398 765010953 765107632 764990568 764962435 764690876 764295101 764759064 765313864 765627205
3807.9 765627205 766351104 767007351 766869485 766270757 766064405 765821874 765915275 766772330 767438889 767795861
3828.3 767795861 767922759 767866671 767914057 767678916 767126918 767193079 767840505 768587947 769246519 769521475
3848.7 769521475 768908858 767190635 766659319 768121958 769396424 769717097 769379258 769181609 769267440
3867.1 769267440 768969834 768719256 769062102 769656539 770123959 770040452 769906640 770092726 770134270 770320594
3887.5 770320594 770458996 770251751 770426154 770887673 770823658 770198107 769576013 769415200 769953549 770771921
3907.9 770771921 771219909 771270692 771132648 770825386 770621777 770737469 770807266 770690203 770742059 770896733
3928.3 770896733 770818412 770721674 770878017 771044731 771044374 770912290 770724833 770696223 770744145 770657361 770621419
3950.7 770621419 770750046 770873189 770936191 770979762 770966947 770989418 771063149 771017194 770913303 770874977 770858347
3973.1 770858347 770867944 770911038 770928383 770979047 771073401 771101594 771033049 770916224 770862818 770880044 770893753
3995.6 770893753 770922959
3997.6 770922959
##END=$$ End of the data block
