##TITLE=$$ Begin of the data block
##JCAMP-DX=5.00 $$ ACD/SpecManager v 10.08
##SPECTROMETER/DATA SYSTEM=Alpha
##DATE=10 Nov 2014 10:35:34
##DATA TYPE=INFRARED SPECTRUM
##DATA CLASS=XYDATA
##ORIGIN=
##OWNER=
##NPOINTS=1765
##FIRSTX=399.76428223
##LASTX=3997.64306641
##MAXX=3997.64306641
##MINX=399.76428223
##MAXY=0.83322656
##MINY=0.44935319
##XFACTOR=1.0000000000
##YFACTOR=1.000000000000000e-9
##FIRSTY=0.65994376
##DELTAX=2.03961372
##XUNITS=1/CM
##YUNITS=ARBITRARY UNITS
##XYDATA=(X++(Y..Y))
399.8 659943759 658623457 658682585 659108698 658093631 656228900 655600429 655998290 655412555 653083563
418.1 653083563 651598275 652148843 651935220 650033057 648605704 649523675 651119530 650712192 649140298
436.5 649140298 648981512 650060356 650210619 649341822 649611473 651040375 651311278 649977505 648992777
454.8 648992777 649156213 649013102 647692561 646686673 647031426 647398412 646215081 644303858 643899441
473.2 643899441 644800365 644620657 643217504 642560840 643144906 643274426 641994596 640880406 641217411
491.5 641217411 641566455 640430927 638903439 638559043 638726473 637675107 635714889 634694457 634597540
509.9 634597540 633440554 630964398 628986418 628411829 627964914 626506925 625056565 625110805 625824451
528.3 625824451 625199139 623844862 623793960 624877632 625531614 625663102 626436830 628035128 629114449
546.6 629114449 628742576 627880394 627818584 628113866 627583921 626528084 626307607 626863241 626703024 625451267
567 625451267 624318838 623989880 623702824 622955859 622585654 623317957 624579966 625399292 625723183 626361847
587.4 626361847 627384007 627803028 627369821 627123773 627671421 628208101 627965689 627594531 627976239 628818154
607.8 628818154 629265904 629165113 629211545 629950464 631048262 631960213 633046389 634881794 636955261
626.2 636955261 638345718 639169157 640316486 641960204 643298388 643944860 644778192 646534443 648390412
644.5 648390412 649399638 650184751 651725769 653644323 654850245 655215502 655823648 657158136 658269227
662.9 658269227 658486903 658562183 659940064 661705792 662650526 663321733 664648771 666585624 667993665
681.2 667993665 668437064 669072151 670501471 671540260 671459436 671210349 671715140 672396898 672321260 671985567
701.6 671985567 672602236 674165487 675483108 676097274 677064300 679087102 681262016 682725906 684156895
720 684156895 686581492 689467609 691579998 693004370 694824398 697147548 698906958 699701548 700492799
738.3 700492799 701927722 703256726 703787744 704011858 704655349 705507576 705736697 705234826 704912901
756.7 704912901 705202579 705345690 704762578 704119861 704224825 704648793 704585433 704184353 704285443 705233514
777.1 705233514 706589103 708120823 710395455 713851869 717771709 720998704 723338962 725569546
793.4 725569546 727921724 729631782 730364740 730805457 731486440 731833696 731089830 729727387 728827715
811.8 728827715 728448570 727900088 727197528 727124035 727820337 728337884 728212833 728385508 729657114 731375754
832.2 731375754 732537150 733265340 734390438 735873401 736631513 736147523 735250235 734696865 733949780
850.5 733949780 732311487 730449319 729464293 729112923 728497684 727818787 728120983 729603827 731164157
868.9 731164157 732020497 732814968 734225273 735593319 735861659 735133886 734356940 733571947 731911063
887.2 731911063 729395926 727119684 725664973 724432349 722736537 720985055 719919801 719078839 717317581
905.6 717317581 714560509 711787283 709339619 706493735 703043699 700025141 698276520 697305739 696301758
923.9 696301758 695476949 695467651 695907712 695716023 694687426 693638325 692908943 691767931 689659059
942.3 689659059 687173069 685048640 682908654 679936767 676326513 672927856 669748783 665982544
958.6 665982544 661514997 657201588 653421938 649391353 644329071 638601542 632946551 627248406
974.9 627248406 620985687 614334941 608088672 602536559 597205997 591979742 587535799 584295750
991.3 584295750 581723630 579152882 576709211 574833095 573294818 571416259 569094300 566905439
1007.6 566905439 565127611 563348830 561374426 559718013 558813572 558338583 557787001 557261109 557144344
1025.9 557144344 557436466 557743371 557818472 557872176 558001280 557772040 556875527 555615008 554464519 553537190
1046.3 553537190 552711487 552144945 552267313 553199112 554581523 556133151 557944119 560036302 562003493
1064.7 562003493 563345373 563864112 563652575 562959313 562129080 561709583 562312841 564136505 566810012
1083 566810012 569821298 572925627 575978041 578576684 580318689 581246018 581661880 581765294 581702769
1101.4 581702769 581780195 582355082 583572567 585310757 587372899 589675307 592150450 594580710 596716166
1119.8 596716166 598487675 600010276 601450682 602953732 604623377 606362283 607894838 609014928
1136.1 609014928 609598160 609611094 609237194 608798742 608580053 608695090 609137237 610023737 611523628 613629699
1156.5 613629699 616264403 619492590 623513997 628403008 633934796 639831841 646043003 652523220
1172.8 652523220 658955336 664954662 670427382 675489604 680101573 684007347 687125564 689709902
1189.1 689709902 691892803 693407357 694031954 694032431 693845928 693560719 693052471 692476571 692164004 692081094
1209.5 692081094 691833913 691202819 690356016 689446986 688277185 686636090 684736550 682989061 681481481
1227.9 681481481 679958701 678397059 677147031 676364779 675783932 675195694 674809873 674910665 675358534
1246.2 675358534 675766468 676093340 676598728 677299380 677887559 678246140 678718269 679570735 680591404
1264.6 680591404 681489348 682340026 683405995 684596479 685500920 686019659 686433315 686888576 687205017
1282.9 687205017 687228203 687121868 687095225 686970115 686373115 685329854 684218526 683131039 681745708
1301.3 681745708 679951489 678051651 676275790 674480200 672418296 670296907 668586075 667256415
1317.6 667256415 665947139 664631844 663538337 662677228 661738753 660555720 659431934 658685923 658118308
1336 658118308 657374620 656765282 656862199 657417536 657845318 658033848 658269167 658671498 658955634 658901870
1356.4 658901870 658660591 658356190 657930434 657405317 656800807 656243920 655927181 655485690 654689908 653951049
1376.7 653951049 653177202 651701093 649639249 648247600 648218453 648699045 648525238 647314608 645526171
1395.1 645526171 644011974 642701805 641498625 640415609 639440894 638839066 638398409 637957156 637801468
1413.5 637801468 637941420 638015389 638269424 639224529 640604556 642115176 643496275 644712508 646016479
1431.8 646016479 647198915 647911727 648585200 649548650 650467694 651104510 651348114 651393354 651682317 652120352
1452.2 652120352 652330399 652299106 653363526 655766308 658119917 660391271 663281202 666742384 670543671
1470.6 670543671 675281405 680749238 685995281 690669179 694598734 697773576 700057328 701414108
1486.9 701414108 701919675 701961875 701738596 700665116 698533416 696372271 694685400 692992747 690085351
1505.2 690085351 685849726 683623374 682469726 680892706 678976417 677254856 676040232 674983680
1521.6 674983680 674343765 673799098 672930837 672108889 670963466 669454873 668551445 667508662 665281415
1539.9 665281415 663912058 664102852 664576650 665019572 665514171 666260481 667109787 667671680 667785168
1558.3 667785168 669025779 670934379 672102511 672602236 672497809 672180355 672066331 671240985 669395566
1576.6 669395566 667981684 666661024 664538443 661811233 658700228 655256808 651555896 647714198
1593 647714198 643860519 640244484 636824608 633328497 629751980 626208663 622585118 618792892 615127087
1611.3 615127087 611615956 607416213 602698863 599531591 596823514 593291938 589909136 586775064
1627.6 586775064 583803773 581653833 579810023 577812076 577110529 577513278 578109622 578643501 579040408
1646 579040408 580078185 581581414 582498431 583738208 586084902 588343263 590394735 592619658 595331311
1664.3 595331311 597976089 600527823 603808522 607463837 611225843 615493000 619831145 623823047
1680.7 623823047 627734125 632947266 638822615 644190848 649576545 654496610 659414709 664924383
1697 664924383 670489550 676736116 682292700 686870396 691357374 695208669 698128700 700323284 701960146
1715.3 701960146 703505635 705596089 707742512 709516764 711070299 712303936 713207006 713868737 714433014
1733.7 714433014 715692997 717207730 718545616 720328927 722630739 725036740 727581263 730834126
1750 730834126 735024035 739155114 742919326 746738791 750548661 754423261 758125901 761319339 764167309
1768.4 764167309 766642809 768927395 771456599 773964107 776112676 777901530 779481053 780989587
1784.7 780989587 782571793 784012496 784921587 785800695 787268996 788806975 789950132 790941298 792177737
1803 792177737 793550253 794759214 795658886 796484709 797539175 798658192 799579203 800370812 801137030
1821.4 801137030 801833808 802503705 803070366 803494096 804291248 805389941 806178153 806733191 807363808
1839.8 807363808 807867467 808055401 808423877 809159398 809959054 810670137 811198711 811625302 812077284 812590003
1860.2 812590003 813069403 813382566 813456833 813521445 814011991 814705610 815204144 815610409 816074371 816451848
1880.5 816451848 816662669 816886961 817234993 817535341 817778468 818063915 818375468 818774581 819142282 819351077
1900.9 819351077 819529593 819790721 820010722 820118368 820302248 820642471 820900440 820909083 820947528 821142852
1921.3 821142852 821361303 821618259 821855009 822044969 822250247 822417378 822478890 822506785 822545052 822557569
1941.7 822557569 822613895 822732329 822868049 823042870 823175788 823202252 823220551 823325813 823486805 823577881
1962.1 823577881 823563397 823543370 823653460 823851764 823953688 823951602 823997319 824124098 824203908 824211657 824231505
1984.6 824231505 824275851 824287415 824210346 824155331 824271679 824418485 824427068 824358761 824327707 824352264 824324310
2007 824324310 824185491 824063540 824060738 824042678 823886812 823716998 823654473 823649943 823563933 823373616 823243082
2029.4 823243082 823258340 823254228 823083818 822890222 822875917 822960138 822925687 822785735 822722971 822795749 822880387
2051.9 822880387 822864592 822809517 822863281 822984397 823000312 822937906 822979152 823149025 823269069 823263407 823266804
2074.3 823266804 823386312 823500216 823478878 823453426 823578417 823763371 823816121 823774576 823845983 824049532
2094.7 824049532 824201703 824213326 824232876 824406445 824601650 824620962 824559748 824642599 824823260 824897170 824892998
2117.1 824892998 825003684 825233638 825386703 825419903 825484276 825647116 825835347 825943947 825994074 826111495
2137.5 826111495 826297402 826421678 826460779 826543450 826726437 826891482 826959431 827033997 827223837 827465236
2157.9 827465236 827623725 827712595 827865720 828102589 828291118 828396142 828525305 828732550 828971326 829175770
2178.3 829175770 829332709 829486668 829683363 829876423 829989791 830085993 830266774 830487669 830644906 830744803
2198.7 830744803 830882668 831080139 831256568 831365585 831437349 831547618 831715226 831841052 831893981 831974804
2219.1 831974804 832112968 832206607 832233369 832298577 832419336 832505763 832524717 832525551 832594037 832724929 832786262
2241.6 832786262 832775712 832810700 832883596 832909703 832871735 832868218 832976997 833098412 833110571 833075941 833117962
2264 833117962 833201706 833226562 833185256 833150566 833178461 833194911 833121240 833037198 833018899 832998395 832906961 832797885
2288.5 832797885 832771361 832803488 832774878 832692683 832621217 832557619 832502782 832423091 832290947 832174480 832094610
2310.9 832094610 831979454 831835270 831688404 831495166 831244230 830976367 830748916 830522597 830228567 829953849
2331.3 829953849 829750240 829538524 829271078 828968108 828681886 828415573 828279793 828430295 828604519 828426063
2351.7 828426063 827839971 827185631 826758265 826483309 826206803 825888515 825551331 825324059 825208545 825107455
2372.1 825107455 825050414 825084209 825109601 825012386 824846268 824711680 824568510 824326992 824017227 823755324
2392.5 823755324 823573172 823358476 823028564 822681248 822400689 822102010 821714938 821305990 820973039 820683658
2412.9 820683658 820314825 819873452 819492340 819185555 818827510 818365932 817905247 817546368 817202330 816763759
2433.3 816763759 816314340 815963507 815641522 815202773 814652979 814155459 813777804 813387752 812901855 812419415
2453.7 812419415 812036753 811684489 811233282 810707808 810209572 809733033 809230566 808732748 808294952 807901800
2474.1 807901800 807465136 806927323 806360841 805878282 805468380 805026352 804527462 804049850 803627849 803202152
2494.5 803202152 802713335 802200854 801751614 801362038 800952315 800503314 800078571 799697995 799305201 798871458
2514.9 798871458 798437059 798061132 797716379 797327876 796923995 796572745 796238482 795832992 795352221 794887185
2535.3 794887185 794504881 794162512 793790102 793376148 792950511 792541981 792116046 791647613 791196406 790804446
2555.6 790804446 790412128 789946139 789459586 789055467 788703203 788261294 787697673 787166476 786762357 786370754
2576 786370754 785887480 785387218 784974992 784583092 784056962 783428431 782886326 782467306 782012343 781451464
2596.4 781451464 780917764 780504584 780083954 779522002 778900921 778381765 777933717 777400732 776794434 776253045
2616.8 776253045 775795043 775273144 774605691 773946762 773425937 772921920 772307277 771668255 771122694 770599723
2637.2 770599723 769964814 769242942 768580198 768039882 767498672 766849697 766191363 765627086 765073121 764427960
2657.6 764427960 763760507 763181388 762670517 762127936 761515915 760913908 760395586 759872258 759248555 758614898
2678 758614898 758066654 757530093 756927550 756327212 755803943 755337536 754851103 754272401 753631532 753039956
2698.4 753039956 752518177 751975060 751383841 750818193 750299394 749739468 749075651 748366833 747734547 747199118
2718.8 747199118 746651828 746071637 745550454 745060921 744487226 743851483 743252814 742739201 742283225 741780162
2739.2 741780162 741236985 740799606 740465701 740057528 739501953 738934755 738472164 738046825 737555921 737030208
2759.6 737030208 736565530 736118555 735565722 734950185 734415114 733987272 733542264 732957602 732292771 731704473
2780 731704473 731165469 730498970 729754686 729139924 728593469 727894902 727064550 726303220 725613534 724811375
2800.4 724811375 723861814 722902656 722031236 721183479 720223010 719169915 718167186 717207015 716139674
2818.8 716139674 714915216 713645101 712414026 711160362 709799230 708365321 706937850 705462098
2835.1 705462098 703790605 701800942 699486732 696940839 694150209 691115141 688132405 685687602
2851.4 685687602 684076011 683200002 682774067 682535291 682205737 681544244 680488348 679163396 677831769
2869.7 677831769 676701725 675725222 674812198 674047887 673436463 672803521 672065735 671303570 670569420
2888.1 670569420 669788361 668909252 667991102 667069077 666104853 665070593 663954079 662705958 661287308
2906.5 661287308 659708619 657952309 655914783 653526127 650960982 648519039 646405578 644819498
2922.8 644819498 643885195 643566310 643745720 644251049 645081460 646358788 647969544 649755001 651752591
2941.1 651752591 653872013 655751765 657133639 658146858 659051538 659835875 660420120 661005139 661875248
2959.5 661875248 663087666 664458752 665892243 667513192 669366896 671336889 673287690 675192773
2975.8 675192773 677128434 679008961 680590928 681878507 683113635 684366286 685509861 686372399
2992.1 686372399 686891079 687227428 687388361 687220633 686857104 686497748 686114490 685660243 685207188 684824169
3012.5 684824169 684440911 683886766 683123767 682312489 681563318 680764496 679790854 678788662 677958131
3030.9 677958131 677245975 676408470 675363660 674365938 673547506 672668815 671529889 670277536 669196308
3049.2 669196308 668274462 667252362 666096270 664982617 663970292 663016856 662080944 661194801 660384476
3067.6 660384476 659505010 658466041 657454491 656691909 656088352 655339956 654392958 653450608 652585268
3085.9 652585268 651752293 650897622 649957836 648991883 648110032 647287488 646403670 645443976 644527078 643675327
3106.3 643675327 642765701 641743302 640755057 639923811 639113426 638145864 636982858 635704875 634449720
3124.7 634449720 633263707 632155955 631074071 629894078 628674269 627567112 626530647 625340581
3141 625340581 623964310 622616887 621404529 620327711 619287789 618042469 616579413 615171134 613870859
3159.4 613870859 612520278 611122906 609781027 608493030 607193589 605842948 604467332 603143752
3175.7 603143752 601858139 600519538 599119484 597762525 596477211 595150650 593753338 592390656
3192 592390656 591082215 589715719 588281512 586901844 585627377 584371746 583049893 581708312 580446243
3210.3 580446243 579231143 577945769 576613963 575345755 574165046 572995842 571738243 570410252
3226.7 570410252 569159389 568049014 566947103 565670013 564271927 562948823 561683357 560399294
3243 560399294 559177220 558039129 556846142 555558920 554290056 553125679 551999271 550795019 549569905
3261.3 549569905 548430741 547395766 546441615 545496523 544456303 543327570 542195857 541050494 539888859
3279.7 539888859 538790345 537775934 536804914 535878479 535012841 534141481 533148766 532004714 530809581
3298 530809581 529735565 528848469 528022468 527040482 525792122 524398029 522994578 521631360 520316243
3316.4 520316243 519016266 517712414 516381443 514977872 513432205 511767805 510129392 508548856
3332.7 508548856 506995738 505505145 503984034 502304435 500510395 498651475 496830940 495137841
3349 495137841 493369192 491404861 489452600 487644255 485874981 484056652 482288063 480694413 479148567
3367.4 479148567 477385372 475408375 473505616 471842945 470309466 468792617 467292458 465886325
3383.7 465886325 464625567 463538498 462666571 461798459 460649818 459400654 458483428 457854956 457007825
3402.1 457007825 455802828 454655468 453836709 453241497 452652335 451920301 451140612 450521648 450050771
3420.4 450050771 449647933 449383497 449353188 449524015 449688673 449846417 450149596 450428963 450480819 450491160
3440.8 450491160 450765014 451333374 452016652 452714443 453489184 454384416 455396742 456503689 457656026
3459.2 457656026 458750457 459886730 461335659 462965727 464334100 465337634 466362953 467664450
3475.5 467664450 469192803 470752627 472158641 473566443 475150168 476749390 478302568 479954809
3491.8 479954809 481701046 483489692 485277236 487033904 488785028 490482450 492099822 493796796
3508.1 493796796 495739877 497918427 500044703 501926720 503814638 505905211 508171201 510378003
3524.4 510378003 512377262 514448643 516769886 519199848 521711349 524280727 526783109 529305577
3540.8 529305577 531934977 534563601 537072062 539565206 542155385 544895291 547810078 550812662
3557.1 550812662 553854227 556893647 559750021 562405765 565483987 569194496 572892368 576383114
3573.4 576383114 579841435 583348930 587043405 590982795 594846785 598312795 601737738 605744898
3589.7 605744898 609907925 613825500 617728651 621818662 625974417 630127013 634171665 637883484
3606 637883484 641568840 645524263 649494469 653463542 657346606 661111057 665305197 669711530 673609614
3624.4 673609614 676639378 679309726 682984591 687120020 690942526 694487810 697826445 701091468
3640.7 701091468 704273641 707051337 709132135 711176515 714419186 718061566 721007168 723722279
3657 723722279 726682603 729373157 731605947 733629704 735212028 736271858 737765074 739324629 740274727
3675.4 740274727 741956949 744375527 746610284 748582840 750147820 751033545 751655638 752962708 754690707
3693.7 754690707 756184816 757300794 758032382 758647084 759604335 760670245 761306047 761354864 761592686
3712.1 761592686 762844861 764294744 765198410 765625000 765934706 766336501 766883731 767628670 768142700
3730.4 768142700 768053174 767749429 768103600 769312024 770404041 770361483 769740701 770156980 770535886 770244539
3750.8 770244539 770892382 772263944 773053765 773292005 773908734 774773955 775159597 775191128 775255680 775693655
3771.2 775693655 776488781 777072906 777163863 777100861 777338624 777635455 777865767 778329134 778884947 779241562
3791.6 779241562 779292166 779132724 779066145 778765976 778375268 778849483 779422224 779802442 780564904 781217456
3812 781217456 781098187 780549765 780410647 780176997 780170560 780939519 781580508 781934679 782069981 782028973
3832.4 782028973 782080531 781881869 781415939 781462491 782015741 782787979 783585906 783980489 783399999 781683266
3852.8 781683266 781131923 782480121 783658326 784000337 783760965 783653498 783776402 783472896 783230841
3871.2 783230841 783584833 784204066 784760654 784709215 784456432 784551680 784622729 784832776 784957707 784752846
3891.6 784752846 784957588 785472155 785431325 784782112 784162879 783995271 784458160 785226583 785728514 785890579
3912 785890579 785818517 785525084 785303414 785355568 785400271 785314977 785380185 785535634 785476029 785443187 785662889
3934.4 785662889 785847485 785888910 785820723 785653532 785597742 785633743 785551548 785472512 785563171 785709500 785790384
3956.8 785790384 785802364 785778224 785858631 786023736 786057651 785979331 785927355 785903335 785907447 785924435 785902619
3979.3 785902619 785944641 786075354 786107063 786016226 785909653 785829544 785848618 785990417 786119103
3997.6 786119103
##END=$$ End of the data block
