##TITLE=$$ Begin of the data block
##JCAMP-DX=5.00 $$ ACD/SpecManager v 10.08
##SPECTROMETER/DATA SYSTEM=MB Serie
##DATE=08 Mar 2010 09:20:48
##DATA TYPE=INFRARED SPECTRUM
##DATA CLASS=XYDATA
##ORIGIN=
##OWNER=
##NPOINTS=3734
##FIRSTX=400.19995117
##LASTX=4000.07055664
##MAXX=4000.07055664
##MINX=400.19995117
##MAXY=84.04360199
##MINY=30.82489967
##XFACTOR=1.0000000000
##YFACTOR=0.000000100000000
##FIRSTY=78.04969788
##DELTAX=0.96433717
##XUNITS=1/CM
##YUNITS=TRANSMITTANCE
##XYDATA=(X++(Y..Y))
400.2G80496979M979019M530029J970978K507019j623993o407013J413956Q986053
407.9G96853027J875000n186996j781998J141968J169968L944015L880997J641006
415.6H03536987j080017n528946p542038J451035Q259964N698013J781006l610992
423.3H02965012n274048M77066Q750000L219986j958008P60956o46973k153015P92007
432H06932983J818009K44980q50983M7989K101059Q5983j638031M78974J040039O80999
441.7H10942001r16977l911056J186066N119934M47998l119965l122024j741944J965943
450.3H06849976J996994j968995j785965K94953K922058M486008k294007l569030L163986
459H10095978P59048o32019K06986L98025p83005O11954Q95996j265945p17011j389007
$$ plain form
400.2 780496979 785475998 790006027 791977005 794484024 792860031 786453018 787866974 796853027
407.9 796853027 798728027 793541031 791759033 792901001 794070969 798014984 801895981 803536987
415.6 803536987 802456970 796928024 789385986 790837021 799096985 804794998 806576004 802965012
423.3 802965012 797690964 798168030 806918030 810138016 808180008 808940964 808293991 806140976 806932983
432 806932983 808750992 808995972 808144989 808192978 810294037 810380020 808741989 809220963 810261002 810942001
441.7 810942001 810025024 806113968 807300034 812419968 812867966 809748001 806625977 804884033 806849976
450.3 806849976 808846970 806877975 805092010 805386963 808309021 812795029 810501022 806931992 810095978
459 810095978 810855026 810223007 810429993 810828018 810045013 810656967 811552963 810287018 809570007 808181000
468.7H08181000J082992L731003j054001m273987m26025N97000J204987O65054p52029
477.3H08955994J50985j809005k595978P9040J452942K040024M7989k556992M76990
486H06241989K733002J152038J56937k029953k508011p29980j019058k74964J728974
494.7H05450974K4032j687012o09970k79007K47956J496048K023010L17001k602005
503.4H04381027l044052j251984l38974O46973Q40988j539993k834015j443939J745987
512.1G97162018J439972j584015k195969j553039r87931J148987K080002n80063k058945
520.7G92871017k316055l240967q81958K203980Q22983j728974j831054k933960k334977
529.4G80630035J513977K075959j033936l257065l827972k267990O81000J112976m67987
$$ plain form
468.7 808181000 809263992 812994995 811940994 807667007 807240982 807837982 809042969 809708023 808955994
477.3 808955994 809106979 807297974 804701996 804781036 806233978 808274002 808321991 805764999 806241989
486 806241989 808974991 810127029 810283966 808254013 805746002 805016022 803996964 803722000 805450974
494.7 805450974 805475006 803787994 803178024 802899017 803146973 804643021 806666031 806983032 804381027
503.4 804381027 801336975 800084991 799746017 800392990 801233978 799693985 796859970 795416031 797162018
512.1 797162018 798601990 797017975 794822006 793268967 792281036 793430023 795510025 794929962 792871017
520.7 792871017 790554962 787313995 786432037 788636017 789459000 787730026 785898972 782965012 780630035
529.4 780630035 782144012 784219971 783186035 779928970 776100998 773833008 774514008 775626984 775158997
538.1G75158997k70005j511993l226013j767960K40936J274033r35974m102020m011002
546.8G60848999k889023L64990K277070j892014l808060k470932k139053k034988m93012
555.5G47763977L24020k969970m980011l460007j086044N65033J267013l08990m276047
564.1G32838974m900970k258988r42993j190033j671982l006973m843063m319993j721954
572.8G07982025j54037j40000l295974o142045m764938k607040l05023l22953k175979
581.5F88074036m938050o416015m172974k376022k467957l742981m538040m969025
589.2F54452972n550003m235000k005005l074951n976029o296997o460991o712990
596.9F14141006l962020k622986n513993p343025q097992r083976p852021p086982
$$ plain form
538.1 775158997 774888992 773376999 770150986 768383026 768623962 769897995 768962021 764860001 760848999
546.8 760848999 757959976 758324966 760602036 758710022 754901962 752431030 750291977 748256989 747763977
555.5 747763977 748087997 745118027 740138016 736678009 735591965 736156998 737424011 737115021 732838974
564.1 732838974 727938004 725679016 724736023 723545990 721874008 718867035 714023972 709703979 707982025
572.8 707982025 707827988 707687988 704392014 698249969 693485031 690877991 690572968 690250015 688074036
581.5 688074036 683135986 676719971 672546997 670170975 667703018 663960037 659421997 654452972
589.2 654452972 648902969 644667969 642662964 639588013 633611984 627314987 620853996 614141006
596.9 614141006 610178986 607556000 602042007 594698982 586600990 577517014 569664993 562578011
604.6E62578011p350007p810020r769974j1094017j0070991q936005q558006q213997
612.4D90774994q261986p905006n004006l35006L360023O233978P971001Q432999R355011
621E04622002J0700988J1753998J0815010Q443985O694031N571976M347000L316002
628.7E66264992K628021N92003k247009n182000o314010n432015m215965k119026n92003
637.4E43382988J178017L746986O889000R918022J1156998J0845985R635010P490997
645.1F04244003O071015P034988Q161011Q692970Q532982O404037M468995L935012
652.9F57545013N227967O399002N184021L339004K084961K620011M379043N304947
660.6F92083969M681015L324051J974945N45044K623978M577026L833008O334991K989960
$$ plain form
604.6 562578011 555228004 547417984 537648010 526553993 516483002 507546997 498988991 490774994
612.4 490774994 482513008 474608002 469603996 469268990 472629013 478862991 486833992 495266991 504622002
621 504622002 515322990 527076988 537891998 546335983 553030014 558601990 562948990 566264992
628.7 566264992 568893013 569485016 567238007 562056007 555741997 550309982 546094017 543974991 543382988
637.4 543382988 544561005 548307991 555196991 565115013 576272011 587117996 596753006 604244003
645.1 604244003 610315018 617350006 625511017 634203987 642736969 649141006 653610001 657545013
652.9 657545013 662772980 669171982 674356003 677695007 679779968 682399979 686779022 692083969
660.6 692083969 696764984 700089035 702063980 702609024 705233002 709810028 713643036 719978027 722967987
669.3G22967987P97043P85980K089005M684982N439987L134995J156997L69034N57022
677.9G41983032L308945N237045M252014J276932k74963Q83026K546997M506988M103013
686.6G67823029J706008l051k54975J780014M040985M411011K447968l9978m77982
695.3G81433029N17960J731033L071976L136978J827011j29013p33948J394959K910995
704G95160980L616028L479996Q30002j602021o36978J906967K922058K579957O68029
712.6H08925018j619034j126022J476059L278961K899018J129989L6011p66983o62994
721.3H13570023J795959L802033K692947K86026j485977j866989O09970L640976L311996
730H26356964N55039j667023k024002N31997L293000L090057J749954j6021k525940
$$ plain form
669.3 722967987 723765030 724551010 726640015 731324997 736764984 739899979 741056976 741426010 741983032
677.9 741983032 745291977 750529022 754781036 756057968 755783005 756666031 759213028 763720016 767823029
686.6 767823029 769529037 769525986 769271011 771051025 775092010 779503021 781950989 781911011 781433029
695.3 781433029 781950989 783682022 786753998 789890976 791717987 791588974 790855026 792249985 795160980
704 795160980 798777008 802257004 803087006 801484985 800848007 802754974 805677032 808256989 808925018
712.6 808925018 807305984 806179962 807656021 810934982 813834000 814963989 815000000 814233017 813570023
721.3 813570023 815365982 819168015 821860962 822146988 820661011 818794022 819403992 823044968 826356964
730 826356964 826912003 825244980 823220978 823752975 827045975 830136032 831885986 831869965 829344025
738.7H29344025k207032J362992L397979K689057M47006j763992k119065l23944K065964
747.4H32892990K452011J078034R7961j324997j697006O12030K469940J993027J68991
756H38742981j207962j608048l63006J792068K209931N41000q99963j843033j371994
764.7H35991974Q27026K117005J500015n12009j641006j463013k79999J761017J782990
773.4H40084000n8976j343002k042999j532059P69043K429962J711045k74048k116928
782.1H37626038j536026L56979J478043J887970N51986j202011j930008j259994M54025
790.8H36427002J828995J542968q75930k177048r04999K05002O72989J573028Q21000
799.4H39113007j828995k284012n05981R53979J457977P92008o63986j940995j435012
$$ plain form
738.7 829344025 827136993 828499985 831897964 834587021 835034027 833270035 831150970 830827026 832892990
747.4 832892990 835345001 836423035 836520996 835195999 833498993 834111023 836580963 838573990 838742981
756 838742981 837535019 835926971 835563965 837356033 839565964 840106964 839207001 837363968 835991974
764.7 835991974 836819000 838936005 840436020 839924011 838283005 836819992 836539993 838301010 840084000
773.4 840084000 840025024 838682022 836639023 835106964 835876007 838305969 840017014 839742966 837626038
782.1 837626038 836090012 836446991 837925034 839813004 840364990 839162979 837232971 835972977 836427002
790.8 836427002 838255997 839798965 838923035 836745987 835840988 836045990 836718979 838292007 839113007
799.4 839113007 837284012 835000000 834494019 835447998 836905975 837697983 837033997 835093002 833657990
808.1H33657990K70996J340026J038971k16980r84039j764984j091003N91049P05948
816.8H33547974R9029q19015j749955j691055J53046J800995J082992o55975j679001
825.5H30089035j534042k58026M18014M33045M57000q14056j620941j049042n68008
834.2H25552979J67999Q46023j67007k208023k509003j123962N13992J628037K61993
842.8H22963028j590042j716995j639023n61981J000976P81021p64999k196961k718048
851.5H13556976j605987J17035O63986J39999j053009k088012j944962o99997O37970
860.2H07723999L43018r08051j830978k130967r39025J30004k98995p09992j142044
868.9H00236969j996002j645966l20968M69970k39029j756973k438965j887054o80008
$$ plain form
808.1 833657990 833928986 835269012 836307983 836091003 835106964 833341980 832250977 832842026 833547974
816.8 833547974 833647003 832827988 831078033 829386978 829540024 831341019 832424011 831768036 830089035
825.5 830089035 828554993 828296967 828714981 829148026 829605026 828790970 827170029 826120987 825552979
834.2 825552979 825720978 826567001 826399994 824191971 821682968 820559006 821072998 822701035 822963028
842.8 822963028 821372986 819655991 818016968 817454987 818455963 819236984 818471985 816275024 813556976
851.5 813556976 811950989 812068024 812732010 812872009 811819000 809730988 807786026 807086029 807723999
860.2 807723999 808067017 807158966 805327988 803197021 802257996 802388000 802089005 801379013 800236969
868.9 800236969 798240967 796595001 796274033 796744003 796504974 794748001 792309036 790421982 789741974
877.6G89741974M65011N21012k35977j278992k222061j082993j5945j68991k12021
886.2G85511017j088028k283020k299957o06995N91965P1029q25042j787949k238007
894.9G75045013j311035l42941j88065l35006j114960j818008j949006j238021j19935
903.6G66628036M3946l54004j820984k652969j277008l98026j48010l17002j409988
912.3G58293991k220993k067032j234970Q4000M84009p38984j801986k133026j594010
920.9G47070999p09991l99018o22024j091995j628952j939011j065979l61023o68030
929.6G38584976o11954j231994k273026j827011o05011j89972n20019j261978k192994
938.3G27871017k368011j212006j4038k70996q73947j464996k581024k354966m37011
$$ plain form
877.6 789741974 790206985 790727997 790492020 789213028 786990967 785907974 785892029 785723038 785511017
886.2 785511017 784422989 782139969 779840012 779233017 779824982 779896011 779070969 777283020 775045013
894.9 775045013 773733978 773391037 773202972 772867966 771753006 769934998 767985992 766747971 766628036
903.6 766628036 766671982 766317978 764496994 761844025 760567017 760168991 760020981 759703979 758293991
912.3 758293991 756072998 754005966 752770996 752854996 753339005 752600021 750798035 748665009 747070999
920.9 747070999 746361008 745961990 745339966 744247971 742619019 740680008 739614029 739253006 738584976
929.6 738584976 737973022 736741028 734468002 732640991 732035980 731846008 731325989 730064011 727871017
938.3 727871017 725503006 724291000 724276962 724005966 723132019 721667023 719085999 716731033 716294022
947G16294022N51986m57000j831971k308044k060013j143951n84030r48029j119003
955.7G06393967j260987j679001j715011j001968l98026q27942j405029k010040k328949
964.3F93767014j499024n85022m82941j126022j896973k279052j856003j007004p42950
973F82292023j015015j707001j565017j195984j725006j593018q76999n46951j202011
981.7F70865021k144013k236023j384964q30001j179047j382980j942978k482987j501007
990.4F55781021n47027q71964r81064j392975k360992k189026j181946o34994o08063
999.1F45012970j409988k686005k579994j481972q89015r79996j478996k020989j991005
1007.7F29495010j662025j250992p98988r65996j692009k400017k356987k028999j570015
$$ plain form
947 716294022 716846008 716389008 714557037 712248993 710188980 709045029 708460999 707512970 706393967
955.7 706393967 705132980 703453979 701738968 700737000 700338974 699511032 698106003 696095963 693767014
964.3 693767014 692267990 691682968 691200027 690074005 688177032 685897980 684041977 683034973 682292023
973 682292023 681277008 679570007 678004990 676809006 675084000 673490982 672613983 672067032 670865021
981.7 670865021 668721008 666484985 665100021 664270020 663090973 661707993 659765015 657282028 655781021
990.4 655781021 655233994 654362030 653380966 651987991 649626999 647437973 646256027 645621033 645012970
999.1 645012970 643602982 640916977 638336983 636855011 635965996 634986000 633507004 631486015 629495010
1007.7 629495010 627832985 626581993 625783005 624817009 623125000 620724983 618367996 616338997 614768982
1016.4F14768982r26972j545028k280998j904984j764984j438026q32978j286011j819000
1025.1F00970001j967010k103005j791000j264992j105003j853981k677994k616005
1032.8E85591011j767998q57010j071014j513977j976013k690010k178994j497001
1040.5E72038994j167984j088028j689987k052994k246018k492980k085000j448021
1048.2E57767982j584968k010002k599030l081970k254028j306000j557999k341003
1056E41032982k746964k146034j905975j945992j416015j898003k728996k551003k482986
1064.6E21211014k571030k225990k110977k101021k015991k502022k790985k114983
1072.4E02778015k023010k322998k505989l333016l283996k428017j931992k019004
$$ plain form
1016.4 614768982 613842010 612296982 610015984 608111000 606346016 604907990 604075012 602789001 600970001
1025.1 600970001 599002991 596899986 595108986 593843994 592738991 590885010 588207016 585591011
1032.8 585591011 583823013 582966003 581894989 580381012 578404999 575714989 573535995 572038994
1040.5 572038994 570871010 569782982 568092995 566040001 563793983 561301003 559216003 557767982
1048.2 557767982 556183014 554173012 551573982 548492012 546237984 544931984 543373985 541032982
1056 541032982 538286018 536139984 534234009 532288017 530872002 528973999 526245003 523694000 521211014
1064.6 521211014 518639984 516413994 514303017 512201996 510186005 507683983 504892998 502778015
1072.4 502778015 500755005 498432007 495926018 492593002 489309006 486880989 484948997 482929993
1080.1D82929993k887001k973976k230034k127991k350006k397995k485008k917977
1087.8D62560005l396988l306007k866020k327996k304000k816010k695999k442970
1095.5D40404015k486000k186013k232017k896996l090973k958030k996979k447014
1103.2D19109993j657982j943016k481995k629013l071975k926026l185997m008980
1110.9C97205009l627014l497009l718986l614007l386001l161011k882995k283974
1118.6C71034012k311020k700996k425004j865005j571999j614990j893997j828995
1126.4C54822006j607017j436997p51991L26996J216011J236992J189003K055015K715988
1135C59766006L287011L458976K924004L549004M323997L941994L754997M210014M254990
$$ plain form
1080.1 482929993 480042992 477069016 474838982 472710991 470360985 467962990 465477982 462560005
1087.8 462560005 459163017 455857010 452990990 450662994 448358994 445542984 442846985 440404015
1095.5 440404015 437918015 435732002 433499985 430602989 427512016 424553986 421557007 419109993
1103.2 419109993 417452011 415508995 413027000 410397987 407326012 404399986 401213989 397205009
1110.9 397205009 393577995 390080986 386362000 382747993 379361992 376200981 373317986 371034012
1118.6 371034012 368722992 366021996 363596992 361731987 360159988 358544998 356651001 354822006
1126.4 354822006 353214989 351777992 351026001 351352997 352569008 353806000 354995003 357050018 359766006
1135 359766006 363053017 366511993 369435997 372985001 377308998 381250992 385005989 389216003 393470993
1143.7C93470993L638992L250008L284988L221016K919007K411003K072983K462997
1151.4D16731987K760010K036018J763992K152977J944008J842995J714020J412010
1159.1D32358017J828995K285995K506981K607994K572022K764015L075981L396988
1166.9D53396988L637009L830986L790016L757019L930969M193001M493027M755973
1174.6D85784988M776001M262009L909988M036026M093972L856010L945007M042016
1182.3E18706017L512992L197976K961998K616004K562027K638970K342033J584969
1190E40122986J214027J294976J231002J123009J227989J187020J236000J423988J505013
1198.7E51566010J846008J675987J273003J345977J369019J730995J966019J375999
$$ plain form
1143.7 393470993 397109985 400359993 403644981 406865997 409785004 412196007 414268990 416731987
1151.4 416731987 419491997 421528015 423292007 425444984 427388992 429231987 430946007 432358017
1159.1 432358017 434187012 436473007 438979988 441587982 444160004 446924019 450000000 453396988
1166.9 453396988 457033997 460864983 464654999 468412018 472342987 476535988 481029015 485784988
1174.6 485784988 490560989 494822998 498732986 502769012 506862984 510718994 514664001 518706017
1182.3 518706017 522219009 525416985 528378983 530994987 533557014 536195984 538538017 540122986
1190 540122986 541337013 542631989 543862991 544986000 546213989 547401009 548637009 550060997 551566010
1198.7 551566010 553412018 555088005 556361008 557706985 559076004 560806999 562773018 564149017
1206.4E64149017Q09975O78024Q64983J353989J419029J224975J258011Q95996P13005
1215.1E73367004Q80013Q64983J040000J151009Q14972N19028P60994R24987N76020
1223.8E80899010O15997J035996O59980J70021N97992P67021P96967J195030P94983
1232.4E87532997L35007L83987M78020O62994N37987N08003N31998M48990O02035O00968
1242.1E92622986P64999Q25997K61001K77024P69004N36995K84004N60990P21016N95970
1251.7E98219986M12025L77007N72967N31006L57018L46985M55017N61981L17993L93028
1261.4F02545013P37000M71992L12996O67992O80008M52003N45998O17981L93028L47977
1271F07771988L30009J64986M94003Q13027N17006M10995M40979P2022K71988R90982
$$ plain form
1206.4 564149017 564958992 565637016 566501999 567855988 569275017 570499992 571758003 572653999 573367004
1215.1 573367004 574247017 575112000 576152000 577303009 578117981 578637009 579398003 580322990 580899010
1223.8 580899010 581515007 582551003 583210983 583381004 583978996 584746017 585542984 586738014 587532997
1232.4 587532997 587868004 588251991 588730011 589393005 589930992 590438995 590970993 591419983 592022018 592622986
1242.1 592622986 593387985 594213982 594474983 594752007 595521011 596058006 596342010 596903000 597624016 598219986
1251.7 598219986 598632011 599009018 599581985 600112991 600470009 600816994 601272011 601833992 602151985 602545013
1261.4 602545013 603282013 603754005 604067001 604734993 605415001 605867004 606413002 607030983 607424011 607771988
1271 607771988 608101997 608266983 608760986 609574013 610091019 610502014 610942993 611015015 611287003 612277985
1280.7F12277985R34028L54004J42975K17018K98996N66979Q23020N46990L97987M11034
1290.3F16971016J72996M19007O84967N73997M96025L54004J72997J58005K68974M41017
1299.9F20713005M85001M68979K71034o1035J17035M70962O32019M07982O7024m1008
1309.6F23530998P9994M71993O99997M82025J72997J48010J75972L63998L39012K45018
1319.2F26710014M32968L59002M89998O78024L68004J17988L87993O09017M96978K00997
1328.9F30850983j20964K64968O37017J92985o9999L0021j41029o1989M10996N41000
1338.5F32533989J05019J49002P95974M27018K70004O01005L28980K8000o5994j26992
1348.2F35046005K13013O13975M61007J96991J25999L34015L40996J18980K69013K47001
$$ plain form
1280.7 612277985 613212013 613566017 613708992 613926010 614225006 614791985 615615005 616161995 616559982 616971016
1290.3 616971016 617144012 617563019 618247986 618821983 619318008 619672012 619845009 620003014 620271988 620713005
1299.9 620713005 621198006 621666985 621938019 621876984 621994019 622464981 623097000 623504982 623572006 623530998
1309.6 623530998 623610992 624082985 624782982 625265007 625438004 625586014 625761986 626125984 626464996 626710014
1319.2 626710014 627142982 627501984 627991982 628670006 629038010 629155998 629543991 630153008 630649986 630850983
1328.9 630850983 630730019 630994987 631632004 631824989 631754990 631785011 631643982 631581993 631992989 632533989
1338.5 632533989 632639008 632788010 633583984 634011002 634281006 634882011 635210991 635238991 635172997 635046005
1348.2 635046005 635259018 635872993 636334000 636530991 636656990 636991005 637332001 637450981 637719994 637966995
1357.8F37966995K59018k3002l90015q0986m91028L98026J554985N63011l54004m72984
1367.4F38930016K03971P94030R7007k95028m5014l83987n73006L40996Q24013J18980
1377.1F40011978n02968l66020k31972m20036j343994k633972k326012J82991K066002
1385.8F34435997J546021J922988K843972J564026L73001J76010M88968l6011j214981
1394.4F42099991N3024J224976M43039j034012r22013J434021J050950K12020K39029
1403.1F44801025m52041l63007J057053R21936L76053R3994l08991n53054J24053J100998
1412.8F46798019R24988J18027o96030q67004J39007p86972q86001K445984J198959
1421.4F48388977k33993j294022k46964J481018P40967J44043J58005q16040r52988
$$ plain form
1357.8 637966995 638226013 638203011 637812996 637732010 637240982 637639008 639193993 639757004 639403000 638930016
1367.4 638930016 639133987 639928017 640025024 639729996 639684982 639300995 638727989 639068985 639892998 640011978
1377.1 640011978 639509010 639142990 638911018 638490982 637146988 634513016 632187004 632369995 634435997
1385.8 634435997 635982018 637905006 640748978 642313004 642686005 642862015 643350983 643314972 642099991
1394.4 642099991 642153015 643377991 643821030 642787018 641865005 643299026 644349976 644561996 644801025
1403.1 644801025 644348984 643985977 645043030 645964966 646341019 646435013 646126022 645572968 645697021 646798019
1412.8 646798019 647723007 647841034 647145004 646278000 646417007 645630035 644744034 647190018 648388977
1421.4 648388977 648154984 646860962 646613998 648095016 648835983 648980026 649138031 648321991 647369003
1430.1F47369003J167984J071015j09024J36032K27966j983948j721038L228988J384049
1438.8F50771027Q3007L3951j71966J41983O80008M38003N42984O5003j796036p59964
1448.5F50028000J601028J280976K77023l12042j29013r003j35956j380005j573028
1457.1F49647980N78994J012040J627960Q72040N07965R95025k62985k011032O24008
1465.8F53591995J281967L86048N53970J190033L35999j865006k614975N72968K704010
1474.5F56137009P86972N1040J589966M02985k74964O028L45001R55963O04019j64032
1484.1F60439987k89001o64978o99997R89990j55029k234955O63986K148972O10046
1492.8F60809021N74951P54013j241989r44977K90985j187973J119995J735993L68957
$$ plain form
1430.1 647369003 648536987 649608002 649498978 649635010 649862976 647879028 646157990 649386978 650771027
1438.8 650771027 650854034 650887985 650716019 650858002 651538010 651976013 652518997 652584000 650787964 650028000
1448.5 650028000 651629028 652910004 653187027 652874985 652745972 652736969 652601013 651221008 649647980
1457.1 649647980 650226974 651239014 652866974 653739014 654246979 655242004 654979019 652967987 653591995
1465.8 653591995 654873962 655260010 655813980 657004013 657340012 655475006 652860031 653432999 656137009
1474.5 656137009 656923981 656975021 658564987 658967972 658693008 658699036 659044037 660000000 660604019 660439987
1484.1 660439987 660150986 659486008 658786011 659776001 659620972 657386017 658050003 660198975 660809021
1492.8 660809021 661383972 662137985 660895996 659951019 660242004 659054031 660174026 661910019 662278976
1501.5F62278976L82004M33045p11060l092956m692994J342011L187942J315995R56039
1510.2F61399002J83029o99005J316986J267014k95029j623001l329010J530991L246994
1518.8F62997971j77994l101959j390000J521988J926956l77960k71988K116013J96991
1527.5F63440018r85031J92031M05961M86984l2959k106018J36032J207962J47018
1536.2F62891998N59998p34024m365998l47976J518020o87027J180039Q96988j26038
1544.9F60785980J898041J143951k38952j171036j882019J099014K100983L98025j829986
1553.6F62304001k510986J381988O81992k584992n288009k190018L254013L999023
1561.3F59047012J996003J147003o30036r69009L72009J16043o13022k467041k67944
$$ plain form
1501.5 662278976 662660980 663094025 662382965 659290009 654597015 655939026 659126968 660442963 661399002
1510.2 661399002 661582031 660883026 662200012 663467026 663171997 661548996 658219986 659750977 662997971
1518.8 662997971 662819977 659718018 658328018 659850006 661776962 661399002 661127014 663243027 663440018
1527.5 663440018 662454987 662647018 663052979 663539963 663507004 661400986 661537018 662744980 662891998
1536.2 662891998 663451996 662717972 658351974 658003998 659522018 658834991 660015030 660912018 660785980
1544.9 660785980 662684021 663827972 663589020 662417984 660535965 661634979 663735962 664133987 662304001
1553.6 662304001 659793015 661175003 661856995 659272003 653983994 651793976 655047989 659047012
1561.3 659047012 661043015 662190018 661559982 660590973 660962982 661079025 660466003 657998962 657731018
1570F57731018K769013L32946q85009n71976p38983k481003m6997K059021l3035q64029
1579.6F57270966n47944k41012j10016K975m87976j053009r60998m58985K9984k75955
1589.2F53168030r36051j180954j072006r11026q34961m63028m99038r63974j350022
1597.9F44956970j415939j072006q11997n63049j309967k075005j618004j479988j282997
1606.6F33328018o19011j030998j972008j967010j826973j422005p99026o54984j496010
1615.3F21539993m405975l611031P54013l1013l04985n69000j655007l130989j793022
1624F06792984O06003L12004o39992j267013l47977m23012n55000j35002M47998L30009
1633.6F05121002k355003l857994J978988J323014J575012J549988J023979L82996
$$ plain form
1570 657731018 660500031 660832977 659947968 659375992 658637009 656156006 656109009 658168030 658134995 657270966
1579.6 657270966 656723022 656482010 656371994 656374969 655886993 654833984 653872986 653414001 653443985 653168030
1589.2 653168030 652231979 651051025 649979019 649067993 648233032 647770004 647270966 646306992 644956970
1597.9 644956970 643541031 642469025 641657028 641093979 639784012 637709007 636091003 634611015 633328018
1606.6 633328018 632709007 631678009 629706001 627738991 625912018 624490013 623690987 623036003 621539993
1615.3 621539993 617134018 613522987 614277000 614245987 613941002 613372002 611716995 608586006 606792984
1624 606792984 607398987 607710991 607070999 605803986 605456009 605032997 604477997 604342995 604790993 605121002
1633.6 605121002 602765999 598908005 600886993 602210007 603785019 605335007 606358986 606741982
1641.3F06741982k58980O26983J462021L64990o5994O95992J371002K887993K688026
1650F16514015J492996j153030m585991L237991M339028K822990K116013K155990J740990
1658.7F28680992J376000J343002k7008j021004K490006L031005J654015J180992M42009
1667.4F39150009j337013L6011L175010J534958J928025J769027o40030k377014L179016
1676F46417999L350983J417007K40021p29980R63974J903000k49024m020004l00980
1684.7F48992996N428009K045975M37012O74972R58023J177979J476059N83954L70025
1693.4F62145004j92032k425003K28043L104019J227951j375961n576019N111999M075012
1702.1F66323013J021958o38962p94983q67004P92007K366943R69010l18985L7994
$$ plain form
1641.3 606741982 606483002 607109985 608572006 608936996 608871002 609566994 610937996 613825989 616514015
1650 616514015 618007011 616853981 612267990 615505981 619845009 622667999 624784012 626940002 628680992
1658.7 628680992 630056992 631399994 631372986 630351982 632841988 635872993 637527008 638708000 639150009
1667.4 639150009 637812996 637849007 641024017 642558975 644487000 646256027 645615997 643238983 646417999
1676 646417999 649768982 651185989 651426010 650696030 651660004 653563004 653313980 649293976 648992996
1684.7 648992996 654421005 656466980 656903992 657578964 658536987 659714966 661191025 661774979 662145004
1693.4 662145004 661952972 659527969 659756012 662860031 664087982 662712021 657136002 662248001 666323013
1702.1 666323013 667344971 666706009 665911026 665044022 665836029 668202972 669171982 668852997 668890991
1710.8F68890991O35987K47039m94003n78003J323013K35978l545990o49033L585052
1719.4F69651031K071000R71985j26038p93991k12021J93024N41000J077042O37970
1728.1F74011002j070023j420975Q67996O77033j314011l598022J673965K842026P05032
1736.8F73374023M03977n39017j371994J690979J201019j208953j005021J194992R88999
1745.5F74729004Q011o07987p12051M65012p14951j309052K553025J543960J65024
1754.2F76119995k14004j570969o35986J609954J081009L41034j271057j638946R70993
1762.8F74792023Q86993N58014Q86002k50016k388992j86005J778946l86963j843032
1771.5F73846970n27954J840972L34015p15027O32019J155015M82025k43073j054993
$$ plain form
1710.8 668890991 669526978 669774017 669280014 668702011 670025024 670261002 666715012 666065979 669651031
1719.4 669651031 671722031 672694016 672567978 671773987 671561966 671754990 672295990 673373032 674011002
1728.1 674011002 672940979 671520004 672388000 673065033 671751022 668153000 669826965 672668991 673374023
1736.8 673374023 673778000 673238983 671866989 673557968 674758987 673550034 672545013 673740005 674729004
1745.5 674729004 674737015 674129028 673416977 673881989 673167038 671857986 674411011 675954971 676119995
1754.2 676119995 675905991 674335022 673699036 675308990 676389999 676731033 675459976 673821030 674792023
1762.8 674792023 675679016 676237030 677123032 676873016 674484024 674298019 676076965 675690002 673846970
1771.5 673846970 673319016 675159988 675494003 674778976 675410995 676566010 677048035 676804962 675749969
1780.2F75749969n92956P74994R36966L7002m58984J13983O8054N7984N01022O7978
1789.8F77256012p16019j532974j247024J422042Q28934j36948O06995P76978o23017
1798.5F76634979j524963J70975M68978J05057R23996M01001m13055k78931j32065
1807.2F76355972L07999L85055o43997o29043L03039K42005K75955M23050J18942l18985
1816.8F76819992l98025o8970j8006J55030M41971L38974k20948j533050r81980J329041
1826.5F75864029J050949n33981j816025P019J062012J77002N00030P66983P4005p22046
1836.1F76429977p26013O9046L67966K74048K62985J62964j082993k670974L95965
1844.8F73482971K291031M90036l85055l2959J01013j55030j77993J77002K61993J7014
$$ plain form
1780.2 675749969 675157013 675932007 676868973 676905975 676446991 676560974 676629028 676687012 677188034 677256012
1789.8 677256012 676539993 675007019 673759995 675182037 676010971 675874023 676481018 677257996 676634979
1798.5 676634979 675110016 675280991 675749969 675855026 676779022 677180023 676766968 676488037 676355972
1807.2 676355972 676663971 677049026 676405029 675775986 676079025 676321030 676596985 677020035 677138977 676819992
1816.8 676819992 676421967 676352997 676334991 676490021 676931992 677270966 677050018 675516968 674534988 675864029
1826.5 675864029 676914978 676380997 674564972 674571991 675634003 675811005 676311035 677078018 677152023 676429977
1836.1 676429977 675703964 675773010 676140976 676415024 676678009 676840973 675757980 673087006 673482971
1844.8 673482971 675774002 676264038 675878983 675846024 675947037 675792007 675614014 675791016 676053009 676070023
1854.4F76070023k74048o38962k06986N37949M64020j2970j99051k28958j15051J10015
1864.1F75505981J49003Q010m35028j133957j100006O15998J269989O89010N7984m08020
1873.7F75218964n78995l29971J94015L16010K11944m8981k89993k59018j23977O1035
1883.4F74371033J53961J29013j69983l89023n94024p37992M88053J036987J71966
1892.1F74459991m10003q22983p81021M75006J138000M72031m08020o52008l21960
1900.7F73149033J6937J57013K05993L1052l64990n91049l15018J33057J43966J93024
1910.4F72759018k3041m65011j44959L33023M88968L95966p70951j212997J24969J95999
1920F71680984R3995k23999j80970M23966j45950k42005K18964K75039J69983j30996
$$ plain form
1854.4 676070023 675795975 675157013 674950027 675487976 675951996 675939026 675739975 675511017 675395966 675505981
1864.1 675505981 675654984 675662994 675227966 674094009 672994003 673610001 674879990 675569000 675626984 675218964
1873.7 675218964 674639969 674309998 674504013 674820023 675031967 674982986 674692993 674433975 674309998 674371033
1883.4 674371033 674524994 674654007 674484024 674095001 673500977 672762985 673251038 674288025 674459991
1892.1 674459991 674049988 673227005 672445984 672920990 674058990 674531021 674123001 673470993 673149033
1900.7 673149033 673165970 673322983 673528976 673560028 673195038 672603989 672288971 672422028 672565994 672759018
1910.4 672759018 672735977 672270966 672126007 672459030 672947998 673343964 672573013 671360016 671484985 671680984
1920 671680984 671774979 671550980 671370010 671793976 671648026 671406021 671624985 671900024 672070007 671939011
1929.7F71939011m81034n79986j67008L31040L26996J06964k98996o54984m21982L7003
1939.3F70137024M47998n035p45011q3999M2038k24991J49994J92947P4997q8959l99017
1949.9F69497986n99976j76010N20020M46014j7013l12043n59005l31955J30004K92969
1959.6F68890991J29013l46985l42025O5002M7989p6981k79998l19977J91955Q3008
1969.2F68041992m19998j48010K98996J80053j45034l95966l95050L4027J30005L1967
1978.8F67212982J95008j51978l52020k73972L967K72980k975j35956m85001n31006
1988.5F65752029K00959K67028l23028p2022Q7052n82047m13971J57013L45002L46984
1998.1F65764999L0976l84980m18014j44959J70975L08991M6997l68958m64020k79007
$$ plain form
1929.7 671939011 671457977 670877991 670710983 671042023 671369019 671475983 671176987 670522003 670100021 670137024
1939.3 670137024 670585022 670579987 669834976 669750977 669793015 669568024 669718018 669910965 669985962 669897003 669497986
1949.9 669497986 668898010 668722000 669242020 669688034 669671021 669358978 668799973 668468018 668598022 668890991
1959.6 668890991 669020004 668673019 668330994 668395996 668443985 668367004 668087006 667767029 667958984 668041992
1969.2 668041992 667621994 667473984 667772980 667953033 667807999 667412033 667016983 667051010 667181015 667212982
1978.8 667212982 667407990 667256012 666903992 666630020 666633987 666906967 666903992 666768036 666283035 665752029
1988.5 665752029 665952988 666220016 665896988 665824966 665912018 665329971 664916000 665073013 665418015 665764999
1998.1 665764999 665795975 665410995 664992981 664848022 665018997 665327988 665374985 665006027 664542007 664263000
2007.8F64263000J2970L32032L90014p0037n30015m35943k33002k15988o8054K82059
2017.4F63727036N1956j72959J44959j04981l28979J69983K84958j76010m74930k37046
2027.1F62883987K01035L06015J38931m9972l30963n09034l62014j61972J59988J76010
2036.7F62452011j19018k02027j25961M5013J87989k7008n48020m22974l3035N4016
2046.4F61260986K94037K86942J71051J07956j86997m01993p4997L81012K11029j88064
2056F61860962m74930m78058J1063L96957K39029M9973k8992l85971m19998R4986K50015
2066.6F61115036J07956N035m3029J42974J02997p8964J09024L40958L0975n40924
2076.2F61292038m94003O5002K89993J91956J0986l22952m79050m14962n20020m47006
$$ plain form
2007.8 664263000 664275970 664608002 664998016 664927979 664397964 663962021 663729019 663513031 663444977 663727036
2017.4 663727036 663778992 663606033 663750992 663646011 663317032 663487015 663771973 663595963 663121033 662883987
2027.1 662883987 663085022 663391037 663529968 663479996 663149033 662639999 662277985 662116013 662276001 662452011
2036.7 662452011 662332993 662130966 662005005 662050018 662238007 662210999 661662979 661240005 661206970 661260986
2046.4 661260986 661555023 661841965 662013016 662120972 661933975 661531982 661456985 661837997 662049026 661860962
2056 661860962 661386032 660907974 660919037 661315994 661555023 661604996 661576004 661190033 660770035 660865021 661115036
2066.6 661115036 661222992 661228027 661184998 661327972 661430969 661352005 661461029 661801987 661832962 661292038
2076.2 661292038 660798035 660863037 661153030 661344986 661355972 661033020 660553970 660139008 659618988 659171982
2085.9F59171982k26975o16989j167984j627044j751023j634979j507950j324005j203003
2094.6F48112030p98035m93011j92948J76926J52054k46048m22974l33023j99966Q4000
2104.2F45839005k5025l17001n43976o09970n82047p56988m27017n2948k19040q3008
2113.9F42221985K31018K67029L38974L40957M73023K98996j97983L57971P46002L82004
2123.5F45459976N04990O31027K90985j8005l0976J01014J33972J96991M48990K01034
2133.1F47919998k86026k79007j37939J77994K56958j76011j90963r3003k22015p2022
2142.8F46897964J74027J27029j56021j11007L6010J8006K16980N1040l63998k46048
2152.4F46643982p7972n4017J91040J32981k56043k18963J22986K79006K18964J34049
$$ plain form
2085.9 659171982 658945007 658328018 657160034 655532990 653781967 652146988 650639038 649315033 648112030
2094.6 648112030 647313995 646820984 646628036 646804962 646957016 646710968 646287994 645954971 645755005 645839005
2104.2 645839005 645813980 645496979 644953003 644343033 643760986 643003998 642576981 642524033 642304993 642221985
2113.9 642221985 642453003 642720032 643059006 643399963 643872986 644171982 643973999 644331970 645077972 645459976
2123.5 645459976 645964966 646595993 646886978 646868973 646837997 646939011 647072983 647269974 647718964 647919998
2133.1 647919998 647633972 647354965 647217026 647395020 647651978 647475967 647285004 647192001 646969986 646897964
2142.8 646897964 647071991 647199020 647042999 646931992 646968002 646986008 647202988 647254028 646890030 646643982
2152.4 646643982 646566010 646511993 646703033 646836014 646579971 646361008 646483994 646763000 646981964 647116013
2162.1F47116013J54953J33056k36053l05939%m29001j576004j099014P43027Q25958
2171.7F45326996K41012r8037k05994J53046q9035k14005k56958o10046m12979N035
2181.4F43839035j39999m22058l10975M960o3935l0060L77045q6975o29044j10015
2191F42427979N18035N50995M96979N26047K80990Q0948L07007M11987m959R92K98004
2201.6F45895004O0959n7983J35040J8997r2010J9989j31989k77023l24020m06952
2211.3F44840012p9041j5945m85001l83987j27030j75018k00958j62049m2953p4997
2220.9F43093033l82004l91006l5019j86997l87039q5983K64053J4954m47007l26995
2230.5F41129990K5024L5019j67007q6060j57929n21011l35045R2049n2033p9994K47994
$$ plain form
2162.1 647116013 647270966 647404022 647167969 646862030 646862030 646433029 644857025 643758011 644501038 645326996
2171.7 645326996 645568008 645469971 645263977 645417023 645327988 645113983 644857025 644246979 643834000 643839035
2181.4 643839035 643699036 643276978 642966003 642970963 642907028 642876968 643254013 643167038 642537994 642427979
2191 642427979 642946014 643497009 643993988 644520035 644801025 644881973 645188980 645600967 645596008 645597000 645895004
2201.6 645895004 645955963 645897980 646033020 646052017 645960007 645979996 645848007 645570984 645246964 644840012
2211.3 644840012 644760971 644745026 644260025 643876038 643749008 643573990 643373032 643210983 643168030 643093033
2220.9 643093033 642711029 642320023 642285004 642098007 641710968 641624985 641889038 641903992 641456985 641129990
2230.5 641129990 641155014 641190033 641023026 640936966 640779037 640258026 639922981 640015030 639962997 639883003 640130997
2241.2F40130997J03988l61976m27017j62011r91Q010k01988l68004r3002K975j23977
2251.8F38507004j36986j34010J11007J77002k13012l59002j01013Q8005j23977j34011
2261.4F37681007R5978J3008R3994r3994l91006r8992q1977k71035Q4000L73001J35002
2272F37538986r1972j79024l28979j93024J21002K65999K23999l22990n91011j43967
2281.7F36299019L04985m997m60015o1989l2005k88009l71972j45034M17022p0991
2291.3F35586014o89011l17993m005q3008j72997j66015Q5029j74026m89998n7984
2300.9F33516006L37983K88009n5999M6997l7995j58005j04980J30997K22969K15034
2310.6F34401016L54996j00021l30010n1994J81007j12991j62010j07994j78986j85013
$$ plain form
2241.2 640130997 640234985 639873009 639445992 639283981 639282990 639291000 639089012 638721008 638628006 638630981 638507004
2251.8 638507004 638370018 638236008 638347015 638524017 638311005 637952003 637850990 637938995 637815018 637681007
2261.4 637681007 637776985 637789993 637883987 637789993 637398987 637299995 637218018 636946983 637030983 637403984 637538986
2272 637538986 637447014 637267990 636939011 636745987 636866989 637132988 637356987 637033997 636442986 636299019
2281.7 636299019 636604004 636599007 636138992 636077003 636044998 635756989 635385017 635239983 635657005 635586014
2291.3 635586014 634897003 634579010 634575005 634491997 634319000 634152985 634238014 634063988 633573990 633516006
2300.9 633516006 633853989 634141998 634085999 634132996 634095001 633936996 633832016 633963013 634185982 634401016
2310.6 634401016 634756012 634655991 634325981 634273987 634454994 634342003 634179993 634071999 633893013 633708000
2320.2F33708000o0005j68991j02997K66991Q9988p4996n1995r0980R0980M50020j93024
2330.8F33862991q50982l2997K57988l63007k53983r5024p5989J07995K65007P31010
2340.5F33553009P51991l44009n79987l8986j00021k80991j67007k51007o13976m39033
2350.1F31489983j08986K00004Q86002K89993k33002N41001k02980r92012j30005M50020
2359.8F32190018Q6975N3024o1035o97975m61006j3009j60980m36020K56005R84993
2369.4F31740990J35002l86009m93966q48007l19023K88010o4011j21002K91023j6022
2379.1F30206985m55970l97034j87988k14005n1002K7008l93982m35028n6000J12000
2388.7F28154984O5002K8000o7978j54991k77024l36990j12991M2000p1030l10974
$$ plain form
2320.2 633708000 633647995 633479004 633376007 633642998 633732986 633657990 633605995 633515015 633605995 634056015 633862991
2330.8 633862991 633012009 632979012 633237000 632873993 632620010 632524986 632448997 632556992 632821999 633553009
2340.5 633553009 634305000 633960991 633381004 633342018 633241997 632961006 632793999 632542992 631929016 631489983
2350.1 631489983 631380997 631581001 632467003 632756996 632523994 633064995 632862015 631870003 631739998 632190018
2359.8 632190018 632276993 632330017 632268982 631571007 631110001 631096992 630936012 630499992 630755997 631740990
2369.4 631740990 631875992 631489983 630996017 630148010 629828987 630116997 630052986 629931984 630223007 630206985
2379.1 630206985 629751015 629353981 629165993 628951988 628900986 628927994 628534012 628098984 628042984 628154984
2388.7 628154984 628219986 628247986 628180008 628025017 627747993 627411003 627298012 627340012 627268982 626958008
2398.3F26958008j37024J69029p019l2005O5002k86979k98005J42975K6016j17988
2408F26482010n0011j91002j9989l5019l41987j54000J07003K81982P4997n61981m09012
2418.6F25182991o9008k22969P4997K14005k53029n45998n5008L50037j62010l52021
2428.2F24161987j5983j00022m55970j07994J59988k71988j62010K20985p2975k98004
2437.9F23058014k30026k25983l7003J3009j24016k55013j85966j10016j83983j2016
2447.5F21707001J16005k09999m19999q2016J63994%Q0033k6017k20985N4970O2027
2458.1F21225014r1019k99988p13005n39017j0986M2992K98004L15018k55013m01993
2467.8F19570007j84021j63994k09007r5978q4991P0000N4969l31001m01001j84974
$$ plain form
2398.3 626958008 626820984 626990013 626982994 626950989 627015991 626729012 626431007 626573982 626599998 626482010
2408 626482010 626431999 626240997 626221008 626185989 625844002 625690002 625797005 626078987 626153984 625592003 625182991
2418.6 625182991 625113983 624891014 624966011 625180016 624926987 624380989 624325981 624676018 624514008 624161987
2428.2 624161987 624146004 624045982 623590012 623482018 623642006 623370018 623208008 623428993 623356018 623058014
2437.9 623058014 622827988 622602005 622565002 622578011 622453995 622198982 622013016 621903000 621719017 621707001
2447.5 621707001 621823006 621613007 621193008 621110992 621274986 621274986 621355019 621329002 621108017 621162987 621225014
2458.1 621225014 621133995 620834007 620121002 619581985 619570999 619613991 619911995 620227013 619972000 619570007
2467.8 619570007 619385986 619221992 619012985 618917007 618832016 618902016 618956985 618625984 618224983 618040009
2477.4F18040009J9989o0997l40004l13988J8005J70975p2975j50032J35002j56975
2487.1F17289009o43005k62986M6998o4011J23978J34010l18985n38025l17993o0005
2496.7F15388985O027j6022J82991L12004k57988q08983k27012K61001j30996j86005
2506.3F14524002j85013j81999K1019j4000j44997m47998k65998J47972j17989k14004
2516F13120995M997M4021l013j57013l08991p5988J46980m2000j24969j86005p4005
2526.6F12345009l9025l43971l47023p4997k48985l54004j40991l48015j39008L6011
2536.2F10345001m005N0010k08015N9013K23008k17019l86009k94990r2011M6005k87971
2546.9F09233017m31023k21977r9029J27029J12991M3984m8981l07007l13988j83029
$$ plain form
2477.4 618040009 618059998 617999001 617658997 617345009 617363014 617533989 617461014 617310982 617445984 617289009
2487.1 617289009 616646004 616383018 616430016 616366005 616489983 616623993 616305008 615766983 615448990 615388985
2496.7 615388985 615395012 615378990 615561981 615873985 615615997 614807014 614580002 614841003 614710007 614524002
2506.3 614524002 614338989 614156990 614178009 614164009 614019012 613571014 613305016 613452988 613334999 613120995
2516 613120995 613125992 613170013 613167000 613009987 612700996 612625008 612771988 612729988 612605019 612419014 612345009
2526.6 612345009 612305984 611962013 611614990 611539993 611291008 610937004 610796013 610447998 610308990 610345001
2536.2 610345001 610340996 610391006 610182991 610242004 610465012 610247993 609861984 609566994 609474983 609520988 609233017
2546.9 609233017 608801994 608580017 608480988 608608017 608721008 608764992 608716011 608409004 608095016 607911987
2556.5F07911987q6975J6976J94015k10991n68008j07994R7999n0010j72005l65982
2566.1F06659012l30010p019J11008n8975k28005l68995l14026k3003J09024k5024
2575.8F05523987k28005j17988J87988p0991l14980j51024m72984m65012L7995K72026
2585.4F04201012P2975j91994m8981k89001k65999J02997j04027k78969j47018L2997
2595.1F03083992k02980m61998n9013K67982j14975n85022l54996n2986j17988j47019
2604.7F01254997k75993q4992L18985K3003n18990l35006L00979K27013l55988m47998
2614.4F00106010l82003l76015j46980K6970P3013K022r0027J25999J76010j78985
2624E99336014l21999k85034l10974j77994k2011k18010k80990n1003j06010k89002
$$ plain form
2556.5 607911987 607825012 607841988 608036003 607825012 607257004 607149010 607247009 607196999 607024994 606659012
2566.1 606659012 606329002 606321983 606432991 606374016 606146011 605777016 605462990 605439987 605549011 605523987
2575.8 605523987 605295982 605177994 605365982 605294991 604980011 604828987 604356003 603890991 603928986 604201012
2585.4 604201012 604273987 604081993 604033012 603744011 603478012 603581009 603476982 603198013 603050995 603083992
2595.1 603083992 602881012 602419014 602360001 602627983 602513008 601927986 601572990 601520004 601402016 601254997
2604.7 601254997 600979004 600894012 601212997 601236000 600717010 600382004 600682983 600909996 600554008 600106010
2614.4 600106010 599724007 599347992 599201012 599227982 599300995 599303017 599212990 599338989 599514999 599336014
2624 599336014 599014015 598728981 598418007 598240013 598218002 597999992 597719002 597667999 597561989 597272987
2633.6E97272987j93977K975n6991k34985j15014J72997k5978k48032j25999k50969
2643.3E96197014l40004j04027n7983q8005o9008j30997j58005m18968k93007J19972
2652.9E94656982n1994q5983O9008k65007m28009j08986o7024l48969q8005J8005m17022
2663.5E92882996k14997q8997j86996N6991J2017k46010k19002m2991j7014j36986
2673.2E91799011j35002M4975j83982l77999r1019L4028k83013l99017n4970j62010
2682.8E90191002k61994n3024k8000j04980j35002j30005k19994j58005j4991j47019
2692.5E88937988k15988k1019k11983k44979K8991p2021j97983l13988l01018q5983
2702.1E87302017p6027k52990k33994R9983R0027l44009l26004j14022j66969k04010
$$ plain form
2633.6 597272987 597079010 597081985 597024994 596790009 596674995 596847992 596822014 596573982 596447983 596197014
2643.3 596197014 595857010 595752983 595695000 595606995 595537987 595406990 595248985 594830017 594537010 594656982
2652.9 594656982 594604988 594519005 594588013 594323006 593894997 593786011 593718987 593370018 593282013 593300018 592882996
2663.5 592882996 592667999 592579002 592392006 592448997 592461014 592215004 591996002 591953011 591935997 591799011
2673.2 591799011 591664009 591708984 591525002 591147003 591055984 591090012 590806999 590407982 590353012 590191002
2682.8 590191002 589929008 589875984 589847984 589743004 589608002 589477997 589258003 589099998 589085007 588937988
2692.5 588937988 588722000 588700981 588488998 588244019 588273010 588200989 588003006 587689018 587388000 587302017
2702.1 587302017 587225990 586973000 586739006 586838989 586929016 586585007 586259003 586144981 585978012 585774002
2711.8E85774002k03018n1994J18026j11999j64032r1973m18014m66995l78990k16027
2721.4E83788986J06011R7999l08990m05007J17989K31018n6992l49998o22025k93998
2731E82304993K19993K44026P0992k65007n08995j68991K34985l1013m96979q3008
2740.7E81520996K13013j11008Tl51982l77006J20010j25007p00989l67012J53007
2750.3E79863014J45989K6016j50032j94969k11029j36986o5003k14004k43988l03002
2760E78516006k29988j34010k05994k6016K6016j23024l32985l71017J06010l7002
2769.6E77187996l65982j04027J8997J24016j75018m65966k51998k20032j69983n2986
2779.3E75525017o1035k48986m21981l6011J72004j86996l29018j36985L7002p7019
$$ plain form
2711.8 585774002 585570984 585518990 585637016 585525017 585360985 585269012 584850998 584384003 584005013 583788986
2721.4 583788986 583894997 583992996 583684006 583278999 583396988 583628006 583571014 583221016 582598991 582304993
2731 582304993 582524986 582769012 582840004 582574997 582066002 581897011 582131996 582100983 581604004 581520996
2740.7 581520996 581734009 581623001 581511993 581160011 580783005 580903015 580778008 580077019 579710007 579863014
2750.3 579863014 580009003 580035019 579884987 579690018 579478989 579342003 579277000 579062996 578819008 578516006
2760 578516006 578286018 578152008 577946014 577919998 577946014 577822990 577490005 577118988 577224998 577187996
2769.6 577187996 576822014 576717987 576736984 576861000 576685982 576220016 575968018 575747986 575578003 575525017
2779.3 575525017 575463982 575214996 574793015 574757004 574929008 574742012 574412994 574276009 574313011 574235992
2788.9E74235992l05976k05002j70021n73998n31998J59989L26004k75002l23982l2997
2798.5E72303009n1002r92j61019k65007j37977k07024m22974l60031P019j983j51024
2809.2E70550995j44997k99988k63023J58997K04010l93982n12009j73988o9008k75002
2818.8E68782005n50995k17018L07007L6011m36020m1008K95029k63024o43005j95999
2828.4E67072983K17018j78986o15997k96021K8992J15013N5008j47018k32010l84979
2838.1E65634003m06990l15018k75002k33993j77002l18985o17027n25971n09033l72963
2847.7E61882019O1989j26000m13017m76990o15997k55012K42004k3994n9014J81008
2857.4E60396996K87017L5973p52983m05998L73993J21994k53983j58997J0987o1989
$$ plain form
2788.9 574235992 573930016 573725014 573554993 572980995 572448997 572608986 572934990 572659988 572336006 572303009
2798.5 572303009 572252007 572251015 572089996 571824989 571687012 571479988 571057014 570696983 570704002 570702019 570550995
2809.2 570550995 570405998 570106010 569842987 570001984 570205994 569812012 569300003 569126015 569057007 568782005
2818.8 568782005 568231010 568013992 568320999 568357010 567920990 567879982 568175011 567911987 567268982 567072983
2828.4 567072983 567290001 567111015 566495018 566198997 566227989 566343002 566398010 566250992 566018982 565634003
2838.1 565634003 565227013 564911995 564636993 564403000 564225998 563907013 563289986 562764015 562254982 561882019
2847.7 561882019 561944008 561818008 561404991 560928001 560312004 560056992 560298996 560275002 560215988 560396996
2857.4 560396996 560684013 560719986 559967003 559561005 559934998 560056992 559803009 559644012 559654999 559593010
2867E59593010j75018j91002j74980k54021l21999j61972o5002k08016k27012j08986
2876.7E57705002k01988k04010k29988k65999o8016j22986l12004j16005R3994k10991
2886.3E56067009n52025n22995k81982K0981k976l49007k08015Q6021j95007m59022
2895.9E53602982l61977m2992O7978o5994j91002k71988j90010k94990p9003J63002
2905.6E52336006n04989q10013m46015o5994L12996M4022n80025r86977p68013n7983
2915.2E48473015j25008j82991L1967m78973n67017l26004l40004k56004R4032L41988
2924.9E46665001j82991m65012k72979L7994M6005L0976J89018k51999j51024K51007
2934.5E45895996M6005l45001l04985K44980J12991k64969o9999n0011k35023k40975
$$ plain form
2867 559593010 559417992 559226990 559052010 558797989 558475990 558314018 558249016 558041000 557813988 557705002
2876.7 557705002 557503014 557299004 557069016 556803017 556735001 556612015 556300011 556184006 556278000 556067009
2886.3 556067009 555514984 554991989 554710007 554730988 554728012 554379005 554170990 554257011 554062004 553602982
2895.9 553602982 553241005 553198013 553265991 553199997 553008995 552737007 552546997 552252007 552173004 552336006
2905.6 552336006 551831017 551021004 550574989 550508995 550821991 550866013 550285988 549299011 548530998 548473015
2915.2 548473015 548348007 548165016 548196983 547718010 547150993 546824989 546484985 546228981 546323013 546665001
2924.9 546665001 546482010 546016998 545744019 545782013 545828018 545858994 546048012 545796013 545644989 545895996
2934.5 545895996 545942001 545597000 545292015 545536995 545649986 545385017 545315018 545265007 545029984 544789009
2944.2E44789009k51007L7994J39008j61018J27029j5030p18994l03001Q4991l34969
2953.8E43394012l95011k93999J983K70005K8991l88984l22991O981l05977l30009
2963.5E41665001o8016j83983p0992K8000k23007j08986J84975m4975m0017J95008
2973.1E41333008j32027m87976j94015N1002k26974n00031k10991Q8005j53999o5003
2982.7E39500999N9014q5030q4991l07007n94978p9995K94991j31989n75027o03981
2992.4E37392006R994o1988j76011Q5984m66995l91999J02005l48015n38978k09999
3002E35396004l6011L17993J30005o71997m58984J13983j68000j07002K0027m81033
3011.7E34054985o71997l15971m8027j4000k05002l55988M1008J77002l48015p55005
$$ plain form
2944.2 544789009 544538002 544575996 544715004 544553986 544681015 544665985 543946991 543643990 543728981 543394012
2953.8 543394012 542999001 542705002 542706985 542976990 543005981 542616997 542294006 542300987 541995010 541665001
2963.5 541665001 541596985 541413002 541342010 541370010 541147003 541038017 541222992 541178017 541138000 541333008
2973.1 541333008 541200981 540713005 540518990 540569992 540343018 539842987 539631996 539720001 539566002 539500999
2982.7 539500999 539560013 539474983 539389992 539082985 538488007 538408012 538703003 538571014 537995987 537392006
2992.4 537392006 537402000 537340012 537164001 537249985 536782990 536390991 536492996 536144981 535606003 535396004
3002 535396004 535359993 535677986 535807991 535135994 534677010 534790993 534622993 534515991 534536018 534054985
3011.7 534054985 533382988 533067017 533018990 533004990 532799988 532444000 532485008 532662010 532313995 531558990
3021.3E31558990m22973J4000r3003j30004k04010n73006m07982R92q3008k09007j75972
3031.9E29275017k84004l23029j08986K3995J52015n4016p50999n28984K5978l40996
3041.6E27085991l82004M6005j6975l59001m58031m38995k84996m998o1988m17023
3051.2E24707985l82996j46980o0005j98021o05965j58005K70005j66016n09987m49028
3060.9E22300987M997r9983m39987m21028o92978m98009K18010P0992k41013j38969
3070.5E20063019m88014o86989l43018j78985l29018k93007M6997p7972m56009k40021
3080.1E17016983k50969p02019k58979O7977n23986m10004J07002k07023m40979j33019
3089.8E14264984l13988n51986k07024o5002m29001o17981k01988R5977q6975j72004
$$ plain form
3021.3 531558990 531136017 531150017 531057014 530927010 530723000 530149994 529742012 529743004 529659996 529450989 529275017
3031.9 529275017 528991013 528667984 528558998 528582993 528735008 528680992 527929993 527401009 527426987 527085991
3041.6 527085991 526703987 526749992 526733017 526374016 525915985 525476990 525191994 525186996 525125008 524707985
3051.2 524707985 524324989 524178009 524118004 523919983 523314018 523156013 523426018 523260002 522750015 522300987
3060.9 522300987 522305984 522206001 521766014 521344986 520652008 520153999 520372009 520443001 520201988 520063019
3070.5 520063019 519575005 518888016 518544998 518366013 518036995 517743988 517790985 517713013 517257004 517016983
3080.1 517016983 516766014 516063995 515805016 515872993 515349007 514939003 515046005 514838982 514398003 514264984
3089.8 514264984 513950996 513399010 513191986 513126984 512697983 512080002 511878014 511973991 511887016 511715012
3099.4E11715012l72010n84984o34002n15022l69988m50020k3994K38991l75977m92020
3109.1E08135986k89993l42979k20032n39971n19027j40000L1014L5019p96013r32999
3118.7E04421005k38991j2016J16997J8005m49981n96009o01997r84001m52004K11983
3128.4E01432991m30984k07024J57013m15993l82995l34015m89998m19998j3009r4985
3138D98801003p83997r24988o80008m83017l0975N4970o26984n73997k08016l97987
3147.6D94146004l08991k65007n55992n20019k42005j87988m47006m52004l23982o51016
3157.3D90191994p32994k69013j44005m96978o47011m44985j47018j64986o38008q78982
3166.9D85628014o11000l12005m80995q55026m38995M005k78015m44984o42014o11000
$$ plain form
3099.4 511715012 511343002 510758018 510124016 509608994 509239006 508788986 508764992 509003983 508628006 508135986
3109.1 508135986 507845993 507503014 507282982 506743011 506223984 506083984 506114998 506150017 505354004 504421005
3118.7 504421005 504182014 504169998 504286995 504305000 503855019 503259010 502657013 501673012 501221008 501432991
3128.4 501432991 501002007 500794983 500951996 500536003 500153008 499818993 499328995 498908997 498895988 498801003
3138 498801003 498017006 497092018 496412010 495928993 495898018 495952988 495326004 494752007 494543991 494146004
3147.6 494146004 493837013 493572006 493016014 492495995 492253990 492066002 491618996 491166992 490843010 490191994
3157.3 490191994 489459000 489189987 489045982 488549004 487901993 487457008 487309990 487145004 486506996 485628014
3166.9 485628014 485017014 484705009 484224014 483368988 482929993 482933998 482655983 482210999 481568985 480957985
3176.6D80957985j10970j53999q20999q93021j60980k91023o34995j29013l52974q92029
3186.2D76517982o62994m13971o91032j026993p79991k99988l56026q42971o47011
3194.9D70797005j2017k61993m93011n41001r37996r16977o80008m11987Q8997j28021
3204.5D66502991q68988n36995n43022r37004m93966k65007l17001n11017o60972o32019
3214.2D60737000p97005j265984j065025m6997J14021m64020p33986o75010o81992
3222.9D55121002q28018o16989k20986k09007l45001n02014p76978q28018o64978o64024
3232.5D49464989m75006j05973m36020o94007n43976o64025q31985m66995j34011m08973
3242.2D44704018l51029m24995p67975n07011j19019l80974q16002m89006L7995o39000
$$ plain form
3176.6 480957985 480847015 480693016 479872017 478978996 478818016 478526993 477891998 477762985 477410011 476517982
3186.2 476517982 475854988 475441017 474749985 473722992 472943001 472643013 472286987 471444016 470797005
3194.9 470797005 470784988 470522995 470029984 469488983 468550987 467634010 466954002 466542015 466631012 466502991
3204.5 466502991 465634003 465097008 464553986 463616982 463123016 462858009 462541008 462029991 461369019 460737000
3214.2 460737000 459939995 458674011 457608986 457561989 457676010 457211990 456478004 455802994 455121002
3222.9 455121002 454292984 453675995 453455009 453246002 452901001 452398987 451622009 450793991 450129013 449464989
3232.5 449464989 448989983 448884010 448447990 447753983 447210007 446545982 445713997 445247002 445112991 444704018
3242.2 444704018 444352989 443927994 443160019 442653008 442533989 442153015 441337013 440848007 440886002 440247002
3251.8D40247002j449013o15997j5984l87001m22020r01985j128006p23992l73992
3260.5D34229012j6022k59972m64020k86979j74027l59001m25987n30014o52008l32985
3270.1D30727997m24004m20990j06010k84004p06978p45011m86984l94020l49998m88015
3279.8D26321983n65986m20990p22008q95996m05007k85987n76020n79986p51000p75985
3289.4D20343018l98026l02010o09970n50003n1002o11000j449013o67992m5013o37970
3299D15021019o03027m76990o11000m75998p92008q61015o32973n94024m71993q17985
3308.7D08684006j180992r30024m72984n34019o57006n23986j091004j247978q03032
3317.4D01242981j61972J23978n94979j052017j422005j344986n60989l20015m47998
$$ plain form
3251.8 440247002 438797989 438181992 438166008 437779007 437356987 436455002 435326996 434603004 434229012
3260.5 434229012 434212990 433953018 433488998 433202019 433027992 432668991 432243004 431712990 431060982 430727997
3270.1 430727997 430303993 429883003 429776993 429492989 428786011 428041000 427554016 427159996 426809998 426321983
3279.8 426321983 425755997 425335007 424612999 423717003 423311996 423026009 422449989 421870003 421119003 420343018
3289.4 420343018 419944992 419642982 419033012 418483009 418432007 417821007 416371994 415704002 415658989 415021019
3299 415021019 414417992 413941002 413330002 412854004 412061996 411200981 410568008 409973984 409501991 408684006
3308.7 408684006 407503014 406572990 406100006 405565987 404908981 404384995 403293991 402046013 401242981
3317.4 401242981 401081009 401204987 400610008 399557991 398135986 396791000 396230011 395909996 395461998
3326.1C95461998o12984j205024j437989r56001o00014m75998r42993j077995o85997
3334.7C87467003j099014j268998p25975l15017p04003j205978j052017n39017n34973
3343.4C80022011j328011j077003p73010j171990r45015j057968j309013r62983q10012
3352.1C70587006p65992j152000q90999l51028q75969q15010q39005j358986j392021
3360.8C62145996j214981r82018q02001j058007q90007m09965q59032r87968r02024
3369.4C54039993j149978p83005o13022o55975r32007j541023r98001m40979r65996
3378.1C45960007q52013j82991n36995j206016j112976p19033o33964p34024r47991
3386.8C39034004q16002q62007j314010j054993m87976k85034l81966l49007q90999
$$ plain form
3326.1 395461998 394849014 393643990 392206001 391250000 390649986 390173988 389230995 388153000 387467003
3334.7 387467003 386367989 385098991 384373016 384057999 383353996 382148018 381096001 380556984 380022011
3343.4 380022011 378694000 377616997 376843987 375671997 374726982 373669014 372360001 371397018 370587006
3352.1 370587006 369821014 368669014 367778015 367426987 366551018 365736008 364897003 363538017 362145996
3360.8 362145996 360931015 359948997 359146996 358088989 357198982 356789017 355929985 354942017 354039993
3369.4 354039993 352890015 352107010 351493988 350838013 349906006 348364983 347366982 346926003 345960007
3378.1 345960007 345107994 344925003 344388008 343181992 342069016 341349983 340716019 339981995 339034004
3386.8 339034004 338218002 337355995 336041985 334986992 334499016 334213982 333832016 333483009 332592010
3395.5C32592010j207008m01001k61001q52013j156006r54971j88027j21994p51991
3404.2C26697998o86989o34994r09005p97004n15022m07982m15993l30010j90010q11004
3413.8C20999985j091976l10002l44009q58994n92003j8005j09005m86984o89011o55002
3423.5C15844994k38991n06001p81002m14009j13983m33006q18997J24989N30014n67017
3433.1C12626991p49988k77005m31003M2000L97014o62002q03013r003K06013K84004
3442.7C10624008m07009n89008j62983l72009q6995K21997K96993o7997m87995q8997
3452.4C08880005R1991k07004J91002O92997j20983m91009k28005m43992j16005M94995
3462C08743992L06015k3003L66001N45998l0003k40993J40991J23005j23997R6989
$$ plain form
3395.5 332592010 331385002 330984001 330723000 329870987 328714981 327760010 327571983 327449989 326697998
3404.2 326697998 326011009 325376015 324467010 323670006 323154984 322747002 322331009 322000999 321810989 320999985
3413.8 320999985 319908009 319598007 319253998 318395004 317803001 317784996 317675991 317189007 316499996 315844994
3423.5 315844994 315606003 315100002 314319000 313904991 313791008 313358002 312539005 312663994 313194008 312626991
3433.1 312626991 311877003 311599998 311168995 311210995 311608009 310946007 310142994 310133991 310340004 310624008
3442.7 310624008 310216999 309627991 309465008 309092999 309006004 309228001 309524994 309456997 308969002 308880005
3452.4 308880005 308971996 308764992 308955994 309648991 309528008 309036999 308808994 308365002 308248997 308743992
3462 308743992 309050007 309027004 309393005 309939003 309909000 309668007 309808998 309932003 309808006 309904995
3471.7C09904995L56998Q7014m5014j6002K6016N57995N52005M55990O43997j72996
3481.3C12350998q62007K52018N92994n98011K61002J102009K54001R5997P0000K84996
3491C13803997O20003N36995N24006K19993j11999L05004O75010O25000L89996j08013
3500.6C17479992j45989K23999Q72002R16996j8005k01988k1000Q0986O71005J028004
3510.2C20886002P45010P1983L77999R73014Q95005N70984j984k8000J17989N22995
3519.9C25130997N97000J89018M17976K88010J21994M28009L45001Q43010J069985
3528.6C29431000O06003M66995L92990O48994O57006L17001J63994k8992J61019R58976
3538.2C33774986Q41027L12995O95992O20003l24021m29000J028022J436005J194992
$$ plain form
3471.7 309904995 310261993 310349007 310303993 310287991 310314007 310872002 311424007 311879997 312523994 312350998
3481.3 312350998 311488991 311741009 312334003 311735992 311996994 313099003 313353004 313449001 313519001 313803997
3491 313803997 314424000 314960995 315485001 315704994 315592995 315897999 316573009 317198009 317588005 317479992
3500.6 317479992 317334003 317558002 318430004 319347000 319328995 319127007 319106007 319186993 319857998 320886002
3510.2 320886002 321631012 321702995 322080994 323054008 323949013 324519997 324518013 324490013 324608002 325130997
3519.9 325130997 325727997 325917015 326334991 326623001 326744995 327173004 327518005 328361015 329431000
3528.6 329431000 330037003 330503998 330896988 331545982 332202988 332519989 332683983 332654991 332816010 333774986
3538.2 333774986 334616013 334929008 335625000 336245003 335920982 335491982 336520004 337956009 339151001
3546.9C39151001J018982L19023N22003J04981j33972Q05969J147995J124000M18015
3555.6C44477997J02005J077003Q34008M39987N53016J29967K65999R6016m3984O45981
3565.2C48577995J566010J515007J784973R09996k71988N22003Q20008N68008M43001
3573.9C56435013P14989P41004O39992P89986O01005J054001R41010L3989O01997J576004
3583.5C64128990K16026j028022P88002J138992P94029K120972Q34999Q6021J63994
3592.2C69244003Q07991K61002O61011K362976P05032K89993R15985L63007J044998
3600.9C76655998R89990N39017J255989N22995o01005L21998Q09021P06978L034020
3609.6C84235001K50015j861000J487999K104988J68991M01001m01001P26013J282997
$$ plain form
3546.9 339151001 340169983 340489006 341011009 341115990 340982018 341787987 342935982 344059982 344477997
3555.6 344477997 344580002 345657005 346491013 346931000 347484016 347613983 347879982 347975998 347932014 348577995
3565.2 348577995 350144005 351659012 353443985 354353981 354081993 354603996 355424004 355992012 356435013
3573.9 356435013 357150002 357891006 358530998 359320984 359921989 360975990 361917000 361950989 362552986 364128990
3583.5 364128990 364345016 363316994 364104996 365243988 366038017 368158989 368993988 369080009 369244003
3592.2 369244003 370051994 370312996 370974007 373336983 374042015 374332008 375247993 375611000 376655998
3600.9 376655998 377645988 378185005 379440994 379963989 379362984 379684982 380494003 381200981 384235001
3609.6 384235001 384485016 382624016 384112015 386217003 386385994 386786995 386385994 387112007 388395004
3618.3C88395004J026001K920990P98989q4992Q62999L15018m29001K30980l55988
3626.9C93680000j474991K799988N811997K37007j288986j019020J147995K290000
3634.6D02183990K21024l12996N28984Q31986P99026N60990J1978R76028J074982o45981
3644.3D06230011j921997j296997K418976J626014j201019k75993L633003L041000
3652D12252998q06999r71985j618004O12984M378014q80013j533012O05011Q11996
3660.7D12850990N54009L54004M7989J25007P8011p87010j587983k76031L61023J924972
3670.3D13644981M331017j726990l623009l214988J823005Q169976j054001l144989
3678D15205002j024018J340027M95987j08986L9978j81007j49994n45997k332993j926994
$$ plain form
3618.3 388395004 389421005 392341995 393140984 393055992 393918991 394234009 393805008 394035988 393680000
3626.9 393680000 392205009 395004997 400816994 401054001 399765015 398745995 399893990 402183990
3634.6 402183990 402405014 402092018 402621002 403452988 404252014 404813004 404824982 405801010 406875992 406230011
3644.3 406230011 404308014 403011017 405429993 407056007 405854988 405578995 409211998 412252998
3652 412252998 411445999 410474014 408856010 409468994 413847008 412966995 411433983 412038994 412850990
3660.7 412850990 413404999 413759003 413806992 413931999 414010010 413223000 411635017 411358986 411720009 413644981
3670.3 413644981 417975998 416249008 412625999 409411011 411234016 419403992 418349991 415205002
3678 415205002 414180984 415521011 416016998 415908012 415947990 415766983 415616989 415070992 412737999 410811005
3687.7D10811005M892006J009979j451988L319015l15018k211990J39008L10974o46973
3696.4D15856018k27013N03998L1014j714020j118012K178002P27005k52991J29013
3705D16113014j35002l65028j878968l47023J553994k479973J161995N583000k227020
3713.7D16978989j523972O17981n19981j390000j42021J493988j035995j725998J449012
3722.4D14202003M94004j399002m04015J130028J416969p08999j066971q76007j557007
3731.1D11231003K188988Q01010l955994k17018L175011P78999n04990j016006j255989
3739.8D11225014L36990R47991l744011l672982J1086998K580986o083984l572006
3747.5D09104996k762986L222008J097985l720017M323998K988014k710991j991005
$$ plain form
3687.7 410811005 415703011 416712990 415261002 418580017 418264999 416053009 416192017 416502991 415856018
3696.4 415856018 415629005 416133003 416164017 414449997 413331985 415509987 416236992 415984001 416113014
3705 416113014 415978012 415612984 413734016 413386993 414940987 412461014 413623009 419206009 416978989
3713.7 416978989 415455017 416072998 415553017 414163017 414020996 415514984 414478989 412752991 414202003
3722.4 414202003 414696007 413297005 412892990 414023018 415439987 414730988 413664017 412788010 411231003
3731.1 411231003 413419991 414221001 410265007 410047989 413223000 414001999 413497009 412481003 411225014
3739.8 411225014 411562004 412509995 408765984 405093002 416180000 418760986 412677002 409104996
3747.5 409104996 406342010 409564018 410662003 406941986 411265984 414253998 411543007 409552002
3755.2D09552002K6016J468964j699982j253013L328018R37996j441994r88007j487007
3763.9D08442993j282005J869011J473999j935005k196999J500015K844010j628037
3771.6D09087982r62982M05006j52015l14980l76015n31997j474991K34985K588005
3780.3D08502998l73993j482009j093979n60036R75037P86972l84980n73005p69005
3788.9D05028000n91011M41017P09000m6006m69017j455001j613999J786003J795998
3797.6D05584984j281967l226014l338012M029999M922027j473999j758003k625008
3805.3D00834007q84018O038018R97009l052025j571999p76977o82030l94974j459007
3814C99048004k658005K802010M738998j910019k950973l233032J466026O921997q00018
$$ plain form
3755.2 409552002 409578018 411046982 409347000 408093987 411422005 412360001 410918007 409930000 408442993
3763.9 408442993 407160988 409029999 410503998 408568993 406371994 407872009 410716019 409087982
3771.6 409087982 408125000 408530006 408377991 408063011 407686996 407154999 405680008 405914993 408502998
3780.3 408502998 408129005 406646996 405553017 404992981 405968018 406754990 406370010 405797005 405028000
3788.9 405028000 404436989 404878006 405587006 405541000 405071983 403616982 402002983 403788986 405584984
3797.6 405584984 404303017 401077003 397738991 401768990 406691017 405217018 403459015 400834007
3805.3 400834007 399949989 405988007 406985016 403932991 402360992 401584015 400901985 400507011 399048004
3814 399048004 396389999 399192009 403931007 402020988 399070015 395836983 397303009 404225006 403424988
3822.7D03424988k505989j234017r82971J044006J638985j072006j930008k020988
3830.4C96362000J026000K604981k598991k322007K108002o96983j343003M822998
3838.1C99962997m70008j996003J609002j324997j837998J226998Q6021p88994k35023
3846.8C96231995j082993m89998m38003k332993j084022j003991K28997J0553016l044014
3855.5C97537994m164009J044998L60032j332016j254998M37012K055969j685981k374993
3864.2C90624008L643990J791992k789993k830010k206993L818016L270989k887001
3871.9C92434998l363991j67008L848000K42996p83005j91002k436981k297020K910996
3880.6C90197983J654014j631012j267967k092018J791000N424996k173004k369004
$$ plain form
3822.7 403424988 400918999 399684982 398702011 399746017 401385002 400312996 398382988 396362000
3830.4 396362000 397388000 399992981 397393990 395071983 397179985 396483002 395139999 399962997
3838.1 399962997 399492989 397496986 399105988 397780991 395942993 397169991 397256012 396467018 396231995
3846.8 396231995 395149002 394659004 394221001 391888008 390803986 389799995 390028992 400582008 397537994
3855.5 397537994 393373985 394418983 394779015 393446999 392192001 392629013 394684982 392999001 390624008
3864.2 390624008 394267998 396059990 393269997 390439987 388232994 392051010 395321999 392434998
3871.9 392434998 389071007 388903999 392751999 392994995 392211990 392020988 389584007 387286987 390197983
3880.6 390197983 391851997 390220985 388953018 386861000 388652000 394076996 391903992 389534988
3888.3C89534988j395988k295990R14001L029976o87980n44014J63994r65004j550980
3896.9C86203003j459007J035995K040024k430000q56018J05018m47998K116966k27966
3905.6C86080017n60036M59023N7983j35002K55013L85017K59972k75994j615982k077026
3915.3C82832985L8032K751999m27017k196998P12013J016998j403007j645012K77023
3924C81957016K147980Q26988j117973r46999J60980L94020j728019j026001J854019
3932.6C82522011j05019j312980j02005J31988k14996n6000L82004k92015j232987
3941.3C79720001j26991J137009j21003q04023j060982o36025L72010K12021P18994
3950C79411011P92007j84021m99000l68996k11983l67012q011J22986m51965m12026
$$ plain form
3888.3 389534988 388139000 385843010 386757011 389786987 389099007 388554993 388718987 387753983 386203003
3896.9 386203003 384743996 385779991 387820015 385390015 384533997 384639015 384191017 386307983 386080017
3905.6 386080017 385519981 385979004 386036987 385901985 386156998 386542015 386801987 386525993 384910011 382832985
3915.3 382832985 382871017 385623016 385195999 382999001 383711014 384728012 383325005 381679993 381957016
3924 381957016 384104996 384931984 383814011 382867012 383027992 383422012 381693993 380667992 382522011
3932.6 382522011 382416992 381104012 381002007 381133995 380918999 380862999 381245003 380952988 379720001
3941.3 379720001 379593010 380730019 380609016 379804993 378744011 378107986 378479996 378692017 379411011
3950 379411011 380203018 380018997 379519997 379151001 378939018 378572006 378563995 378686981 378235016 377822990
3959.6C77822990k05001K89001L54004j54991j16005n72014o15997J3008j97983j61018
3969.3C76455994R7999l97987L7002R04999m46014j666985l63006O38008O981p34978
3978.9C74532013n45998M66004M08973m90989o07987j46026O8016j8006k28004m20990
3988.6C73017006M44984N13001o30989m61006m25988o52008K28997N65986k29988q25004
3998.2C71544991m61007K63024
4000.1C71347008
$$ plain form
3959.6 377822990 377617989 377906990 378260994 378106003 377989998 377417984 376801987 376814995 376617012 376455994
3969.3 376455994 376553993 376156006 376193008 377098007 376651993 374985008 374622002 375260010 375266991 374532013
3978.9 374532013 373986015 374452019 374860992 374370003 373762016 373615990 373684006 373666000 373437996 373017006
3988.6 373017006 373461990 373974991 373344002 372882996 372457008 371805000 372033997 372599983 372369995 371544991
3998.2 371544991 371083984 371347008
4000.1 371347008
##END=$$ End of the data block
