##TITLE=SM_10_1qaB $$ Begin of the data block
##JCAMP-DX=5.00 $$ ACD/SpecManager v 10.08
##SPECTROMETER/DATA SYSTEM=Alpha
##DATE=22 Aug 2014 09:29:00
##DATA TYPE=INFRARED SPECTRUM
##DATA CLASS=XYDATA
##ORIGIN=
##OWNER=
##NPOINTS=1765
##FIRSTX=399.76428223
##LASTX=3997.64306641
##MAXX=3997.64306641
##MINX=399.76428223
##MAXY=0.81760770
##MINY=0.39647403
##XFACTOR=1.0000000000
##YFACTOR=1.000000000000000e-9
##FIRSTY=0.79312551
##DELTAX=2.03961372
##XUNITS=1/CM
##YUNITS=ARBITRARY UNITS
##XYDATA=(X++(Y..Y))
399.8G93125510k555370J538515K218485j796901k803803J073778K196848j003623
$$ 793125510 790570140 792108655 794327140 792530239 789726436 790800214 792997062 791993439
416.1G91993439k252042O60717J208246k284944l126562N51224J830936j539409k849579
$$ 791993439 789741397 790402114 791610360 789325416 786198854 786750078 788581014 787041605 784192026
434.4G84192026M25100J714885j624346l124058L15249K091825j030564k590418P26581
$$ 784192026 784617126 786332011 784707665 781583607 781898856 783990681 782960117 780369699 781096280
452.8G81096280K770960m53532k972662J03235K423763n70893l060162j33276K499700
$$ 781096280 783867240 783413708 780441046 780544281 782968044 782397151 779336989 779203713 781703413
471.2G81703413m09782l187716m33684K540052L22521k623975n36979K600968P65741
$$ 781703413 781293631 778105915 777672231 780212283 780534804 777910829 777373850 779974818 780740559
489.5G80740559k389491m61220L093302J435816k267897j073479K385497J149118k443850
$$ 780740559 778351068 777889848 780983150 782418966 780151069 779077590 781463087 782612205 780168355
507.9G80168355j618863J914502J335561k288282k056599J632154J772464j710177
$$ 780168355 778549492 780463994 781799555 779511273 777454674 779086828 780859292 779149115
524.2G79149115k234936R90868J650333j382529k257765Q02398K068102q60154k353549
$$ 779149115 776914179 777905047 779555380 778172851 775915086 776717484 778785586 777925432 775571883
542.5G75571883M60028K233863l57270k497017m00544J762808j45138k364099n83887
$$ 775571883 776031911 778265774 777908504 775411487 775010943 776773751 776628613 774264514 773680627
560.9G73680627J826227L42667k293467j241684J395523N84364k171039j738310R62674
$$ 773680627 775506854 775849521 773556054 772314370 773709893 774294257 772123218 770384908 771347582
579.3G71347582O76275k015829k043844M74632P28250j898766k547145J07885J171469
$$ 771347582 772023857 770008028 767964184 768438816 769167066 767268300 764721155 764829040 766000509
597.6G66000509j160741k305626J4007J624226k21193j845061j85669J479805k27273
$$ 766000509 764839768 762534142 762548149 764172375 763951182 762106121 761920452 763400257 763172984
616G63172984k139270l01719K313554J427114q91447j28388K262413J654447r44138
$$ 763172984 761033714 760731995 763045549 764472663 763581216 763452828 765715241 767369688 766425550
634.3G66425550p82013J771092J907289o30974j118362J281321K081573j81914j187980
$$ 766425550 765643537 767414629 769321918 768690944 767572582 768853903 770935476 770753562 769565582
652.7G69565582J071275K357363K10524j301646N86688J744151r51051k522290J575887
$$ 769565582 770636857 772994220 773204744 771903098 772489786 774233937 773282886 770760596 772336483
671G72336483L248453J189590j224578k36511K220154J558304r63867o59525J821458
$$ 772336483 775584936 776774526 775549948 775313437 777533591 779091895 778128028 777468503 779289961
689.4G79289961J783073p19905j023114J456559K078771l30030j281918R65298K215743
$$ 779289961 781073034 780353129 779330015 780786574 782865345 782535315 781253397 782218695 784434438
707.7G84434438J24871j385688N16832K245426N73158j349330J04964K193749J104653
$$ 784434438 784559309 783173621 783690453 785935879 786509037 785159707 785264671 787458420 788563073
726.1G88563073j065851k95937J931370J365721j000047q48472J480520J684725n86152
$$ 788563073 787497222 787201285 789132655 790498376 789498329 788649857 790130377 791815102 791228950
744.5G91228950j077950J115620J900494o8307j029908P87198J995325L07560j218021
$$ 791228950 790151000 791266620 793167114 793098807 792068899 792856097 794851422 795158982 793940961
762.8G93940961J91391J795053M88460j300215k62201J602709Q25286j139879o13332
$$ 793940961 794132352 795927405 796415865 795115650 794853449 796456158 797281444 796141565 795528233
781.2G95528233J586199J578867m81188o45041J503706K101421K17736n18978J260579
$$ 795528233 797114432 798693299 798212111 797567070 799070776 801172197 801389933 800870955 802131534
799.5H02131534K206862N23448p23899P12216K108574Q39949p88153K09153J990736
$$ 802131534 804338396 804861844 804137945 804850161 806958735 807798684 807010531 807219684 809210420
817.9H09210420J241564o37233j40011J719832J389146n99682p11978J145661J485586
$$ 809210420 810451984 809814751 809674740 811394572 812783718 812184036 811472058 812617719 814103305
836.2H14103305l32355q68201R53316J792670R7930j034737L85762J592993L05355
$$ 814103305 813770950 812902749 813856065 815648735 815746665 814711928 815097690 816690683 816996038
854.6H16996038j111984j09852J371384M62115j297116q01683Q36432M20809j340926
$$ 816996038 815884054 815774202 817145586 817607701 816310585 815508902 816345334 816766143 815425217
873H15425217j141131P79152J015783p31230j121104N50628J139760l84033j138330
$$ 815425217 814284086 815063238 816079021 815347791 814226687 814777315 815917075 815533042 814394712
891.3H14394712K65062J179457j81973j413703l97801P88510k26975j740575j130402
$$ 814394712 814659774 815839231 815657258 814243555 813845754 814634264 814407289 812666714 811536312
909.7H11536312L14891j78575j746476j515627R6143J92105j246750j385152J46031
$$ 811536312 811851203 811672628 809926152 808410525 808506668 808698773 807452023 806066871 806212902
928H06212902N61237q35538j379907M113R18031p7427r07302J62602J305759N24819
$$ 806212902 806774139 805938601 804558694 804562807 805480838 805403411 804496109 804658711 805964470 806489289
948.4H06489289o55055q9765J052261M79579r80556q74281L62515K86043j041115j262366
$$ 806489289 805834234 805744469 806796730 807276309 806295753 805421472 805783987 806070030 805028915 803766549
968.8H03766549j04130J68503j047373j567006m43220L16679n52058j350522n95927
$$ 803766549 803662419 803830922 802783549 801216543 800773323 801090002 800537944 799187422 798591495
987.2G98591495K32577n26488j624823j270711l77238q58903k135813k169788j255035
$$ 798591495 798824072 798297584 796672761 795402050 795024812 794165909 792030096 789860308 788605273
1005.5G88605273j436472k734482l288210k780735k615333k813637j808465M50373
$$ 788605273 787168801 784434319 781146109 778365374 775750041 772936404 771127939 771578312
1021.8G71578312J886249J399993M73142O09517R39608J16527j006782r09150j97112
$$ 771578312 773464561 774864554 775337696 775947213 776886821 777003348 775996566 775087416 774890304
1040.2G74890304m49181j362383j421690o96421o89447j514852j586199n92053j39415
$$ 774890304 774441123 773078740 771657050 770960629 770271182 768756330 767170131 766578078 766438663
1058.6G66438663q77738j371980o67810R4890j72853n94080m7683P09057M26411l30448
$$ 766438663 765560925 764188945 763521135 763616025 763443172 762849092 762801409 763510466 763936877 763606429
1079G63606429k25007M08470K19584o47188q00311j50025m9293p81000j054346m06742
$$ 763606429 763381422 763789892 764009476 763362288 762561977 762411952 762362659 761581659 760527313 760120571
1099.4G60120571k2471n64635j012385n37395k5630m06206r09269m78983K90036K41578
$$ 760120571 760098100 759533465 758521080 757983685 757958055 757551849 756642580 756163597 756453633 756695211
1119.8G56695211k95818k45094R3877O5327N09381J604974K179087J818299R88126
$$ 756695211 756399393 756154299 756248176 756313503 756822884 758427858 760606945 762425244 763413370
1138.1G63413370O08563J090705J480461J042306N60522Q57353J292169R41277K79188
$$ 763413370 764021933 765112638 766593099 767635405 768195927 769053280 770345449 771286726 771565914
1156.5G71565914L57926Q86202P86960J96993J99736Q22901R79781M67956L00169Q28147
$$ 771565914 771923840 772810042 773597002 773793995 773993731 774816632 775796413 776264369 776564538 777392685
1176.9G77392685J100004O02782K12073N65946Q97169M45903j74523p6294L09825K3246
$$ 777392685 778492689 779095471 779307544 779873490 780770659 781216562 781042039 780965745 781275570 781298816
1197.3G81298816o37412o72936k16842k84493r09269j062572n78821m73082j055777
$$ 781298816 780661404 779988468 779771626 779487133 778577864 777515292 776936471 776463389 775407612
1215.6G75407612j353323q83103n28156r07839j269936q99434l83377n06342q32915
$$ 775407612 774054289 773171186 772643030 771735191 770465255 769565821 769182444 768676102 767843187
1234G67843187n26190O3777M0531l72469k63632L27230M79638O6698N6803P73549J337111
$$ 767843187 767316997 767380774 767421305 767048836 766785204 767112434 767592072 767658770 767715573 768489122 769826233
1256.4G69826233J272023J219273J645267J910329J438379Q77976R65596J209914Q38280
$$ 769826233 771098256 772317529 773962796 775873125 777311504 778189480 779155076 780364990 781203270
1274.8G81203270K51949K67863O05226L99947k41399m18127l1411J14858j33574j8954
$$ 781203270 781455219 781723082 782328308 782728255 782486856 782068729 782037318 782152176 782018602 781999648
1295.2G81999648O50882J005292N78463J34766L09349N19931J33276l39210j96695
$$ 781999648 782650530 783655822 784234285 784369051 784678400 785198331 785331607 784992397 784795702
1313.5G84795702J88171N8592l50952k36631K60830K91288j49906k52068J03534K08258
$$ 784795702 784983873 785042465 784691513 784454882 784715712 785007000 784857094 784605026 784708560 784916818
1333.9G84916818j43945l69310j88172j27256n03421q55208p20322m04775m06861m73917
$$ 784916818 784772873 784403563 784215391 784088135 783584714 782729506 782009184 781604409 781197548 780723631
1354.3G80723631j66416K39313J28031m71235p09474l01897j30534l85941l84450j80542
$$ 780723631 780557215 780796528 780924559 780453324 779743850 779441953 779311419 778925478 778541028 778360486
1374.7G78360486k79725p33077j169503r50396n6744M11273j6928j77145Q8990j50323
$$ 778360486 778080761 777347684 776178181 775227785 775171041 775582314 775565386 775388241 775477231 775326908
1395.1G75326908o45817o40392k76625n3704k44498l35455M828Q2195k72274l11792
$$ 775326908 774681091 774040699 773764074 773710370 773465872 773130417 773135245 773217440 772945166 772633374
1415.5G72633374J3888k26736q23260p75516k31802K97725K02894k44260q7142J93477
$$ 772633374 772647262 772420526 771597266 770821750 770589948 770887673 771090567 770846307 770759165 770952642
1435.9G70952642m26889r78231o63042q3804J56283j34349l02851J08659N65231L15488
$$ 770952642 770525753 769547522 768884480 768800676 768956959 768822610 768519759 768628418 769193649 769509137
1456.3G69509137p75040r43422k15769N4837j00971M05789J325488J400173M69565
$$ 769509137 768734097 767790675 767574906 767629743 767528772 767934561 769260049 770660222 771129787
1474.7G71129787P3016K85446L01779N1856J04189M74035L65794l82960n04076K31921
$$ 771129787 771202803 771488249 771790028 771841884 771946073 772420108 772785902 772402942 771898866 772130787
1495G72130787N53608p0214l51369L49998J182556M48048j013755q12173o1870K54989
$$ 772130787 772684395 772614181 772262812 772612810 773795366 774243414 773229659 772417486 772355616 772610605
1515.4G72610605N7399j0729K3127m19438p79748p78794l30925J28925k13802m97818
$$ 772610605 772668004 772657275 772680402 772260964 771481216 770702422 770371497 770500422 770286620 769788802
1535.8G69788802K36809N61476p07090j481414j168191n87822m35590n50926k87294
$$ 769788802 770025611 770587087 769879997 768398583 767230392 766642570 766206980 765656054 765368760
1554.2G65368760L42428J10030j852929k040327j051485o57857r20593j517773j384676
$$ 765368760 765711188 765821218 763968289 761927962 760876477 760218620 759298027 757780254 756395578
1572.6G56395578r73999j649857k314448j957893j687468j921534k313614k390981
$$ 756395578 755421579 753771722 751457274 749499381 747811913 745890379 743576765 741185784
1588.9G41185784k332985k552331l001809l179788l022552l064453l435493l601134
$$ 741185784 738852799 736300468 733298659 730118871 727096319 724031866 720596373 716995239
1605.2G16995239l447175l503024l724575l494144l232002l558159l255010k541840
$$ 716995239 713548064 710045040 706320465 702826321 699594319 696036160 692781150 690239310
1621.5F90239310k284586k052486j891077j773834q98659M28736R20892L40223N06044
$$ 690239310 687954724 685902238 684011161 682237327 681338668 681767404 682688296 683028519 683534563
1639.9F83534563J477778K371847K984464K826751K570450L635704L816665K055704
$$ 683534563 685012341 687384188 690368652 693195403 695765853 699401557 703218222 705273926
1656.2G05273926K213121L263235L679454L312230L212989L920793L894985K910733
$$ 705273926 707487047 710750282 714429736 717741966 720954955 724875748 728770733 731681466
1672.5G31681466K841771K991497K553284K403737K718031K739549J650512R89973
$$ 731681466 734523237 737514734 740068018 742471755 745189786 747929335 749579847 750569820
1688.8G50569820J073003J475632J980246J740217J152515P95007N06461L72290P3850
$$ 750569820 751642823 753118455 755098701 756838918 757991433 758786440 759292901 759665191 759739041
1707.2G59739041P8261N57900P94828O35564K61605j81079l28481l34084j53602L50774
$$ 759739041 759817302 760375202 761170030 761805594 762067199 761886120 761557639 761223555 761069953 761420727
1727.6G61420727P24494O99342M69327J78039K71856L33012J16348K92301O78897O38366
$$ 761420727 762145221 762844563 763313890 763491929 763763785 764096797 764213145 764505446 765184343 765822709
1748G65822709J60813j29044R3102K01524o9321q5949J19805L3319q4281O5744M01676
$$ 765822709 765983522 765854478 765947580 766149104 766079783 765993834 766113639 766146958 766062677 766128421 766530097
1770.4G66530097K46763m74572o24538j33037J50620j05500l51608j52468K61426K80201
$$ 766530097 766776860 766302288 765677750 765544713 765695333 765589833 765238225 765085757 765347183 765627384
1790.8G65627384k74479n05269r3698P4446k39849l70562p8678P2598j64926l78072
$$ 765627384 765352905 764847636 764753938 764828384 764588535 764217973 764139295 764211893 764046967 763668895
1811.2G63668895k30193k8909j66356l21031q1181K01106K8014k42651k10404j98364
$$ 763668895 763438702 763409793 763243437 762922406 762841225 763042331 763070345 762827694 762617290 762418926
1831.6G62418926l15964l86835k49445P0870K17259j00434m87864l61323j86384l18706
$$ 762418926 762102962 761716127 761466682 761537552 761754811 761654377 761166513 760805190 760618806 760300100
1852G60300100l63469j15276K8193j91211l92855j79350J55330J311m85837m78805
$$ 760300100 759936631 759821355 759849548 759658337 759265482 759086132 759241462 759242773 758756936 758278131
1872.4G58278131j43945j40309l61204l44217j22786p1346k16902k71618j72079j19745
$$ 758278131 758134186 757993877 757632673 757288456 757165670 757094324 756877422 756605804 756433725 756313980
1892.8G56313980k87116m63605l11315r9540j96457l45707k18868n4538j94728m12345
$$ 756313980 756026864 755563259 755251944 755152404 754955947 754610240 754391372 754336834 754142106 753729761
1913.2G53729761l13819q5890j45674l50416l78966k33412j63018l31462m45306k87414
$$ 753729761 753415942 753330052 753184378 752833962 752454996 752221584 752058566 751727104 751281798 750994384
1933.6G50994384j46985k39551l07560j71840j11401k93911m68552l94046j81854j61707
$$ 750994384 750847399 750607848 750300288 750128448 750017047 749723136 749254584 748860538 748678684 748516977
1954G48516977l34263l57032j78993j33752l03626m00544k94506j96517k93731m09663
$$ 748516977 748182714 747825682 747646689 747512937 747209311 746808767 746514261 746317744 746024013 745614350
1974.4G45614350k99573j40011k28167m15981l89993k00808j40727k89976l89755k72930
$$ 745614350 745314777 745174766 744946599 744530618 744140625 743939817 743799090 743509114 743119359 742846429
1994.8G42846429j98662l36468m01199k47240j40309k36631l40164k48968j10388j77920
$$ 742846429 742647767 742311299 741910100 741662860 741522551 741285920 740945756 740696788 740586400 740408480
2015.2G40408480l51608l26335j43111j25229k77341k86460j24454r9540k88963l83079
$$ 740408480 740056872 739730537 739587426 739462197 739184856 738898396 738773942 738674402 738385439 738002360
2035.6G38002360k25246q3149j87277l34919k36571q0168j86622l91483l41475j17958
$$ 738002360 737777114 737693965 737506688 737171769 736935198 736855030 736668408 736276925 735935450 735817492
2056G35817492j04666l02076l20256j14977r4056l25382l97384j85371p0095k31623
$$ 735817492 735712826 735410750 735090494 734975517 734881461 734556079 734158695 733973324 733903229 733671606
2076.4G33671606l38614j91212n5790j82211l71457k97963j12295j72735l26693k32756
$$ 733671606 733332992 733141780 733085990 732903779 732532322 732234359 732122064 731949329 731622636 731389880
2096.8G31389880k9623n3227k71321l27229j26720j9371j68979k60055r1195L4332
$$ 731389880 731360257 731307030 731035709 730708480 730581760 730562389 730393410 730133355 730042160 730076492
2117.1G30076492j52886l47793j97351L5584k6882k10106j59025K5034m0412k97785
$$ 730076492 729923606 729575813 729378462 729414046 729387164 729177058 729018033 729043067 729002655 728704870
2137.5G28704870l15905j01745p5281l18348m55380l38316l41355o88970j012385r80318
$$ 728704870 728388965 728287220 728211939 727893591 727438211 727099895 726758540 726069570 725057185 724076867
2157.9G24076867q27253q23855p40290k73168L36766N88656M74572M08411M55439K96772
$$ 724076867 723249614 722425759 721685469 721412301 721749067 722337723 722812295 723220706 723676145 723972917
2178.3G23972917n2631j87159q702J34170O7353O8069L00943M27068K15888k3782J9013
$$ 723972917 723920286 723733127 723724425 723858595 723925948 723994017 724294960 724722028 724937916 724914134 724933147
2200.8G24933147J28389l5405k81334k30909j3589k7001k37883k59101o7174m3810
$$ 724933147 725061536 725026131 724744797 724513888 724500299 724473298 724235415 723976314 723909140 723865330
2221.2G23865330k54750l26574j29819k5689j84238k71023j10686j0967j93000l74734
$$ 723865330 723610580 723284006 723154187 723128498 722944260 722673237 722562551 722551584 722358584 721983850
2241.6G21983850k60115n7399r9242k74777k49922p3731j04010l33786l60489j36793
$$ 721983850 721723735 721666336 721567094 721292317 721042395 720968664 720864654 720530868 720170379 720033586
2262G20033586m4882k18094l23712j57118l4690j94848l53396k37763l9339q2731l06964
$$ 720033586 719988704 719770610 719446898 719289780 719255090 719060242 718706846 718469083 718429744 718347013 718040049
2284.4G18040049l45051j94907k39075m71055m92096k88844k66314m70221n61833m87268
$$ 718040049 717694998 717500091 717261016 716789961 716297865 716009021 715742707 715272486 714710653 714223385
2304.8G14223385n14388p25925q30472o12676m14252o55830j039445j000703o51240
$$ 714223385 713708997 712983072 712152600 711539924 711125672 710469842 709430397 708429694 707778454
2323.1G07778454n64456q06749q52644m92990k36333l86059n22673l97384k51115R775
$$ 707778454 707213998 706407249 705554605 705061615 704825282 704439223 703916550 703519166 703268051 703277826
2343.5G03277826P49708J032233L5763j404763k156138j845598j142860o04510k49565
$$ 703277826 704027534 705059767 705095530 703690767 701534629 699689031 698546171 697941661 697692096
2361.9F97692096K85030Q98182J154661J137674J197517J324058J246988R87113Q37624
$$ 697692096 697977126 698875308 700029969 701167643 702365160 703689218 704936206 705923319 706760943
2380.2G06760943Q02457O02246J96099q8811p6115l6061j96755l53217k64347r8109
$$ 706760943 707563400 708165646 708361745 708272934 708196819 708160758 707964003 707610786 707346439 707248330
2400.6G07248330j51038l13342k63393r4652j29521l16381l48389j80781r0718k00510
$$ 707248330 707097292 706783950 706520557 706425905 706296384 705980003 705631614 705450833 705360115 705159605
2421G05159605k80321j91033j17421k26736l45648k50279j12653j90258l07381k28763
$$ 705159605 704879284 704688251 704570830 704344094 703998446 703748167 703635514 703445256 703137875 702909112
2441.4G02909112j18077j80304l22878l16918j60098j15097k48968l08097j86562j27018
$$ 702909112 702791035 702610731 702287853 701970935 701810837 701695740 701446772 701138675 700952113 700825095
2461.8G00825095k69592l65138k46226j21356j76072k81930k33411j26720k01285l57628
$$ 700825095 700555503 700190365 699944139 699822783 699646711 699364781 699131370 699004650 698803365 698445737
2482.2F98445737l28064j63257j30057k52128k89678j81616j52349k79367l45051k34366
$$ 698445737 698117673 697954416 697824359 697572231 697282553 697100937 696948588 696669221 696324170 696089804
2502.6F96089804j42574k23816l13222k38001j36555k02417l13640k67803j61827j87039
$$ 696089804 695947230 695723414 695410192 695172191 695035636 694833219 694519579 694251776 694089949 693902910
2523F93902910k84195k71321j79529j87695l00586l35991k30492j52111k15768k84434
$$ 693902910 693618715 693347394 693167865 692980170 692679584 692343593 692113101 691960990 691745222 691460788
2543.4F91460788k39074j98245k61724l12984k49147j73510k03967k77221k55883j81734
$$ 691460788 691221714 691023469 690761745 690448761 690199614 690026104 689822137 689544916 689289033 689107299
2563.8F89107299k04384k98381l23117k38538j56522j94847k81036k61009k00391k56359
$$ 689107299 688902915 688604534 688281417 688042879 687886357 687691510 687410474 687149465 686949074 686692715
2584.2F86692715l44873k92241j71960j71244k55585k80499k38240k39074k97427k96176
$$ 686692715 686347842 686055601 685883641 685712397 685456812 685176313 684938073 684698999 684401572 684105396
2604.6F84105396k29478k14696k77578k95461k22325k00868k92360l52621k87474k09689
$$ 684105396 683875918 683661222 683383644 683088183 682865858 682664990 682372630 682020009 681732535 681522846
2625F81522846k21967k67983k55883k15888k54392l34740l36170k75970k43664k68578
$$ 681522846 681300879 681032896 680777013 680561125 680306733 679971993 679635823 679359853 679116189 678847611
2645.4F78847611k87712k47836k34306l16381l74556k92778j90675k28465l13699k80380
$$ 678847611 678559899 678312063 678077757 677761376 677386820 677094042 676903367 676674902 676361203 676080823
2665.8F76080823k11775k56360l39508l28541k42412k07245k57790l01063k85089k74837
$$ 676080823 675869048 675612688 675273180 674944639 674702227 674494982 674237192 673936129 673651040 673376203
2686.2F73376203l28064l70264l21269k40505k25008k66611k89739k68459k64287l08037
$$ 673376203 673048139 672677875 672356606 672116101 671891093 671624482 671334743 671066284 670801997 670493960
2706.6F70493960l25203k91824k66969k74181k70129k27511k16543k79248l25382l28719
$$ 670493960 670168757 669876933 669609964 669335783 669065654 668838143 668621600 668342352 668016970 667688251
2727F67688251l28243l07203k93433k87354k67804k85506l31402l17752k25306j81734
$$ 667688251 667360008 667052805 666759372 666472018 666204214 665918708 665587306 665269554 665044248 664862514
2747.4F64862514k55347l31223l21388k96474l42965l80993l15070k27153k52306l38853
$$ 664862514 664607167 664275944 663954556 663658082 663315117 662934124 662619054 662391901 662139595 661800742
2767.8F61800742l22759k23458k28345l72946m34816l41833k94626l23534k85506k14517
$$ 661800742 661477983 661254525 661026180 660653234 660218418 659876585 659581959 659258425 658972919 658758402
2788.2F58758402k69652m09305m39345l26992k71737l92497m84526m23550l34502l20315
$$ 658758402 658488750 658079445 657640100 657313108 657041371 656648874 656164348 655740798 655406296 655085981
2808.6F55085981m11570m78864m12941l48091l76403m04358l76642m00603n02884n22793
$$ 655085981 654674411 654195547 653782606 653434515 653058112 652653754 652277112 651876509 651373625 650850832
2828.9F50850832m14311l41833l93331m82142o08444p78616q56280q28862p88212p55131
$$ 650850832 650436521 650094688 649701357 649219215 648610771 647832155 646975875 646147013 645358801 644603670
2849.3F44603670p23243o66916n33224l48329l07203m67836n68211m84646m12822m28974
$$ 644603670 643880427 643213511 642680287 642331958 642024755 641556919 640988708 640504062 640091240 639662266
2869.7F39662266m03285l92795m84526n27680m81784m04001l06725k99096l94702m25756
$$ 639662266 639258981 638866186 638381660 637853980 637372196 636968195 636661470 636362374 635967672 635541916
2890.1F35541916l56138l59595n00142o09756n49793m45306m65632n31673m78626l70919
$$ 635541916 635185778 634826183 634326041 633716285 633166492 632721186 632255554 631723881 631245255 630874336
2910.5F30874336m34280o56247p84695p41422o66797n77390l97444j78933r6620k19047
$$ 630874336 630440056 629783809 628999114 628257692 627590895 627013505 626616061 626437128 626340508 626121461
2930.9F26121461k65896j03533J8537Q166L7253J07050r180l06665m54426l38435k82825
$$ 626121461 625855565 625752032 625770569 625778735 625815988 625923038 625913858 625607193 625152767 624814332 624531507
2953.4F24531507l96072m18961k62559r0718n8353q2851k5868O0499R7394O9320J3530
$$ 624531507 624135435 623716474 623453915 623363197 623304844 623221993 623196125 623256624 623354018 623423338 623436868
2975.8F23436868R597l3081k17319l19242j99139p3433n2512j15454k48790l11076
$$ 623436868 623446465 623413384 623196065 622876823 622677684 622604251 622551739 622436285 622187495 621876419
2996.2F21876419l57390m42684l98635l17932l32772k95401j68502j96815m50730o72162
$$ 621876419 621519029 621076345 620677710 620359778 620027006 619731605 619563103 619366288 618915558 618243396
3016.6F18243396o79135n72681n19872n55039n82993m94122l91781m31836n87642o45697
$$ 618243396 617564261 616991580 616471708 615916669 615333676 614839554 614447773 614015937 613428295 612782598
3037F12782598m84288l94643n28872o65426o98507o64472o48976o58035o17206o30259
$$ 612782598 612298310 611903667 611374795 610709369 610010862 609346390 608697414 608039379 607422173 606791914
3057.4F06791914o94514o37293m97877m51505o19531q29935q09074o28352m55320m09543
$$ 606791914 606097400 605460107 604962230 604510725 603891194 603061259 602252185 601623833 601168513 600758970
3077.8F00758970n78821p71403q41558q73864p94709o81698p42435q21293p56323o54161
$$ 600758970 600180149 599408746 598567188 597693324 596898615 596216917 595474482 594653189 593896866 593242705
3098.2E93242705p03752q88825r01222o65009n64277p53224p98464n77271n22136p23780
$$ 593242705 592538953 591650128 590748906 590083897 589519620 588766396 587967932 587390661 586868525 586144745
3118.6E86144745r72509j111329j026153q49128p89523q23915q33154q06928p54535
$$ 586144745 585172236 584060907 583034754 582185626 581396103 580572188 579739034 578932106 578177571
3136.9E78177571p52628q95857j014293r80973q81970p35104o80387r14752j161158
$$ 578177571 577424943 576529086 575514793 574533820 573651850 572916746 572236359 571321607 570160449
3155.3E70160449j113117r92120r82820j006663j015604j020431j052380j074612j033485
$$ 570160449 569047332 568055212 567072392 566065729 565050125 564029694 562977314 561902702 560869217
3173.6E60869217r88066j016975j105785j151025j111865j098156j156986j186550
$$ 560869217 559881151 558864176 557758391 556607366 555495501 554397345 553240359 552053809
3189.9E52053809j138925j104892j152992j200914j184345j156330j164257j194954
$$ 552053809 550914884 549809992 548657000 547456086 546271741 545115411 543951154 542756200
3206.3E42756200j200676j170218j142264j134812j127601j130521j182378j233995
$$ 542756200 541555524 540385306 539243042 538108230 536980629 535850108 534667730 533433735
3222.6E33433735j221954j146615j048088r78232r91344j132607j222074j145363j059592
$$ 533433735 532211781 531065166 530017078 529038846 528047502 526914895 525692821 524547458 523487866
3240.9E23487866r93431r44554r94444j081407j054347r49085r27984r97842j021802
$$ 523487866 522494435 521549881 520555437 519474030 518419683 517470598 516542614 515544772 514522970
3259.3E14522970r62496r05752q70168p92027p16329q45730j102090j194000j131177
$$ 514522970 513560474 512654722 511784554 510992527 510276198 509430468 508328378 507134378 506003201
3277.7E06003201j067221j059592j084268j094222j065970j018762j059383j198948
$$ 506003201 504935980 503876388 502792120 501697898 500631928 499613166 498553783 497354835
3294D97354835j314550j377434j341104j169205j033366j167953j525760j788586j783162
$$ 497354835 496040285 494662851 493321747 492152542 491119176 489951223 488425463 486636877 484853715
3312.3D84853715j642257j589507j615852j621276j615853j651257j801163j932442
$$ 484853715 483211458 481621951 480006099 478384823 476768970 475117713 473316550 471384108
3328.6D71384108j915574j861423j780063j699686j793653j978934k085656k117038
$$ 471384108 469468534 467607111 465827048 464127362 462333709 460354775 458269119 456152081
3345D56152081j991182j820356j951217k238304k275884k083927j928121j938969j929730
$$ 456152081 454160899 452340543 450389326 448151022 445875138 443791211 441863090 439924121 437994391
3363.3D37994391j741648j642615j862049k162099k169638j920820j735627j685352
$$ 437994391 436252743 434610128 432748079 430585980 428416342 426495522 424759895 423074543
3379.6D23074543j654207j573831j458734j282633j033336j060456j422107j481980
$$ 423074543 421420336 419846505 418387771 417105138 416071802 415011346 413589239 412107259
3395.9D12107259j066029q30978j161725j489967j297027r76085r10908r76801j023561
$$ 412107259 411041230 410210252 409048527 407558560 406261533 405285448 404374540 403397739 402374178
3414.3D02374178r44823p59482o89090p08490n97924l87669k64197k79338k25543q1212
$$ 402374178 401429355 400669873 399980783 399272293 398674369 398286700 398022503 397743165 397517622 397436410
3434.7C97436410j49816l63320l43472j05768J12503J80662J30206J82808L44544M53413
$$ 397436410 397286594 396923274 396579802 396474034 396586537 396767199 396897405 397080213 397424757 397878170
3455.1C97878170N28276O11156N96583O08683Q42958J005739P76172M47720M85182
$$ 397878170 398406446 399017602 399614185 400222868 401065826 402071565 402847737 403295457 403780639
3473.4D03780639P66397R89437R95159Q00878P86364R75966J024515R91225J044959
$$ 403780639 404547036 405536473 406531632 407332510 408118874 409094840 410119355 411110580 412155539
3491.8D12155539J136482J184701J150907J193642J291245J152724R63122J059294
$$ 412155539 413292021 414476722 415627629 416821271 418112516 419265240 420228362 421287656
3508.1D21287656J288920J400143J305163J160890J202852J434982J646876J549601
$$ 421287656 422576576 423976719 425281882 426442772 427645624 429080606 430727482 432277083
3524.4D32277083J317650J323462J431555J483708J592279J639425J568675J667440
$$ 432277083 433594733 434918195 436349750 437833458 439425737 441065162 442633837 444301277
3540.8D44301277J885415J896262J626163J427979J520276J675457J761376J852811
$$ 444301277 446186692 448082954 449709117 451137096 452657372 454332829 456094205 457947016
3557.1D57947016J944065J940876J873940J971305K211183K123892J837880J838147
$$ 457947016 459891081 461831957 463705897 465677202 467888385 470012277 471850157 473688304
3573.4D73688304K050609K196252K250880K295107K314746K309203K258838K131491
$$ 473688304 475738913 477935165 480186045 482481152 484795898 487105101 489363939 491495430
3589.7D91495430K077550K224475K372265K385557K339840K257943K204180K312362
$$ 491495430 493572980 495797455 498169720 500555277 502895117 505153060 507357240 509669602
3606E09669602K533197K532423K382636K299130K229094K369881K438724K065599J842499
$$ 509669602 512202799 514735222 517117858 519416988 521646082 524015963 526454687 528520286 530362785
3624.4E30362785K106488K675712K612829J977742J833260J849532J813829J879036
$$ 530362785 532469273 535144985 537757814 539735556 541568816 543418348 545232177 547111213
3640.7E47111213J885832J831173J990319K238750J783312J033425J039982J391172
$$ 547111213 548997045 550828218 552818537 555057287 556840599 557874024 558914006 560305178
3657E60305178J276493R56416P82192P61747Q79407R91464P68006M95791N69463L56019
$$ 560305178 561581671 562538087 563320279 564082026 564961433 565952897 566720903 567216694 567786157 568142176
3677.4E68142176j3292o735J51813L53395O22511M85659p3373k50817j49250o4075
$$ 568142176 568128884 568122149 568273962 568627357 569249868 569735527 569662154 569411337 569262087 569198012
3697.8E69198012N1380J11937m6194j41501O8069L01361J82747k30371m07815k61188
$$ 569198012 569249392 569361329 569315135 569173634 569241703 569543064 569725811 569495440 569087625 568826437
3718.2E68826437j09315j44541k57373k77579k28762o3956K32815L28064K3961l86297
$$ 568826437 568717122 568572581 568315208 568037629 567808867 567744911 567977726 568305790 568329751 567943454
3738.6E67943454n08011k26438J06931j1325j56700j25945k84135m46797l68595k06113
$$ 567943454 567435443 567209005 567315936 567304611 567147911 567021966 566737831 566291034 565922439 565716326
3759E65716326k34544l22759k41101j36971r3043k06173m16159l83914j07586o974
$$ 565716326 565481782 565159023 564917922 564780951 564687908 564481735 564065576 563681662 563574076 563567102
3779.4E63567102k55227l77000k61962k10464k42770k65836k17200j09195j13011j05560
$$ 563567102 563311875 562934875 562672913 562462449 562219679 561953843 561736643 561627448 561514437 561408877
3799.8E61408877n3286k62022l81291l64065m23849l34144j00910K9743q6189j16408
$$ 561408877 561355591 561093569 560712278 560348213 559924364 559590220 559489310 559519053 559432864 559316456
3820.2E59316456j74641m42148m60207l32713k25663p5758p748j9551j24931l54111
$$ 559316456 559141815 558699667 558239460 557906747 557681084 557605326 557597578 557578027 557453096 557098985
3840.6E57098985m55141m22001m10915l49223j39475J45852J3888m36485m94003l09288
$$ 557098985 556643844 556221843 555810928 555461705 555322230 555468082 555481970 555045485 554551482 554242194
3861E54242194j84834k10524k70247j64032r0778k47479m05431m25934k36810p2717
$$ 554242194 554057360 553846836 553576589 553412557 553321779 553074300 552668869 552242935 552006125 551933408
3881.4E51933408j17660j90675l55423l94463k54929l02196l43740j63972M053L099
$$ 551933408 551815748 551625073 551269650 550875187 550620258 550318062 549974322 549810350 549814403 549817502
3901.8E49817502j65581m25458n27918m02749k71738k27391j68920j49369j99914k30193
$$ 549817502 549651921 549226463 548698545 548295796 548024058 547796667 547627747 547478378 547278464 547048271
3922.1E47048271k37048k23279k23696k14458j90854k58863l05056k25246j44363j74999
$$ 547048271 546811223 546587944 546364248 546149790 545958936 545700073 545395017 545169771 545025408 544850409
3942.5E44850409k77936k88248k38359k39075k22146k01106k39373k56300k01284k10703
$$ 544850409 544572473 544284225 544045866 543806791 543584645 543383539 543144166 542887866 542686582 542475879
3962.9E42475879k81632k46465j76191j87040k08974k12311k32876k32517k02775j90914
$$ 542475879 542194247 541947782 541771591 541584551 541375577 541163266 540930390 540697873 540495098 540304184
3983.3E40304184k05219k02834k00034k39610k42114j93000k14160
$$ 540304184 540098965 539896131 539696097 539456487 539214373 539021373 538807213
3997.6E38807213
$$ 538807213
##END=$$ End of the data block
