##TITLE=SM_10_1qaB $$ Begin of the data block
##JCAMP-DX=5.00 $$ ACD/SpecManager v 10.08
##SPECTROMETER/DATA SYSTEM=Alpha
##DATE=22 Aug 2014 09:29:00
##DATA TYPE=INFRARED SPECTRUM
##DATA CLASS=XYDATA
##ORIGIN=
##OWNER=
##NPOINTS=1765
##FIRSTX=399.76428223
##LASTX=3997.64306641
##MAXX=3997.64306641
##MINX=399.76428223
##MAXY=0.74816114
##MINY=0.23442520
##XFACTOR=1.0000000000
##YFACTOR=1.000000000000000e-9
##FIRSTY=0.74816114
##DELTAX=2.03961372
##XUNITS=1/CM
##YUNITS=ARBITRARY UNITS
##XYDATA=(X++(Y..Y))
399.8G48161137j323759k76268r4593p64906j147926m81844M22061O97493k23815j900077
$$ 748161137 746837378 746561110 746466517 745701611 744553685 744071841 744493902 745191395 744967580 743067503
420.2G43067503j704574o29067n86093r34064j005709r20892p89106o98566o58155
$$ 743067503 741362929 740733862 740147769 739213705 738207996 737287104 736497998 735799432 735141277
438.5G35141277q74042j249612p87198L16560P67231M73619M3392Q7023N03897L94464
$$ 735141277 734267235 733017623 732230425 732546985 733314216 733787835 733831227 733918250 734422147 734816611
458.9G34816611j36197m59909o80864o64711k28286O6221l83556j038551j082480n78702
$$ 734816611 734680414 734220505 733539641 732874930 732646644 732712865 732329309 731290758 730208278 729629576
479.3G29629576l3140L934l05712l45886m4704L78490P54058Q77202O59466M39584
$$ 729629576 729596436 729600370 729294658 728948772 728904068 729282558 730036616 730913818 731573284 732012868
499.7G32012868M77910N08428L39150J0252l72708n94616n19573l38853m47988p63595
$$ 732012868 732490778 732999206 733338356 733348608 732975900 732381284 731861711 731522858 731074870 730311275
520.1G30311275q38876p11322o71506o53565n07832m74452o33479p04109n90742l59714
$$ 730311275 729472399 728761077 728089571 727436006 726928174 726453722 725820243 725116134 724525392 724165678
540.5G24165678k16544l66628p99179j127720r40859n40435n10812r11713j280963
$$ 724165678 723949134 723582506 722783327 721655607 720714748 720174313 719663501 718751788 717470825
558.9G17470825j256883r42648p22825r04799j435697j891077j799166j347601j254499
$$ 717470825 716213942 715271294 714548469 713643670 712207973 710316896 708517730 707170129 705915630
577.2G05915630j724601k222061k189040j755536j404583j284838j416385j598656
$$ 705915630 704191029 701968968 699779928 698024392 696619809 695334971 693918586 692319930
593.5F92319930j343906o77407k32458k71201l49701j38342K36273M01258K0087o13272
$$ 692319930 690976024 690298617 690066159 689794958 689445257 689306915 689543188 689944446 689964533 689351261
613.9F89351261r33051p25031k34366J45734K51591Q3446m8339J73569O49869R14931
$$ 689351261 688418210 687693179 687458813 687604547 687856138 687939584 687891245 688064814 688714683 689629614
634.3F89629614P91490N77331M85778O26802Q94666R26495O69777M25577M34280P01427
$$ 689629614 690421104 690998435 691484213 692111015 693005681 693932176 694601953 695027530 695461810 696163237
654.7F96163237R19223Q90732O46770L71575J07408j92345N79238J529396J032114
$$ 696163237 697082460 697973192 698619962 698991537 699098945 698906600 699485838 701015234 702047348
673.1G02047348M31538M01079O74844P85232M96387J42694J33335M00842O64174O74307
$$ 702047348 702478886 702879965 703554809 704340041 704836428 704979122 705112457 705513299 706177473 706851780
693.5G06851780L36469n6446p6115K58803N05030L84808R4652m9293J15991L87549
$$ 706851780 707188249 707131803 707055688 707314491 707819521 708204329 708298981 708249688 708365679 708753228
713.9G08753228M22657J86026q3447q6426J64806L55959K35379o9916k73407k55704
$$ 708753228 709175885 709361911 709278464 709192038 709356844 709712803 709948182 709878266 709604859 709349155
734.3G09349155j5735J66416J8656k67863l57330j73032R7453K02418N9306k12252
$$ 709349155 709333420 709499836 709518492 709250629 708893299 708720267 708817720 709020138 709079444 708867192
754.7G08867192l30627j00195K28047K32697n5015k94328l44217k08795l7610r7394
$$ 708867192 708536565 708436370 708664417 708897114 708842099 708547771 708203554 707994759 707957149 707859755
775.1G07859755l43681m63664k44499K20716N31257N01573M01139M87924P63654J042962
$$ 707859755 707516074 707052410 706807911 707028627 707559884 708061457 708462596 708950520 709714174 710757136
795.4G10757136J084805Q63492N92292M76598N31912N77927N01633K93433O4135K8610
$$ 710757136 711841941 712705433 713297725 713774323 714306235 714884162 715385795 715679228 715743363 715771973
815.8G15771973J44899K39253K11418Q2016j2636j848J05738K01285J95980J45913
$$ 715771973 715916872 716156125 716367543 716449559 716436923 716435075 716540813 716742098 716938078 717083991
836.2G17083991J11043J45018K65241L38971K40148N3644n6148p0512N305J10030K4855
$$ 717083991 717195034 717340052 717605293 717944264 718184412 718238056 718181908 718111396 718116701 718226731 718251586
858.7G18251586k27749m06623m02987k99096l01004m76897o72996p24733o23464m49300
$$ 718251586 718023837 717617214 717214227 716915131 716614127 716137230 715464234 714739501 714116037 713666737
879.1G13666737l27110l87848n73337o71744n59688l80814l65257n42343p97450r82464
$$ 713666737 713339627 712951779 712378442 711706698 711147010 710766196 710400939 709858596 709061146 708078682
899.5G08078682j013875r86933j104236j430035j722395j733661j559138j428246j432360
$$ 708078682 707064807 706077874 704973638 703543603 701821208 700087547 698528409 697100163 695667803
917.8F95667803j462102j281261q05318k56420N3347L2186j12593p3075K64406O96599
$$ 695667803 694205701 692924440 692119122 691862702 691916049 691948235 691835642 691762567 692026973 692723572
938.2F92723572Q95083Q21889P69555R19283J191735J350284J144588O84618L62397
$$ 692723572 693618655 694440544 695210099 696129382 697321117 698671401 699815989 700500607 700863004
956.6G00863004K91824K83957J16527k65956o41346p80344p07865o31988p38859r99928
$$ 700863004 701154828 701438785 701555312 701289356 700648010 699867666 699159801 698527813 697788954 696789026
977F96789026j157641j032233p88212p28369r37879j243353j402140j364171j402259
$$ 696789026 695631385 694599152 693810940 693082571 692144692 690901339 689499199 688135028 686732769
995.3F86732769j749456k341390k998232l526628l924847m355967m748643m729449
$$ 686732769 684983313 682641923 679643691 676117063 672192216 667836249 663087606 658358157
1011.6F58358157l992796k582610q37743O73353J458943J566887J425028J201987P85649
$$ 658358157 654365361 651782751 650945008 651618361 653077304 654644191 656069219 657271206 658056855
1030F58056855J67430n60224j199186j554549j681626j793086k016962k294600k429366
$$ 658056855 658224285 657664061 656464875 654910326 653228700 651435614 649418652 647124052 644694686
1048.4F44694686k261818j806795j293779j019358r90391r62317p05898j60694N09262
$$ 644694686 642432868 640626073 639332294 638312936 637322545 636360228 635654330 635493636 636002898
1066.7F36002898J030505J231074J197636J094461R17673O42598L29315J4961k40683
$$ 636002898 637033403 638264477 639462113 640556574 641474247 642116845 642446160 642461121 642220438
1085.1F42220438m44174o65963q71718j029611j146554j244784j312673j289606j229763
$$ 642220438 641776264 641110301 640238583 639208972 638062418 636817634 635504961 634215355 632985592
1103.4F32985592j182735j128316j118243j118064j013934q05021n80072m03404k83003
$$ 632985592 631802857 630674541 629556298 628438234 627424300 626619279 626039207 625635803 625352800
1121.8F25352800k71380m65930l71158P10011J834452J828730J370669J216173J251876
$$ 625352800 625081420 624615490 624244332 624954343 626788795 628617525 629988194 631204367 632456243
1140.1F32456243J287401J213491J074493R87589R12964P43628N15997L02553J25945
$$ 632456243 633743644 634957135 636031628 637019217 637932181 638675809 639191806 639494359 639620304
1158.5F39620304K7716J3113n841j28269k68579k74360j82092j25647j44362k09451
$$ 639620304 639648020 639661133 639655292 639527023 639258444 638984084 638801992 638676345 638531983 638322532
1178.9F38322532k95996l36648k90095k53976l61860n75661p27058p36534o74010o48856
$$ 638322532 638026536 637689888 637399793 637145817 636783957 636208296 635481238 634744704 634070694 633421838
1199.3F33421838p30574q82208r49025q58665p44462p65383r09269j023591r54926
$$ 633421838 632691264 631809056 630860031 630001366 629256904 628491521 627582252 626558661 625603735
1217.7F25603735p20918n40077n78225p75874r21070q55923o27399m05609l10779l28302
$$ 625603735 624882817 624342740 623764515 622988641 622067571 621211648 620584249 620178640 619867861 619539559
1238.1F19539559l05653j31190J34051L64662M41551M41372O26445J077771J619816
$$ 619539559 619233906 619102716 619236767 619601429 620042980 620484352 621110797 622188568 623808384
1256.4F23808384K027333K187788K208233K303958K450466K415836K117455J702368
$$ 623808384 625835717 628023505 630231738 632535696 634986162 637401998 639519453 641221821
1272.7F41221821J422108J374006J354873J135409P04884K52068j1503m7982O6698
$$ 641221821 642643929 644017935 645372808 646508217 647213101 647465169 647453666 647405684 647472382
1291.1F47472382K22623L90589O27577Q92103J024425Q89719N23686J25408j02102
$$ 647472382 647695005 648085594 648713171 649605274 650629699 651519418 652043104 652168512 652066410
1309.4F52066410j34826j10567j28865k17438l33726k89977o0260J20997R2149j00136
$$ 652066410 651931584 651821017 651692152 651474714 651140988 650851011 650790751 650911748 651003897 650903761
1329.8F50903761k38597j70588n067n1916m81843r35495j062990j065373j061261r15169
$$ 650903761 650665164 650494576 650489509 650437593 649955750 649020255 647957265 646891892 645830631 644915462
1350.2F44915462o10710l10719j44064l815O3122k93553q18611q13543n25236k82705
$$ 644915462 644304752 643994033 643849969 643846154 643909276 643615723 642797112 641983569 641458333 641175628
1370.6F41175628j41442m23610q09789q79824r18031p99417k69056l4332m63426n33760
$$ 641175628 641034186 640610576 639800787 638920963 638002932 637203515 636934459 636900127 636436701 635902941
1391F35902941k07424k76744n77748p96735p91312m01020k36630l77953l81112m41492
$$ 635902941 635695517 635418773 634841025 634044290 633252978 632851958 632615328 632237375 631856263 631414771
1411.4F31414771n03540k13563r3580r05871j366556q95381m49717l5643O1214j94192
$$ 631414771 630911231 630697668 630604088 629698217 628331661 627436280 626986563 626950920 627012134 626817942
1431.8F26817942j03891l38137j398504j533747q77976l82364p6950j46687l22342
$$ 626817942 626714051 626375914 624977410 623443663 622565687 622183323 622106373 621959686 621637344
1450.2F21637344K9207P57753O41883j206339j854479q21173k11596k23876L86417
$$ 621637344 621666551 622424304 623066187 621859848 620005369 619184196 618972600 618748724 619135141
1468.5F19135141J407624J419961L16024k92718k54274j16110o2465J18911L28004
$$ 619135141 620542765 621962726 622278750 621986032 621731758 621615648 621553183 621672094 622000098
1486.9F22000098q7082r49383p91430P7843J31846n09560l73066P21932J608550K50578
$$ 622000098 621913016 620963633 620172203 620250046 620381892 619872332 619499266 620221198 621829748 622080326
1507.3F22080326j659095j362682m84705J32144K07424J1504n69284j234412j161993
$$ 622080326 620421231 619058549 618573844 618705988 618913412 618924916 618355632 617121220 615959227
1525.6F15959227j049817o85393j59324m50193m59373O15716N79893j299858k018869
$$ 615959227 614909410 614224017 614064693 613614500 613155127 613770843 614350736 613050878 611032009
1544F11032009j706898j079977o03377l52383M1604P20978J72972k634048k646267
$$ 611032009 609325111 608245134 607641757 607289374 607330978 608051956 608224928 605590880 602944613
1562.4F02944613j299918p42972p65801j413166j296222o85931j423180k212047j871050
$$ 602944613 601644695 600901723 600135922 598722756 597426534 596740603 595317423 593105376 591234326
1580.7E91234326j606464j572609j637995j819015k070427k256274k417207k556383
$$ 591234326 589627862 588055253 586417258 584598243 582527816 580271542 577854335 575297952
1597E75297952k647758k833128l108501l202558l128707l156424l067016k539158k437353
$$ 575297952 572650194 569817066 566708565 563506007 560377300 557220876 554153860 551614702 549177349
1615.4E49177349l211797k720952j598835j591265j841664j692474j388311m04060
$$ 549177349 545965552 543244600 541645765 540054500 538212836 536520362 535132051 534727991
1631.7E34727991P48634N82397l85165q2910R18090J898408K405524J929105J882970
$$ 534727991 535476625 536059022 535673857 535590947 536509037 538407445 540812969 542742074 544625044
1650.1E44625044K775550K126455Q02040J435936K405762K768755K600968K802313
$$ 544625044 547400594 549527049 550329089 551765025 554170787 556939542 559540510 562342823
1666.4E62342823L392756L139734K480745K509177K396941K305687K835690L184200
$$ 562342823 565735579 568875313 571356058 573865235 576262176 578567863 581403553 584587753
1682.7E84587753K145886P40052Q38756J217425J522064J787186J532376J034081Q8334
$$ 584587753 586733639 587473691 588312447 589529872 591051936 592839122 594371498 595405579 595493913
1701.1E95493913l71397j34408k95699k95341K22683P85589R06289j5140j106739q56876
$$ 595493913 595122516 594988108 594692409 594397068 594619751 595405340 596311629 596296489 595189750 594332874
1721.5E94332874k86699n5968J64807N02824P67827K82586o62446m47035j12831k46406
$$ 594332874 594046175 593990207 594155014 594657838 595425665 595708251 595045805 594598770 594485939 594239533
1741.9E94239533j67728J20283K83479j09076p21991o13928k54095j89542j64748l58343
$$ 594239533 594071805 594192088 594475567 594366491 593644500 593030572 592776477 592586935 592422187 592063844
1762.2E92063844m68790j17183J96814K26260l31641r33527p30873l42548k69055l50535
$$ 592063844 591595054 591477871 591674685 591900945 591569304 590635777 589904904 589562356 589293301 588942766
1782.6E88942766m08113l63827l1948J56105l36230p21872m35769k03014l93927o49869
$$ 588942766 588534653 588170826 588138878 588294983 587958753 587236881 586801112 586598098 586204171 585554302
1803E85554302n53847k50220j17242l27468n65946n17369l81469k98202j74106r1075
$$ 585554302 585000455 584750235 584632993 584305525 583739579 583222210 582840741 582542539 582368433 582277358
1823.4E82277358j87457k13027l28779o66678o49095m37379l83973k24948P0751j01328
$$ 582277358 582089901 581876874 581548095 580881417 580232322 579794943 579410970 579186022 579256773 579155445
1843.8E79155445o62148p63237n62728m19676l56496l38554l43740l73006l56138j87456
$$ 579155445 578493297 577730060 577167332 576747656 576391160 576052606 575708866 575335860 574979722 574792266
1864.2E74792266N364k05576o98686p42316m91023l83854l67522l79503m05908l58939
$$ 574792266 574797630 574592054 573893368 573151052 572660029 572276175 571908653 571529150 571123242 570764303
1884.6E70764303k35379k62856m67360n01812m33027m60863m42505l84152l81470l60548
$$ 570764303 570528924 570266068 569798708 569296896 568863869 568403006 567960501 567576349 567194879 566834331
1905E66834331l14653l63350m74513m54068k88487k58862m07219m49479m90665n48602
$$ 566834331 566519678 566156328 565681815 565227747 564939260 564680398 564273179 563823700 563333035 562784433
1925.4E62784433m60088l74794l85642m41790m65869l99888k65777k61486m57346n70774
$$ 562784433 562324345 561949551 561563909 561122119 560656250 560256362 559990585 559729099 559271753 558700979
1945.8E58700979n26428m56691l91305l66032l99232m31120m32015m00602l42310l55244
$$ 558700979 558174551 557717860 557326555 556960523 556561291 556130171 555698156 555297554 554955244 554600000
1966.2E54600000m69684n13494m60804m29094m29511m39584m43756m47870m38988l98874
$$ 554600000 554130316 553616822 553156018 552726924 552297413 551857829 551414073 550966203 550527215 550128341
1986.6E50128341l51846l64543m71591n29886m83513m41610m11988l83079l80277l83378
$$ 550128341 549776495 549411952 548940361 548410475 547926962 547485352 547073364 546690285 546310008 545926630
2007E45926630l68833l45767l05354k74837l25918l78788l51846l27289l33071l30627
$$ 545926630 545557797 545212030 544906676 544631839 544305921 543927133 543575287 543247998 542914927 542584300
2027.4E42584300l29673l45469l58164l54290l51369l54589l70919l99888l91125l54946
$$ 542584300 542254627 541909158 541550994 541196704 540845335 540490746 540119827 539719939 539328814 538973868
2047.8E38973868l56555l93629m12166l89934l53515l43680l63231l87550m22179m40836
$$ 538973868 538617313 538223684 537811518 537421584 537068069 536724389 536361158 535973608 535551429 535110593
2068.2E35110593m20869m05967m26531m40001l91364l40343l61860m01675m01974m05371
$$ 535110593 534689724 534283757 533857226 533417225 533025861 532685518 532323658 531921983 531520009 531114638
2088.6E31114638m40180m42028l74020l32355l64185l74019l26514k82943k77460k85983
$$ 531114638 530674458 530232430 529858410 529526055 529161870 528787851 528461337 528178394 527900934 527614951
2109E27614951k91228k96891k78413k52724k65360l02255l30508l21567k86877k71082
$$ 527614951 527323723 527026832 526748419 526495695 526230335 525928080 525597572 525276005 524989128 524718046
2129.4E24718046k85804l16799l44872l51787l59654m13895n09083o00338o63161p50721
$$ 524718046 524432242 524115443 523770571 523418784 523059130 522645235 522136152 521535814 520872653 520121932
2149.8E20121932r30428j195252j463414j601159j515985j212597p41481j81258L50237
$$ 520121932 519191504 517996252 516532838 514931679 513415694 512203097 511461616 511280358 511630595
2168.1E11630595P20918Q44836P28130M32432R3997j17362j55628p8201N2512J89006
$$ 511630595 512351513 513196349 513924479 514356911 514450908 514333546 514177918 514099717 514152229 514341235
2188.5E14341235K84314L41356L61025K86043J26600m5061j67072k01582j99616k24173
$$ 514341235 514625549 514966905 515327930 515613973 515740573 515695512 515528440 515326858 515127242 514903069
2208.9E14903069k86162l55006l61442l16978k90692k97963l28958l54588l36170k93971
$$ 514903069 514616907 514261901 513900459 513583481 513292789 512994826 512665868 512311280 511975110 511681139
2229.3E11681139k79963l03983l45230l71814l64900l33845l06607l15666l55482l72469
$$ 511681139 511401176 511097193 510751963 510380149 510015249 509681404 509374797 509059131 508703649 508331180
2249.7E08331180l42966l06844l01838l34919l66091l51608l11971l08335l42369l65257
$$ 508331180 507988214 507681370 507379532 507044613 506678522 506326914 506014943 505706608 505364239 504998982
2270.1E04998982l63052l51250l26216k95878k94864l12209l28601l50952l74019m04537
$$ 504998982 504635930 504284680 503958464 503662586 503367722 503055513 502726912 502375960 502001941 501597404
2290.5E01597404m48405m43995l79205l60399m01229m30435m49151m82500n15311n14359
$$ 501597404 501148999 500705004 500325799 499965400 499564171 499133736 498684585 498202085 497686774 497172415
2310.9D97172415m83662m81039n66125o76185o69151n48899m42833m62324n51313n11437
$$ 497172415 496688753 496207714 495641589 494965404 494296253 493747354 493304521 492842197 492290884 491779447
2331.3D91779447m08322m30226m99755n10365m59194l43204M023L42965O4493o58453
$$ 491779447 491371125 490940899 490441144 489930779 489471585 489128381 489132404 489475369 489539862 488881409
2351.7D88881409j137286j081586q76457o14673l12000q9288P0870J51813J83970K22593
$$ 488881409 487744123 486662537 485786080 485171407 484859407 484770119 484840989 484992802 485176772 485399365
2372.1D85399365J99080J51694J71780J93596J34468N812j27375k15948k76446l22730
$$ 485399365 485598445 485750139 485921919 486115515 486249983 486255795 486128420 485912472 485636026 485313296
2392.5D85313296l42369l35842l18527l16590l31670l45976l41057l22670l16888l23773
$$ 485313296 484970927 484635085 484316558 483999968 483668298 483322322 482981265 482658595 482341707 482017934
2412.9D82017934l34859l37541l36647l42399l45349l43174l28183l22074l50892l66122
$$ 482017934 481683075 481345534 481008887 480666488 480321139 479977965 479649782 479327708 478976816 478610694
2433.3D78610694l39478l22938l27259l28064l45677l57121l34651l19451l28779l42965
$$ 478610694 478271216 477948278 477621019 477292955 476947278 476590157 476255506 475936055 475607276 475264311
2453.7D75264311l47376l57538l66480l46630l25054l23296l22938l28749l47257l49075
$$ 475264311 474916935 474559397 474192917 473846287 473521233 473197937 472874999 472546250 472198993 471849918
2474.1D71849918l31998l27497l45260l64572l52353l17514l03477l35812l78430l72947
$$ 471849918 471517920 471190423 470845163 470480591 470128238 469810724 469507247 469171435 468793005 468420058
2494.5D68420058l43054l39925l46125l41981l41594l43323l39538l33279l30568l31282
$$ 468420058 468077004 467737079 467390954 467048973 466707379 466364056 466024518 465691239 465360671 465029389
2514.9D65029389l24637l19123l37184l60697l64036l59237l59773l55274l38733l24965
$$ 465029389 464704752 464385629 464048445 463687748 463323712 462964475 462604702 462249428 461910695 461585730
2535.3D61585730l33309l46511l46721l43740l36766l43501l75838l83347l47555l31819
$$ 461585730 461252421 460905910 460559189 460215449 459878683 459535182 459159344 458775997 458428442 458096623
2555.6D58096623l47703l48985l39836l33816l40939l64423l68982l54230l44515l53784
$$ 458096623 457748920 457399935 457060099 456726283 456385344 456020921 455651939 455297709 454953194 454599410
2576D54599410l69966l47674l22193l40014l58314l51727l35067l22491l28392l53873
$$ 454599410 454229444 453881770 453559577 453219563 452861249 452509522 452174455 451851964 451523572 451169699
2596.4D51169699l77535l82185l68178l46273l29048l34352l58910l67224l63379l58463
$$ 451169699 450792164 450409979 450041801 449695528 449366480 449032128 448673218 448305994 447942615 447584152
2616.8D47584152l48717l55273l74228l65615l50714l63826l64215l48806l46720l40015
$$ 447584152 447235435 446880162 446505934 446140319 445789605 445425779 445061564 444712758 444366038 444026023
2637.2D44026023l36647l52889l66360l57658l46541l59208l66389l47972l68178m11898
$$ 444026023 443689376 443336487 442970127 442612469 442265928 441906720 441540331 441192359 440824181 440412283
2657.6D40412283l83556l28004l25203l40045l62694l86179l65436l41475l48985l54141
$$ 440412283 440028727 439700723 439375520 439035475 438672781 438286602 437921166 437579691 437230706 436876565
2678D36876565l62903l86327l94106l78847l59416l64930l92258l88413l49731l24458
$$ 436876565 436513662 436127335 435733229 435354382 434994966 434630036 434237778 433849365 433499634 433175176
2698.4D33175176l38643l73513l89933l79622l66837l73751l92378l92168l75212l51637
$$ 433175176 432836533 432463020 432073087 431693465 431326628 430952877 430560499 430168331 429793119 429441482
2718.8D29441482l25203l31491l60281l84777m04329l86625l58105l62932l75838l87161
$$ 429441482 429116279 428784788 428424507 428039730 427635401 427248776 426890671 426527739 426151901 425764740
2739.2D25764740l97087l79443l38197l23206l60876m04120m07427l85881l75330l79473
$$ 425764740 425367653 424988210 424650013 424326807 423965931 423561811 423154384 422768503 422393173 422013700
2759.6D22013700l84510l92854l79532l47734l56674l68029l49015l84390m35084m23164
$$ 422013700 421629190 421236336 420856804 420509070 420152396 419784367 419435352 419050962 418615878 418192714
2780D18192714m12315m16010l91066l64632l81291m15772m02778l58910l80396m47304
$$ 418192714 417780399 417364389 416973323 416608691 416227400 415811628 415408850 415049940 414669544 414222240
2800.4D14222240m58210m45754m39226m05967l99709m48883m86821m70251m34219m29094
$$ 414222240 413764030 413318276 412879050 412473083 412073374 411624491 411137670 410667419 410233200 409804106
2820.8D09804106m52906m76718m90427m84616m52727m42564m72397m75585n24730o59942
$$ 409804106 409351200 408874482 408384055 407899439 407446712 407004148 406531751 406056166 405531436 404871494
2841.2D04871494o96332o44892o62983p12931o94751o35118n91397n31524m93706n31792
$$ 404871494 404175162 403530270 402867287 402154356 401459605 400824487 400233090 399701566 399207860 398676068
2861.6C98676068n61327n43177n29856m83066l73751l50505m36097m47869l82811l54082
$$ 398676068 398114741 397571564 397041708 396558642 396184891 395834386 395398289 394950420 394567609 394213527
2882C94213527l38614l05682l13878l71188m05341l84629l80576m39167m72158m40687
$$ 394213527 393874913 393569231 393255353 392884165 392478824 392094195 391713619 391274452 390802294 390361607
2902.4C90361607m12911m20362m25070l89040l75330m45992n42849n86391n57840m85748
$$ 390361607 389948696 389528334 389103264 388714224 388338894 387892902 387350053 386763662 386205822 385720074
2922.8C85720074m06831k95997k08884k78831l53634k74271k09063k31326k14785j55718
$$ 385720074 385313243 385017246 384808362 384529531 384175897 383901626 383692563 383461237 383246452 383090734
2943.2C83090734j86353l31074m10319l33398k95163l49700l22968k36869j94877j90705
$$ 383090734 382904381 382573307 382162988 381829590 381534427 381184727 380861759 380624890 380430013 380239308
2963.6C80239308j94401j84655j72675j46657j39028k09420k50280k26558k81512l68089
$$ 380239308 380044907 379860252 379687577 379540920 379401892 379192472 378942192 378715634 378434122 378066033
2984C78066033l37571k51889j94818j87605k74063l46750l61174l82751l59595l30538
$$ 378066033 377728462 377476573 377281755 377094150 376820087 376473337 376112163 375729412 375369817 375039279
3004.4C75039279l40968l19421k78533l25650m55767n27381n11528n07980n12689m91351
$$ 375039279 374698311 374378890 374100357 373774707 373318940 372791559 372280031 371772051 371259362 370768011
3024.7C70768011m96090m57287l62247l65257m86821n79178m94540l61026l97413n41032
$$ 370768011 370271921 369814634 369452387 369087130 368600309 368021131 367526591 367165565 366768152 366227120
3045.1C66227120o15120n59240m97282n18829n37663n32627n31108n15729m76837m21017
$$ 366227120 365612000 365052760 364555478 364036649 363498986 362966359 362435251 361919522 361442685 361021668
3065.5C61021668m48406n79119o30647n38945m11659l45916m18425n45382n89103o11007
$$ 361021668 360573262 359994143 359363496 358824551 358412892 358066976 357648551 357103169 356514066 355903059
3085.9C55903059o22958n83708n66870n83291n81384n31673n14448n93573o21617n28276
$$ 355903059 355280101 354696393 354129523 353546232 352964848 352433175 351918727 351325154 350703537 350175261
3106.3C50175261m78535n54443n66542m41760l92228m76599o24388p58618p45506o37322
$$ 350175261 349696726 349142283 348575741 348133981 347741753 347265154 346640766 345882148 345136642 344499320
3126.7C44499320n62459n45770n70357n69374n18441n19305o21408o70195o05017n60910
$$ 344499320 343936861 343391091 342820734 342251360 341732919 341213614 340592206 339922011 339316994 338756084
3147.1C38756084n33253m89503n80758p35253p29441o53655o30378o26058o19948o32464
$$ 338756084 338222831 337733328 337152570 336417317 335687876 335034221 334403843 333777785 333157837 332525373
3167.5C32525373o63728o69181o52016o38693o23137o23673o85960p42793p24644o82234
$$ 332525373 331861645 331192464 330540448 329901755 329278618 328654945 327968985 327226192 326501548 325819314
3187.9C25819314o49184o55592o93858p04616p07090p19756o93172o49601o65456p08521
$$ 325819314 325170130 324514538 323820680 323116064 322408974 321689218 320996046 320346445 319680989 318972468
3208.3C18972468o95675o54549o53475o87123p00116o72906o78391p22110p04229o38812
$$ 318972468 318276793 317622244 316968769 316281646 315581530 314908624 314230233 313508123 312803894 312165082
3228.7C12165082n82934n67019o62625p49349p08819o51240o09994n68092n77182o36875
$$ 312165082 311582148 311015129 310352504 309603155 308894336 308243096 307633102 307065010 306487828 305850953
3249.1C05850953o40392n63503n35726n87851o22064o08712n75781n39750m81367m13031
$$ 305850953 305210561 304647058 304111332 303523481 302901417 302292705 301716924 301177174 300695807 300282776
3269.5C00282776m84675o54578p18147o93649o59525o35743o41197o66052o61671n86510
$$ 300282776 299798101 299143523 298425376 297731727 297072202 296436459 295795262 295129210 294467539 293881029
3289.9B93881029n71609p00563p97242p99536p68930o70493n56916o14881q29667r77308
$$ 293881029 293309420 292608857 291811615 291012079 290243149 289572656 289015740 288400859 287571192 286593884
3310.3B86593884r88632r25452q94785r35763r53644r13739q99584r86874j077056
$$ 286593884 285605252 284679800 283785015 282849252 281895608 280981869 280082285 279095411 278018355
3328.6B78018355j089424j065135r96559r44287j016408j131803j165360j181454j175761
$$ 278018355 276928931 275863796 274867237 273922950 272906542 271774739 270609379 269427925 268252164
3347B68252164j088351j131534j327247j366019j232028j154393j197994j202345j078367
$$ 268252164 267163813 266032279 264705032 263339013 262106985 260952592 259754598 258552253 257473886
3365.4B57473886r95159j106650j300961j318305j169265j056343r99540r71615r41933
$$ 257473886 256478727 255372077 254071116 252752811 251583546 250527203 249527663 248556048 247614115
3383.7B47614115q53076p13706n75915o11663q08239q24079n84751m57376o92115r40785
$$ 247614115 246761039 246047333 245471418 244859755 244051516 243227437 242642686 242185310 241493195 240552410
3404.1B40552410q25107n92485n19499n22509n36725n39243m54903l76716l81276l39285
$$ 240552410 239727303 239134818 238615319 238092810 237556085 237016842 236561939 236185223 235803947 235464662
3424.5B35464662k20105j20759j15692j13383k5824l8132j83120j93462k8983J29879
$$ 235464662 235244557 235123798 235008106 234894723 234868899 234830767 234647647 234454185 234425202 234555081
3444.9B34555081J80453J32873J29149K22027L10570L57151L91856L90276M15072N64337
$$ 234555081 234735534 234868407 234997556 235219583 235530153 235887304 236279160 236669436 237084508 237648845
3465.3B37648845O25506M15653J85400K10360L99142N59136N69836M13209L68267N15104
$$ 237648845 238274351 238690004 238875404 239085764 239484906 240044042 240613878 241027087 241395354 241910458
3485.7B41910458N26309M24981M70280N90817O21989N77330N84499O09025N06490M07920
$$ 241910458 242436767 242861748 243332028 243922845 244544834 245122164 245706663 246315688 246822178 247230098
3506.1B47230098M45485N23865N87925N76824M95941M89026O25461P85470P52777N92113
$$ 247230098 247675583 248199448 248787373 249364197 249860138 250349164 250974625 251760095 252512872 253104985
3526.5B53104985N18381N46217O30051P21127P10487O44267P26759Q95501Q86470O76095
$$ 253104985 253623366 254169583 254799634 255520761 256231248 256875515 257602274 258497775 259384245 260060340
3546.9B60060340N61506O18368O68019P02351P79123Q82327R24617R16422R34600R05335
$$ 260060340 260621846 261240214 261908233 262610584 263389707 264272034 265196651 266113073 267047673 267953008
3567.3B67953008Q20578Q10444Q82357R32187R27210R80228J108080J216829J156032
$$ 267953008 268773586 269584030 270466387 271398574 272325784 273306012 274414092 275630921 276786953
3585.6B76786953Q85278P47591Q71271J004100J054049J065492J003802R22859R83983
$$ 276786953 277672231 278419822 279291093 280295193 281349242 282414734 283418536 284341395 285325378
3604B85325378J088798J094401J060307J051694J034081J022458J032442R63927Q80628
$$ 285325378 286414176 287508577 288568884 289620578 290654659 291677117 292709559 293673486 294554114
3622.3B94554114J010061J174122J068413Q00014P06046P81477Q47012Q62568R01550
$$ 294554114 295564175 296738297 297806710 298606724 299312770 300094247 300941259 301803827 302705377
3640.7C02705377R92895J127392J183420R56237N09262K97517L42220L91483L62069
$$ 302705377 303698272 304825664 306009084 306965321 307474583 307772100 308114320 308505803 308867872
3659C08867872L05533K83122L83109M87179L57270J73390J03295j63794m58121m36008
$$ 308867872 309173405 309456527 309839636 310326815 310684085 310857475 310960770 310796976 310338855 309902847
3679.4C09902847k72781k8968J83165J63794j94103n06877m39585k88784k07424j52320
$$ 309902847 309630066 309601098 309784263 309948057 309753954 309247077 308807492 308518708 308311284 308158964
3699.8C08158964j94252k49505j33276J8955p5162l78072m68135l29107k12818k12282
$$ 308158964 307964712 307715207 307581931 307600886 307525724 307147652 306679517 306350410 306137592 305925310
3720.2C05925310k76447l15964k97069j73897J4096J25886p2569m44830m50134k03341
$$ 305925310 305648863 305332899 305035830 304861933 304876029 305001915 304929346 304484516 304034382 303831041
3740.6C03831041k01076l26515j56313j35392m89592o39230m13180k77012l56615m08679
$$ 303831041 303629965 303303450 303147137 303011745 302522153 301882923 301469743 301192731 300836116 300427437
3761C00427437l09855k15709k07216l09974m29183l81738k08318j08033k39522m13477
$$ 300427437 300117582 299901873 299694657 299384683 298955500 298573762 298365444 298257411 298017889 297604412
3781.4B97604412l93778l29763l27349k97337j91004r2059m8846m2289j64271l47584
$$ 297604412 297210634 296880871 296553522 296256185 296065181 295973122 295924276 295881987 295717716 295370132
3801.8B95370132l78728m19110m80086l44574j32352p6652j53720j50562k54661m61936
$$ 295370132 294991404 294572294 294092208 293747634 293615282 293538630 293384910 293234348 292979687 292517751
3822.2B92517751m47154l25709k25872j35004l4929k6911j94073l80158m42595m85271
$$ 292517751 292070597 291744888 291519016 291384012 291349083 291322172 291128099 290747941 290305346 289820075
3842.6B89820075m53919k18034M8846J9133m19289o18666l05146j32948j23233k22683
$$ 289820075 289366156 289148122 289196968 289216101 288796812 288178146 287873000 287740052 287616819 287394136
3863B87394136l29196k85477k43813k75790l33280l72886k81275j80691j55330j95324
$$ 287394136 287064940 286779463 286535650 286259860 285926580 285553694 285272419 285091728 284936398 284741074
3883.4B84741074l34412l54499k56747l23534l60757j85519m7952o6668k16603m07279
$$ 284741074 284406662 284052163 283795416 283471882 283111125 282925606 282877654 282810986 282594383 282187104
3903.8B82187104m83185m20421l00825j99258j71632j93655k42770k75761k50429k24024
$$ 282187104 281703919 281283498 280982673 280783415 280611783 280418128 280175358 279899597 279649168 279425144
3924.2B79425144k16543k24978k40892k57612k89946k99275k30700j80453k30819k37644
$$ 279425144 279208601 278983623 278742731 278485119 278195173 277895898 277665198 277484745 277253926 277016282
3944.6B77016282j97619k52187l23445l07053k52694j97768j85490k46018k81692k36124
$$ 277016282 276818663 276566476 276243031 275935978 275683284 275485516 275300026 275054008 274772316 274536192
3965B74536192k12550k24650j98871k02804k24918k14637k15411k15769k32249k46853
$$ 274536192 274323642 274098992 273900121 273697317 273472399 273257762 273042351 272826582 272594333 272347480
3985.4B72347480k24650k15858k30938k54125k67028k49923
$$ 272347480 272122830 271906972 271676034 271421909 271154881 270904958
3997.6B70904958
$$ 270904958
##END=$$ End of the data block
