##TITLE=SCV - 01 $$ Begin of the data block
##JCAMP-DX=5.00 $$ ACD/SpecManager v 10.08
##SPECTROMETER/DATA SYSTEM=Alpha
##DATE=30 Sep 2014 13:58:06
##DATA TYPE=INFRARED SPECTRUM
##DATA CLASS=XYDATA
##ORIGIN=
##OWNER=
##NPOINTS=1765
##FIRSTX=399.76428223
##LASTX=3997.64306641
##MAXX=3997.64306641
##MINX=399.76428223
##MAXY=0.84955740
##MINY=0.33754039
##XFACTOR=1.0000000000
##YFACTOR=1.000000000000000e-9
##FIRSTY=0.83773935
##DELTAX=2.03961372
##XUNITS=1/CM
##YUNITS=ARBITRARY UNITS
##XYDATA=(X++(Y..Y))
$$ plain form
399.8 837739348 836428583 829879880 814039528 790988684 767934561 757308424 768136263 791384816
416.1 791384816 812818289 827033997 837094307 845824838 849557400 846063316 840373278 838583469
432.4 838583469 840826690 841701627 836158812 824263811 809320807 794730544 782495737 773884833
448.7 773884833 771815896 780094087 797488153 817794681 832770228 837039530 833945572 830126345
465 830126345 829307437 828845561 822113693 807081342 793796897 794693828 809745193 827032208 836320817
483.4 836320817 837432623 836882353 839764297 845049858 847572386 844639122 839399636 837123811 839241922
501.7 839241922 841518104 838696897 830221117 820547819 814966142 815829575 821133137 825933695 827975035
520.1 827975035 830187082 834967613 840063632 841185629 837734640 833749771 833494306 836775005 839270711
$$ packed form
399.8H37739348j310765o548703j5840352k3050844k3054123j0626137J0827839K3248553
416.1G91384816K1433473J4215708J0060310Q730531L732562l494084n690038j789809
432.4H38583469K243221Q74937n542815j1895001j4943004j4590263j2234807q610904
448.7G73884833k068937Q278191J7394066K0306528J4975547M269302l093958l819227
465H30126345q18908m61876o731868j5032351j3284445Q96931J5051365J7287015R288609
483.4H36320817J111806n50270K881944N285561K522528k933264n239486k275825K118111
501.7H39241922K276182k821207q475780r673298n581677Q63433N303562M800558K041340
520.1H27975035K212047M780531N096019J121997l450989l984869k55465L280699K495706
$$ plain form
538.5 839270711 837564409 832942903 829797149 830545366 832973540 832700133 828053594 821794748 817525387
556.8 817525387 814993799 810108662 799738526 786011517 776174963 776956677 787757754 800954342
573.1 800954342 809635162 813058317 814411819 814481258 810154200 801044762 794708669 799359322 812624753
591.5 812624753 825154126 831802785 832369268 828833282 824661672 822151899 821078479 819545031
607.8 819545031 815837979 810873687 808176398 810139656 814967692 818287671 817957878 815332294 811796188
626.2 811796188 805472374 791977346 769266367 743092656 727096558 731436610 751702309 774958968
642.5 774958968 792725503 804530621 813507497 821582496 827915967 831032813 831259131 831072509
658.8 831072509 832739830 835943580 838383734 838532507 836878002 836530924 838199914 840668678 841835856
$$ packed form
538.5H39270711j706302m621506l145754P48217K428174k73407m646539o258846m269361
556.8H17525387k531588m885137j0370136j3727009r836554P81714J0801077J3196588
573.1H00954342Q680820L423155J353502O9439m327058r109438o336093M650653J3265431
591.5H12624753J2529373O648659N66483l535986m171610k509773j073420j533448
607.8H19545031l707052m964292k697289J963258M828036L319979l29793k625584l536106
626.2H11796188o323814j3495028k2710979k6173711j5996098M340052K0265699K3256659
642.5G74958968J7766535J1805118Q976876Q074999O333471L116846K26318j86622
658.8H31072509J667321L203750K440154J48773j654505l47078J668990K468764J167178
$$ plain form
677.2 841835856 840734363 838837504 838438153 840088427 842031717 842181921 840381920 838579714 838643491
695.5 838643491 840301096 841556489 840895295 838833988 837386608 837924302 839601934 840304852 839048684
713.9 839048684 837017417 836196542 837280273 838845015 838852942 837057710 835207343 835069180 836517513
732.2 836517513 837643981 836863458 834668040 832995951 833105862 834268332 834614277 833174288 830983281
750.6 830983281 829973280 830726027 831880689 831712604 829951942 828047872 827572346 828481674 829150796
768.9 829150796 828172505 825920999 824132919 824031115 824963868 825114787 823570430 821243703 819823623
787.3 819823623 819953442 820461690 819686592 817340672 814714015 813210428 812833905 812106550 809730232
805.6 809730232 806108952 802793086 800545156 798444569 794873774 788986981 781349182 773047268
$$ packed form
677.2H41835856j101493j896859l99351J650274J943290J50204j800001j802206O3777
695.5H38643491J657605J255393o61194k061307j447380N37694J677632P02918j256168
713.9H39048684k031267q20875J083731J564742P927j795232j850367j38163J448333
732.2H36517513J126468p80523k195418j672089J09911J162470L45945j439989k191007
750.6H30983281j010001P52747J154662j68085j760662j904070m75526R09328O69122
768.9H29150796r78291k251506j788080j01804R32753J50919j544357k326727j420080
787.3H19823623J29819N08248p75098k345920k626657j503587l76523p27355k376318
805.6H09730232l621280l315866k247930k100587l570795n886793p637799q301914
$$ plain form
822 773047268 764108598 753233492 738809049 718885660 690743506 654976904 622608483 610343516
838.3 610343516 621995091 642969429 657182157 660276651 660202265 672273099 703001618 740540326
854.6 740540326 770421743 789431870 801122606 809024155 815004706 819970548 824619949 829000831
870.9 829000831 832131028 833030164 831855297 829805374 828022838 826576352 824462891 820594251 814582527
889.3 814582527 806670845 798068106 792003751 792146683 797971368 804630041 808677018 810350418 810570717
907.6 810570717 809268177 806383371 802720308 799438119 796894193 794330895 790804982 786280692
923.9 786280692 781632006 777639508 773948073 769190192 762547851 755095601 748142600 740595162
940.3 740595162 729821682 714124739 693368256 668068528 638839781 610019863 595214307
$$ packed form
822G73047268q938670j0875106j4424443j9923389k8142154l5766602l2368421j2264967
838.3F10343516J1651575K0974338J4212728L094494p4386J2070834L0728519L7538708
854.6G40540326K9881417J9010127J1690736P901549N980551M965842M649401M380882
870.9H29000831L130197Q99136j174867k049923j782536j446486k113461l868640o011724
889.3H14582527p911682q602739o064355J42932N824685O658673M046977J673400K20299
907.6H10570717j302540k884806l663063l282189k543926k563298l525913m524290
923.9G86280692m648686l992498l691435m757881o642341p452250o953001p547438
940.3G40595162j0773480j5696943k0756483k5299728k9228747k8819918j4805556
$$ plain form
954.5 595214307 606896639 637488544 665300429 675810575 667737126 645290911 612664878 574505210
970.9 574505210 536895394 506963670 491118103 492539823 509701014 537447333 569789648 601979375
987.2 601979375 631063640 655552685 674745142 687743962 692889810 691117764 690338075 695784867
1003.5 695784867 699360669 690391123 666012168 629239917 591373324 573616922 591282427 636480868
1019.8 636480868 687480569 728975773 756943405 773528278 782622397 787744880 791057169 792964339
1036.1 792964339 792836905 790407717 786373138 781651318 776373863 769910276 761781871 752197087
1052.4 752197087 741648078 730104148 716730356 700363159 680447340 657904148 635867417
1066.7 635867417 619238257 611321568 610721648 613231778 615528822 615086496 609868824 602749646
$$ packed form
954.5E95214307J1682332L0591905K7811885J0510146q073449k2446215l2626033l8159668
970.9E74505210l7609816k9931724j5845567J421720J7161191K7746319L2342315L2189727
987.2F01979375K9084265K4489045J9192457J2998820N145848j772046p79689N446792
1003.5F95784867L575802q969546k4378955l6772251l7866593j7756402J7665505M5198441
1019.8F36480868N0999701M1495204K7967632J6584873R094119N122483L312289J907170
1036.1G92964339j27434k429188m034579m721820n277455o463587q128405r584784
1052.4G52197087j0549009j1543930j3373792j6367197j9915819k2543192k2036731
1066.7F35867417j6629160p916689n99920K510130K297044m42326n217672p119178
$$ plain form
1083 602749646 603622675 619424403 645108223 671276331 693525314 711136699 724109173 733100235
1099.4 733100235 739508033 744714618 749330223 753116310 755739033 757450879 758827627 760202289
1115.7 760202289 761452317 762229681 762447298 762484491 762820244 763538539 764244139 764439642 763991416 763234556
1136.1 763234556 762528718 761804521 760618091 758556366 755627513 752182782 748484671 744484782 740055501
1154.4 740055501 735266566 730127811 724140823 716654599 708413720 702582359 702147603 705784082
1170.7 705784082 709246099 710538089 710252821 708492815 704697073 698836923 691002369 680923641
1187.1 680923641 668445528 653941333 637958825 620652735 602123916 583385706 566696703
1201.3 566696703 554839551 549725533 550992429 556112051 562954783 571958840 585006833 602862895
$$ packed form
1083F02749646Q73029J5801728K5683820K6168108K2248983J7611385J2972474Q991062
1099.4G33100235O407798N206585M615605L786087K622723J711846J376748J374662
1115.7G60202289J250028P77364K17617L7193L35753P18295P05600J95503m48226p56860
1136.1G63234556p05838p24197j186430k061725k928853l444731l698111l999889m429281
1154.4G40055501m788935n138755n986988p486224q240879n831361m34756L636479
1170.7G05784082L462017J291990k85268j760006l795742n860150p834554j0078728
1187.1F80923641j2478113j4504195j5982508j7306090j8528819j8738210j6689003
1201.3E66696703j1857152n114018J266896N119622O842732R004057J3047993J7856062
$$ plain form
1217.7 602862895 623993874 645138681 662999153 675695539 682833552 684794784 682214677 675679684
1234 675679684 665703773 653643191 642812252 637650609 639330208 642200530 639103830 630309343
1250.3 630309343 621982396 616405964 611202478 609689653 621192098 644604862 665027976 672979295
1266.6 672979295 671326578 664613307 654045343 638986826 618327439 594303727 576350033 572408915
1282.9 572408915 576717615 577782989 571908236 561376870 548609316 535143912 521944582 509627402
1299.2 509627402 498724908 490077138 484591156 482182175 481266826 479930162 477282435 473638564
1315.6 473638564 470024705 467762560 467961431 471076727 477081865 485667557 496504635 509327233
1331.9 509327233 523939610 540409267 559331954 580105305 599459648 614851117 625379682
$$ packed form
1217.7F02862895K1130979K1144807J7860472J2696386P138013J961232k580107o534993
1234F75679684r975911j2060582j0830939n161643J679599K870322l096700q794487
1250.3F30309343q326947n576432n203486j512825J1502445K3412764K0423114P951319
1266.6F72979295j652717o713271j0567964j5058517k0659387k4023712j7953694l941118
1282.9E72408915M308700J065374n874753j0531366j2767554j3465404j3199330j2317180
1299.2E09627402j0902494q647770n485982k408981r15349j336664k647727l643871
1315.6D73638564l613859k262145J98871L115296O005138Q585692J0837078J2822598
1331.9E09327233J4612377J6469657J8922687K0773351J9354343J5391469J0528565
$$ plain form
1346.2 625379682 629839838 627706349 621010542 613938093 610348940 612020910 618879139 629575133
1362.5 629575133 641157329 651934326 662054420 668814123 665184319 647766948 627734065 615832627
1378.8 615832627 611553252 611134470 606435537 593887508 585364282 587515771 590555072 585476577
1395.1 585476577 577530742 580099583 596180022 616754055 634130716 645328522 652449727 658951700
1411.4 658951700 665999413 673161089 680162132 686124623 688900352 689375818 689644098 690828919 692836225
1429.8 692836225 694142461 694962025 698394954 703964710 707005560 706471682 702498138 697128296 694714546
1448.1 694714546 696282268 698062241 697250068 693792462 691228926 693053722 697708726 703411102
1464.5 703411102 708729863 713344634 718414307 724329948 729044199 732040167 734627008 737424016
$$ packed form
1346.2F25379682M460156k133489o695807p072449l589153J671970O858229J0695994
1362.5F29575133J1582196J0776997J0120094O759703l629804j7417371k0032883j1901438
1378.8F15832627m279375m18782m698933j2548029q523226K151489L039301n078495
1395.1E85476577p945835K568841J6080439K0574033J7376661J1197806P121205O501973
1411.4F58951700P047713P161676P001043N962491K775729M75466K68280J184821K007306
1429.8F92836225J306236Q19564L432929N569756L040850n33878l973544n369842k413750
1448.1F94714546J567722J779973q12173l457606k563536J824796M655004N702376
1464.5G03411102N318761M614771N069673N915641M714251K995968K586841K797008
$$ plain form
1480.8 737424016 740232289 742583454 744664609 746762276 748491704 749615669 751178741 753625453
1497.1 753625453 755420983 755939066 756164849 757717311 760658741 761607766 761089802 760803938 761075675
1515.4 761075675 761584759 761911035 762159169 761838496 761342585 761504650 761972070 762895048 764191151
1533.8 764191151 764550567 764675617 766118288 767122388 766870677 766674459 766796350 767202020 767571092
1552.2 767571092 767632723 767299592 766772807 764493704 760711312 757777214 756557584 757220030 758916736
1570.5 758916736 759987593 761274517 763507068 764370203 763752580 762881100 762007654 761190116 760379970
1588.9 760379970 759254754 757658184 755708814 753571093 751489401 749746919 748402119 747142971
1605.2 747142971 745720029 744057536 742057145 739738584 737431407 734997869 732270360 730165601
$$ packed form
1480.8G37424016K808273K351165K081155K097667J729428J123965J563072K446712
1497.1G53625453J795530N18083K25783J552462K941430R49025n17964k85864K71737
1515.4G61075675N09084L26276K48134l20673m95911J62065M67420R22978J296103
1533.8G64191151L59416J25050J442671J004100k51711j96218J21891M05670L69072
1552.2G67571092O1631l33131n26785k279103l782392k934098j219630O62446J696706
1570.5G58916736J070857J286924K232551Q63135o17623q71480q73446q17538q10146
1588.9G60379970j125216j596570j949370k137721k081692j742482j344800j259148
1605.2G47142971j422942j662493k000391k318561k307177k433538k727509k104759
$$ plain form
1621.5 730165601 729007781 727883935 726397455 724813044 723467469 723297238 724505603 724717081 723560572
1639.9 723560572 722529233 722330630 723523378 724838614 724800766 725952983 728799880 729167759 728385866
1658.2 728385866 727965832 727556169 726319849 724299967 722085357 719147563 715389848 711981356 708811998
1676.6 708811998 704858422 700096071 695529163 692501247 691245794 690879047 690581560 689791083 688598454
1694.9 688598454 686445057 682480097 676506460 669604957 662232816 654009461 645444036 636773884
1711.3 636773884 627942622 618504763 606998682 593809068 580540597 566592395 552199006 538580716
1727.6 538580716 526044786 514806032 503348351 491557986 479936570 465149611 446134120
1741.9 446134120 424410760 401022494 377954930 357491225 343097985 337540388 341234565 353704184
$$ packed form
1621.5G30165601j157820j123846j486480j584411j345575j70231J208365K11478j156509
1639.9G23560572j031339j98603J192748J315236l7848J152217K846897L67879p81893
1658.2G28385866m20034m09663j236320k019882k214610k937794l757715l408492l169358
1676.6G08811998l953576m762351m566908l027916j255453l66747k97487p90477j192629
1694.9F88598454k153397l964960n973637o901503p372141q223355q565425q670152
1711.3F36773884q831262r437859j1506081j3189614j3268471j3948202j4393389j3618290
1727.6E38580716j2535930j1238754j1457681j1790365j1621416j4786959j9015491
1741.9D46134120k1723360k3388266k3067564k0463705j4393240n557597L694177J2469619
$$ plain form
1758.2 353704184 372932673 396537155 417990178 434203684 446713209 455702841 461908668 464910597
1774.5 464910597 464598209 461810201 456878960 450449944 443536490 437185645 433087885 433900148 442183465
1792.8 442183465 455842793 471662253 489021093 506365478 521150589 532538593 541710317
1807.1 541710317 549781621 556927383 562596738 567170024 571952879 577541471 583489537 589170337
1823.4 589170337 593988061 597625613 601370871 605963945 610902846 616100311 621118307 625271618
1839.8 625271618 628793657 632329047 634972036 635853648 635670662 635481775 636494339 639289141 643103898
1858.1 643103898 646694303 649396181 651443839 653694808 656859279 660308003 662975550 665104091
1874.4 665104091 667133033 669184089 671244204 673166275 674804986 676181078 677657545 679341972
$$ packed form
1758.2C53704184J9228489K3604482K1453023J6213506J2509525Q989632O205827L001929
1774.5D64910597l12388k788008m931241o429016o913454o350845m097760Q12263Q283317
1792.8D42183465J3659328J5819460J7358840J7344385J4785111J1388004R171724
1807.1E41710317Q071304P145762N669355M573286M782855N588592N948066N680800
1823.4E89170337M817724L637552L745258M593074M938901N197465N017996M153311
1839.8F25271618L522039L535390K642989Q81612j82986j88887J012564K794802L814757
1858.1F43103898L590405K701878K047658K250969L164471L448724K667547K128541
1874.4F65104091K028942K051056K060115J922071J638711J376092J476467J684427
$$ plain form
1890.7 679341972 681009173 682607412 683977187 685034394 686065495 687186122 688219011 688969553
1907.1 688969553 689394116 689639509 689974308 690669298 691780329 692868471 693672478 694642842 695896029
1925.4 695896029 697236061 698508263 699502766 700255215 700991869 701869488 702856600 703881383 704676509
1943.8 704676509 705142140 705648839 706391990 707190633 707809329 708214700 708629012 709281147 710072398 710749090
1964.2 710749090 711199403 711459577 711686611 712095678 712686777 713274002 713743865 714120328 714568257 715166807
1984.6 715166807 715779424 716215193 716504514 716796160 717162728 717693031 718286335 718676507 718847811 719025314
2005 719025314 719380498 719853759 720194221 720260203 720231295 720373631 720724761 721126497 721347511 721265316
2025.4 721265316 721053481 720967770 721073866 721226811 721249819 721141875 721094310 721258759 721498430 721500456
$$ packed form
1890.7F79341972J667201J598239J369775J057207J031101J120627J032889P50542
1907.1F88969553M24563K45393L34799O94990J111031J088142Q04007R70364J253187
1925.4F95896029J340032J272202R94503P52449P36654Q77619R87112J024783P95126
1943.8G04676509M65631N06699P43151P98643O18696M05371M14312O52135P91251O76692
1964.2G10749090M50313K60174K27034M09067N91099N87225M69863L76463M47929N98550
1984.6G15166807O12617M35769K89321K91646L66568N30303N93304L90172J71304J77503
2005G19025314L55184M73261L40462O5982k8908J42336L51130M01736K21014q2195
2025.4G21265316k11835q5711J06096J52945K3008j07944m7565J64449K39671K026
$$ plain form
2045.8 721500456 721114337 720490634 719969988 719860971 720158398 720594287 720976770 721347988 721902609 722685933
2066.2 722685933 723467290 724006593 724271357 724455059 724802375 725310802 725732565 725870848 725780368 725742698
2086.6 725742698 725956380 726299465 726520240 726534247 726490736 726638079 727060616 727553785 727830827 727835476
2106.9 727835476 727803349 727953076 728225112 728333652 728090584 727666497 727360427 727177680 726831794 726215839
2127.3 726215839 725659013 725569725 725997090 726666510 727188706 727262557 726887286 726349175 725971401 725840092
2147.7 725840092 725802839 725721776 725691915 725943327 726570547 727375507 728008032 728317440 728486359 728793502
2168.1 728793502 729302764 729788601 729953468 729787767 729595602 729644358 729897499 730077922 729977548 729697526
2188.5 729697526 729547620 729696631 729996145 730146348 730038702 729875803 729936838 730257690 730557561 730517328
$$ packed form
2045.8G21500456l86119o23703n20646j09017K97427M35889L82483L71218N54621P83324
2066.2G22685933P81357N39303K64764J83702L47316N08427M21763J38283r0480l7670
2086.6G25742698K13682L43085K20775J4007m3511J47343M22537M93169K77042M649
2106.9G27835476l2127J49727K72036J08540k43068m24087l06070j82747l45886o15955
2127.3G26215839n56826q9288M27365O69420N22196P3851l75271n38111l77774j31309
2147.7G25840092l7253q1063k9861K51412O27220Q04960O32525L09408J68919L07143
2168.1G28793502N09262M85837J64867j65701j92165M8756K53141J80423j00374k80022
2188.5G29697526j49906J49011K99514J50203j07646j62899O1035L20852K99871m0233
$$ plain form
2208.9 730517328 730109990 729608655 729309022 729294002 729354143 729260921 729088366 729089916 729346156 729606926
2229.3 729606926 729527116 729028881 728444517 728271961 728709519 729452491 730002105 730165482 730161667 730240166
2249.7 730240166 730328977 730130672 729494035 728670359 728168488 728227079 728580773 728776038 728545666 728041649
2270.1 728041649 727732480 727930129 728473127 728971958 729238689 729400814 729675472 730063498 730327725 730273902
2290.5 730273902 729997814 729821920 729952157 730248272 730376303 730102003 729482651 728801370 728224337 727696300
2310.9 727696300 727143526 726552546 725995958 725696802 725801349 726044953 725978374 725556970 725218058 725316226
2331.3 725316226 725654364 725817800 725678086 725512266 725787997 726863742 728264809 728381038 727029920
2349.7 727029920 725615203 725127161 725320935 725634277 725743115 725581706 725379586 725414813 725707114 725989521
$$ packed form
2208.9G30517328m07338n01335k99633j5020O0141r3222j72555J550K56240K60770
2229.3G29606926p9810m98235n84364j72556M37558P42972N49614J63377l815P8499
2249.7G30240166Q8811j98305o36637q23676n01871N8591L53694J95265k30372n04017
2270.1G28041649l09169J97649N42998M98831K66731J62125K74658L88026K64227n3823
2290.5G30273902k76088j75894J30237K96115J28031k74300o19352o81281n77033n28037
2310.9G27696300n52774n90980n56588k99156J04547K43604o6579m21404l38912R8168
2331.3G25316226L38138J63436j39714j65820K75731J075745J401067J16229j351118
2349.7G27029920j414717m88042J93774L13342J08838j61409k02120L5227K92301K82407
$$ plain form
2370.1 725989521 726003587 725828469 725800991 726096988 726525784 726698518 726413131 725831270 725345135 725243211
2390.4 725243211 725456536 725717068 725900531 726112008 726530135 727162540 727765620 728102624 728188157 728260159
2410.8 728260159 728516340 728895605 729138494 729082227 728859246 728741705 728844523 729008377 728998363 728761435
2431.2 728761435 728491127 728448570 728668630 728897691 728870988 728614271 728401423 728437066 728649497 728766024
2451.6 728766024 728606820 728293598 728085101 728099108 728202879 728163660 727919221 727629304 727522194 727645516
2472 727645516 727795005 727746367 727491796 727253318 727235317 727376163 727439225 727273881 726941228 726664126
2492.4 726664126 726599097 726654768 726617455 726425827 726235807 726223171 726373613 726491570 726371229 725967586
2512.8 725967586 725498259 725267351 725326955 725418985 725280583 724919856 724559724 724382937 724368513 724366128
$$ packed form
2370.1G25989521J4066j75118k7478K95997M28796J72734k85387n81861m86135j01924
2390.4G25243211K13325K60532J83463K11477M18127O32405O03080L37004Q5533P2002
2410.8G28260159K56181L79265K42889n6267k22981j17541J02818J63854j0014k36928
2431.2G28761435k70308m2557K20060K29061k6703k56717k12848L5643K12431J16527
2451.6G28766024j59204l13222k08497J4007J03771l9219k44439k89917j07110J23322
2472G27645516J49489m8638k54571k38478j8001J40846O3062j65344l32653k77102
2492.4G26664126o5029N5671l7313j91628j90020j2636J50442J17957j20341m03643
2512.8G25967586m69327k30908N9604R2030j38402l60727l60132j76787j4424k385
$$ plain form
2533.2 724366128 724283695 724180996 724192917 724368811 724577665 724621713 724432945 724123001 723897099 723858297
2553.6 723858297 723902881 723865688 723695576 723516643 723484099 723545849 723489940 723193765 722709417 722224772
2574 722224772 721933961 721843898 721781194 721607625 721372306 721232474 721254110 721328497 721294165 721103072 720881283
2596.4 720881283 720832169 721017241 721269190 721364856 721270084 721157908 721193552 721379936 721561253 721531391
2616.8 721531391 721246958 720898688 720692992 720674038 720746994 720778823 720738411 720739603 720870733 721052408 721118987
2639.3 721118987 720997512 720781565 720648766 720687449 720803738 720842540 720756590 720674813 720792592 721111059
2659.7 721111059 721385717 721423149 721293032 721211791 721319258 721548796 721690297 721597016 721363902 721247017
2680.1 721247017 721351683 721495807 721447110 721186221 720893025 720774889 720887601 721033692 720964313 720701218
$$ packed form
2533.2G24366128q2433j02699J1921J75894K08854M4048j88768l09944k25902l8802
2553.6G23858297M4584l7193j70112j78933l2544O1750n5909k96175m84348m84645
2574G22224772k90811r0063o2704j73569k35319j39832K1636P4387l4332j91093k21789
2596.4G20881283m9114J85072K51949R5666r4772j12176L5644J86384J81317k9862
2616.8G21531391k84433l48270k05696j8954P2956L1829m0412J192J31130J81675O6579
2639.3G21118987j21475k15947j32799L8683J16289L8802q5950q1777J17779L18467
2659.7G21111059K74658L7432j30117q1241J07467K29538J41501r3281k33114j16885
2680.1G21247017J04666J44124m8697k60889k93196j18136J12712J46091o9379k63095
$$ plain form
2700.5 720701218 720466018 720407546 720478237 720490038 720325410 720085502 719984114 720104218 720308483 720365882
2720.9 720365882 720179975 719910800 719783068 719781041 719634175 719063640 718104482 717288315 717191279 717725694
2741.2 717725694 718280852 718462884 718334198 718151093 718087852 718114555 718063414 717803359 717412531 717119813
2761.6 717119813 717010081 716936767 716772258 716568768 716484904 716616869 716869175 717021585 716901004 716547072
2782 716547072 716202080 716038167 715976536 715813994 715476871 715131640 714967012 714953125 714893103 714588821
2802.4 714588821 714042783 713523567 713286698 713277280 713195205 712804675 712176621 711639047 711402595 711347699
2822.8 711347699 711210787 710854352 710398257 710056007 709850371 709599018 709128797 708452582 707770824 707284451
2843.2 707284451 706983328 706673503 706191540 705564022 704972208 704529703 704161704 703703344 703081727 702407658
$$ packed form
2700.5G20701218k35200n8472P0691J1801j64628k39908j01388J20104K04265N7399
2720.9G20365882j85907k69175j27732k027j46866n70535r59158q16167r7036N34415
2741.2G17725694N55158J82032j28686j83105o3241K6703n1141k60055l90828k92718
2761.6G17119813j09732p3314j64509k03490q3864J31965K52306J52410j20581l53932
2782G16547072l44992j63913o1631j62542l37123l45231j64628j3887o0022l04282
2802.4G14588821n46038n19216k36869r418q2075l90530o28054n37574k36452n4896
2822.8G11347699j36912l56435m56095l42250k05636k51353m70221o76215o81758m86373
2843.2G07284451l01123l09825m81963o27518n91814m42505l67999m58360o21617o74069
$$ plain form
2863.6 702407658 701801240 701187968 700421095 699507892 698568404 697770894 697272360 697024465 696825624 696556270
2884 696556270 696243107 695929289 695572615 695112109 694502592 693722248 692861915 692083240 691448450 690882206
2904.4 690882206 690226793 689377189 688324273 686932921 684855640 681690991 677076221 670593619 661496520
2922.8 661496520 648680210 632395327 617256045 611074626 617502987 631854177 646384656 656732261
2939.1 656732261 662332535 664105952 663394392 661813796 660771966 661076903 662960887 666039526 669496953
2957.4 669496953 672682345 675374687 677545905 679234385 680595338 681815445 683022439 684209764
2973.8 684209764 685247719 686076164 686714232 687156916 687422216 687474906 687099457 685980916 683702052
2992.1 683702052 679480970 671972394 659889102 643839359 628651500 621579707 624678314 632730246
$$ packed form
2863.6G02407658o06418o13272p66873r13203r39488p97510m98534k47895j98841k69354
2884F96556270l13163l13818l56674m60506o09517p80344q60333p78675o34790n66244
2904.4F90882206o55413q49604j052916j391352k077281l164649m614770o482602r097099
2922.8F61496520j2816310j6284883j5139282o181419O428361J4351190J4530479J0347605
2939.1F56732261N600274J773417p11560j580596j041830L04937J883984L078639L457427
2957.4F69496953L185392K692342K171218J688480J360953J220107J206994J187325
2973.8F84209764J037955Q28445O38068M42684K65300N2690l75449j118541k278864
2992.1F83702052m221082p508576j2083292j6049743j5187859p071793L098607Q051932
$$ plain form
3008.4 632730246 640655637 647654533 654327452 660234749 664767146 668222964 671285868 674178541
3024.7 674178541 676666975 678645194 680268884 681651533 682753623 683582425 684313059 685039699 685652435
3043.1 685652435 686053514 686289430 686477244 686687171 686973155 687350452 687666655 687814295 687885940 688009262
3063.5 688009262 688243270 688516855 688718498 688868999 689070761 689408004 689861953 690235853 690392733 690378726
3083.9 690378726 690294206 690314949 690484345 690599322 690581560 690542459 690547705 690589190 690601230 690534830 690438092
3106.3 690438092 690321743 690150082 690062761 690210938 690422237 690452218 690303147 690129995 690082371 690174937
3126.7 690174937 690247655 690182209 690082014 690059602 690125644 690204561 690147579 689980507 689849854 689801216 689829111
3149.2 689829111 689873159 689775944 689500272 689214706 689020216 688870788 688699186 688477218 688235283 688018918
$$ packed form
3008.4F32730246P925391O998896O672919N907297M532397L455818L062904K892673
3024.7F74178541K488434J978219J623690J382649J102090Q28802P30634P26640O12736
3043.1F85652435M01079K35916J87814K09927K85984L77297L16203J47640P1645J23322
3063.5F88009262K34008K73585K01643J50501K01762L37243M53949L73900J56880j4007
3083.9F90378726q4520K0743J69396J14977j7762l9101N246M1485J2040o6400r6738
3106.3F90438092j16349j71661q7321J48177K11299K9981j49071j73152m7624R2566
3126.7F90174937P2718o5446j00195k2412O6042P8917n6982j67072j30653m8638K7895
3149.2F89829111M4048r7215k75672k85566j94490j49428j71602k21968k41935k16365
$$ plain form
3169.6 688018918 687831402 687613070 687320411 687007487 686709940 686406612 686098218 685748816 685328245 684890449
3189.9 684890449 684466481 684066176 683708966 683332503 682862461 682350159 681878388 681444943 681034446 680624902
3210.3 680624902 680198669 679795086 679417431 679031610 678610146 678125858 677598178 677094281 676669478 676327467
3230.7 676327467 675979614 675470352 674813390 674174428 673630238 673190534 672802210 672315478 671684682 671076953
3251.1 671076953 670644701 670317411 669918895 669416785 668932498 668574870 668305993 668041408 667763054 667402923
3271.5 667402923 666950524 666507840 666096389 665679872 665255249 664848030 664466262 664084852 663719594 663345754
3291.9 663345754 662825644 662131190 661369562 660615444 659916997 659273386 658599257 657810092 656902790 655943334
3312.3 655943334 654967606 653949559 652894437 651814044 650739789 649684548 648510396 647192419
$$ packed form
3169.6F88018918j87516k18332k92659l12924k97547l03328l08394l49402m20571m37796
3189.9F84890449m23968m00305l57210l76463m70042n12302m71771m33445m10497m09544
3210.3F80624902m26233m03583l77655l85821m21464m84288n27680n03897m24803l42011
3230.7F76327467l47853n09262o56962o38962n44190m39704l88324m86732o30796o07729
3251.1F71076953m32252l27290l98516n02110m84287l57628k68877k64585k78354l60131
3271.5F67402923m52399m42684m11451m16517m24623m07219l81768l81410l65258l73840
3291.9F63345754n20110o94454p61628p54118o98447o43611o74129p89165r07302r59456
3312.3F55943334r75728j018047j055122j080393j074255j055241j174152j317977
$$ plain form
3328.6 647192419 645859957 644522965 643191576 641893327 640464842 638817906 637118578 635437846
3345 635437846 633766711 632180393 630585253 628829539 627031684 625318170 623621941 621848822 620003402
3363.3 620003402 618204594 616445899 614548922 612459421 610352278 608394980 606585503 604897320
3379.6 604897320 603337526 601894319 600543141 599288344 598153710 597051919 595843732 594603181
3395.9 594603181 593497813 592493594 591434419 590290248 589213431 588273168 587375343 586475253 585597932
3414.3 585597932 584795833 584149718 583651304 583201766 582777441 582423389 582173228 581999719 581849694 581729531
3434.7 581729531 581641436 581599176 581704080 581929386 582208872 582622707 583057761 583408356 583818257 584314942
3455.1 584314942 584814131 585324883 585889161 586445749 586938798 587427735 587933898 588442922 588999689 589584768
$$ packed form
3328.6F47192419j332462j336992j331389j298249j428485j646936j699328j680732
3345F35437846j671135j586318j595140j755714j797855j713514j696229j773119j845420
3363.3F20003402j798808j758695j896977k089501k107143j957298j809477j688183
3379.6F04897320j559794j443207j351178j254797j134634j101791j208187j240551
3395.9E94603181j105368j004219j059175j144171j076817r40263q97825r00090q77321
3414.3E85597932q02099o46115m98414m49538m24325l54052k50161j73509j50025j20163
3434.7E81729531q8095m2260J04904K25306K79486M13835M35054L50595M09901M96685
3455.1E84314942M99189N10752N64278N56588M93049M88937N06163N09024N56767N85079
$$ plain form
3475.5 589584768 590077281 590547085 591116428 591552138 591759801 591956615 592099190 592090249 592170656 592583358
3495.9 592583358 593285799 594215274 595484853 596903443 598004222 598918319 599863648 600575924 601029694
3514.2 601029694 601481855 602021992 602621496 603315651 604019344 604560733 604984343 605353713 605800629 606764436
3534.6 606764436 608419001 610322595 612144828 614032447 616235197 618472040 620128989 621538043
3551 621538043 623185754 624629140 625765443 626964748 628071904 628912091 630309701 632710040 634488523
3569.3 634488523 635114253 635903180 637285709 638922453 640647888 642226994 643554211 645499885 648573160
3587.7 648573160 650843263 651723146 653000116 654859424 656417310 657912672 659413338 660442948
3604 660442948 661628366 663765728 665957630 667540908 668739736 669581294 671208858 673434258 674178183
$$ packed form
3475.5E89584768M92513M69804N69343M35710K07663J96814J42575q941Q0407M12702
3495.9E92583358P02441R29475J269579J418590J100779R14097R45329P12276M53770
3514.2F01029694M52161N40137N99504O94155P03693N41389M23610L69370M46916R63807
3534.6F06764436J654565J903594J822233J887619K202750K236843J656949J409054
3551F21538043J647711J443386J136303J199305J107156Q40187J397610K400339J778483
3569.3F34488523O25730P88927J382529J636744J725435J579106J327217J945674L073275
3587.7F48573160K270103Q79883J276970J859308J557886J495362J500666J029610
3604F60442948J185418K137362K191902J583278J198828Q41558J627564K225400P43925
$$ plain form
3622.3 674178183 673647165 673948050 677153945 680296719 680429876 680239797 680721939 681293249 681872785
3640.7 681872785 682038724 681762576 682581723 685818672 688396990 687682569 686819136 687693834 688210130
3659 688210130 687965751 687792778 687275708 686896265 688180029 689361155 689043403 690421224 691898823
3677.4 691898823 690966606 689775407 688805163 687994897 688929379 691567123 692713261 692028761 691259623
3695.8 691259623 690865338 691010535 691866934 692127287 691235662 690688729 691745698 693695605 693848908
3714.1 693848908 692421854 691448510 691369116 691633165 691938877 692151427 691534162 690592945 690879941 692530274
3734.5 692530274 693973064 693300843 690896928 690190613 692604125 693120420 692142844 693794847 695195794
3752.9 695195794 693896890 692472875 692499995 692544401 691697240 691184878 691259980 691878438 692550123 692126155
$$ packed form
3622.3F74178183n31018L00885L205895L142774J33157j90079M82142N71310N79536
3640.7F81872785J65939k76148Q19147L236949K578318p14421q63433Q74698N16296
3659F88210130k44379j72973n17070l79443J283764J181126l17752J377821J477599
3677.4F91898823r32217j191199r70244q10266R34482K637744J146138o84500p69138
3695.8F91259623l94285J45197Q56399K60353q91625n46933J056969J949907J53303
3714.1F93848908j427054r73344p9394K64049L05712K12550o17265r41217K86996J650333
3734.5F92530274J442790o72221k403915p06315K413512N16295r77576J652003J400947
3752.9F95195794j298904j424015K7120M4406q47161n12362P5102O18458O71685m23968
$$ plain form
3773.3 692126155 691227853 691079974 691788852 692036688 691641271 691559553 691523015 691254079 690851629 690492451
3793.7 690492451 690630853 690588295 690811336 692279935 692307830 691674590 692263365 691690505 689858496 689191103
3814.1 689191103 690348148 690844953 691308975 692589462 692036986 690815628 690167785 689737320 689589262
3832.4 689589262 689331114 689770460 691278875 691845536 691407621 690847278 689613461 687558055 686331570
3850.8 686331570 689211011 693268955 692372143 689717650 688397586 688609123 689068615 688595355 688746214
3869.1 688746214 689608932 689303279 688245356 686915517 686513305 686997831 687007487 687623441 687931001 687447846
3889.5 687447846 688063264 688383639 687168539 686340690 686899006 687997878 688973844 689130187 688229859
3907.9 688229859 687339067 686870575 686517060 686689973 687352121 687527180 687208354 687164009 687168777 686742127
$$ packed form
3773.3F92126155q98302j47879P08878K47836l95417q1718l6538k68936m02450l59178
3793.7F90492451J38402m2558K23041J468599K7895o33240N88775n72860j832009o67393
3814.1F89191103J157045M96805M64022J280487n52476j221358o47843m30465j48058
3832.4F89589262k58148M39346J508415N66661m37915n60343j233817k055406j226485
3850.8F86331570K879441M057944q96812k654493j320064K11537M59492m73260J50859
3869.1F88746214Q62718l05653j057923j329839m02212M84526R656O15954L07560m83155
3889.5F87447846O15418L20375j215100q27849N58316J098872R75966J56343r00328
3907.9F88229859q90792m68492l53515J72913O62148J75059l18826m4345M768m26650
$$ plain form
3928.3 686742127 686520040 686822295 686818063 686239481 685634017 685414970 685613275 685660303 685484946 685626268
3948.7 685626268 685875475 685833573 685656905 685567319 685535192 685537457 685548902 685447752 685310543 685289204 685337067
3971.1 685337067 685381770 685416818 685381055 685277402 685211957 685191035 685105383 684946001 684803784 684669912 684475660
3993.5 684475660 684219182 683907747
3997.6 683907747
$$ packed form
3928.3F86742127k22087L02255m232n78582o05464k19047J98305M7028j75357J41322
3948.7F85626268K49207m1902j76668q9586l2127K265J1445j01150j37209k1339M7863
3971.1F85337067M4703L5048l5763j03653o5445k0922q5652j59382j42217j33872j94252
3993.5F84475660k56478l11435
3997.6F83907747
##END=$$ End of the data block
