##TITLE=$$ Begin of the data block
##JCAMP-DX=5.00 $$ ACD/SpecManager v 10.08
##SPECTROMETER/DATA SYSTEM=Varian
##DATE=20 Nov 2012 09:39:02
##DATA TYPE=INFRARED SPECTRUM
##DATA CLASS=XYDATA
##ORIGIN=
##OWNER=
##NPOINTS=3735
##FIRSTX=399.26403809
##LASTX=4000.35498047
##MAXX=4000.35498047
##MINX=399.26403809
##MAXY=79.97321320
##MINY=24.84225082
##XFACTOR=1.0000000000
##YFACTOR=0.000000100000000
##FIRSTY=53.33736801
##DELTAX=0.96440572
##XUNITS=1/CM
##YUNITS=TRANSMITTANCE
##XYDATA=(X++(Y..Y))
399.3E33373680l505401Q799095M412231O87599k344436j5178643n879821M274215
407E24638519p509689l151245K456131O981M994774L295059P969360J204949l391800
415.7E30513039N692215L791275l59612m752235Q312568n592842j3764229R15680J443711
424.3E26199570j5068P01294m629479l337059K378273K280884n578270l083038j351967
433E13565140m77257k65999n633087j729927N478401M622269q64830P70454J955643
441.7E17420807k99912j773796J085129N209351J592064J893005O24542j229515j882095
450.4E22639580K103424O081009j99013N655098K816620l699036L36075n125809j636467
459.1E28971481L79448k750587l163109L177109K551727n608978k004814M618377K884217
$$ plain form
399.3 533373680 529868279 538667374 543079605 543767204 541422768 526244125 520364304 524638519
407 524638519 517128830 513977585 516433716 516440697 521435471 524730530 532699890 533904839 530513039
415.7 530513039 536205254 539996529 539636917 534884682 543197250 537604408 523840179 524755859 526199570
424.3 526199570 526184502 526885796 522256317 518919258 521297531 523578415 518000145 514917107 513565140
433 513565140 513087883 512821884 507188797 505458870 510937271 515559540 514694710 515465164 517420807
441.7 517420807 517120895 515347099 516432228 521641579 523233643 525126648 525751190 524521675 522639580
450.4 522639580 524743004 530824013 530625000 536280098 539096718 535397682 535733757 530607948 528971481
459.1 528971481 529350929 526600342 523437233 526614342 529166069 523557091 521552277 526170654 529054871
467.7E29054871o088677m930954k183761k792435Q8692K0675K758789R99947k515869
476.4E14411278l363877j065101j282425l299027K48528l41568n49889j553802M106598
485.1E07310715M679374l313789k103386n64346K146263m51851l835106k10647Q38432
493.8E04495659J985359Q51822p03888k539368q46328J12991j247482j291085k753219
502.5D98064461j021614m94881J022453k162208l325310O65131o79741m63715j579361
511.1D90025215j768875l006058l250656l506584m024162j502610j927185p17353k431298
519.8D67890434J057892K981491n19218q36258j599083Q5335k548256l823891k780571
528.5D59907875n22308J811676n62516J613274K773438K750549K088432J173630K816429
$$ plain form
467.7 529054871 522966194 518035240 515851479 513059044 513147736 513168411 515927200 516927147 514411278
476.4 514411278 511047401 509982300 508699875 505400848 505649376 505307808 504757919 503204117 507310715
485.1 507310715 511990089 508676300 506572914 506008568 508154831 507702980 503867874 503657227 504495659
493.8 504495659 506481018 507332840 506628952 504089584 503243256 503356247 502108765 500817680 498064461
502.5 498064461 497042847 496547966 497570419 495408211 492082901 492748032 492068291 491604576 490025215
511.1 490025215 488256340 485250282 481999626 478493042 474468880 472966270 471039085 470321732 467890434
519.8 467890434 468948326 471929817 471410599 470574341 468975258 469060593 466512337 462688446 459907875
528.5 459907875 459385567 461197243 460634727 462248001 465021439 467771988 469860420 471034050 473850479
537.2D73850479L798027K679062J811523K970009K45095m16909K264099L410302L015709
545.9D93627396R30557J421890J158829J002540n85098l605232k963600k628823k282028
554.5D86076431j786308j066666j806488j137695L40576j385994q30459k57683k377548
563.2D75768166n372582m232101k542343m170990m300843m161720l075752l641968
570.9D44269867j026383j82037o981J700211j758042k34451J091805R36393L13759
579.6D45104141J001358K877274K639961M605370L726539L982811M253235M804916
587.3D72995605L427544J670456K446060K11678Q67920J437835J376686R94874k73247
596D85155411m86489r86557R9945r71717O92672J686402m95606j269722j391411L40691
$$ plain form
537.2 473850479 477648506 480327568 482139091 485109100 485354195 484937286 487201385 490611687 493627396
545.9 493627396 494557953 495979843 497138672 498141212 497556114 493950882 490987282 488358459 486076431
554.5 486076431 484290123 483223457 481416969 480279274 480619850 479233856 478403397 478145714 475768166
563.2 475768166 470395584 466163483 463621140 459450150 455149307 450987587 447911835 444269867
570.9 444269867 443243484 443061447 443054466 444754677 442996635 442762184 443853989 444790382 445104141
579.6 445104141 446105499 448982773 451622734 456228104 459954643 463937454 468190689 472995605
587.3 472995605 476423149 478093605 480539665 480751343 481619263 483057098 484433784 485428658 485155411
596 485155411 484668922 483682365 483782310 482810593 483503265 485189667 484694061 483424339 482032928 482373619
605.6D82373619J35918R30862q3008j92527J525230l30238J020736Q91304L89939J442871
615.3D88104706J248359R74999J434021L595467L135795J536598J401520K649384J712303
624E05793152M71802J920623J599961J012687J566468J886787J408157K106438K123375
632.7E19889450J096649J166802N32531o0730j718826j519050R19685K178459K186127
641.3E24671097N52978O72837J581535J433945L84292O3095k27317Q2626K090034o5078
651E31240044k471085j855316K22549J931458R70878J666298J786423P73583R51004
659.7E35215836Q89282P82165R70612l71285j859779q24051l45535m009094p898407
668.3E22549744R632797N988808J999473J834679J941833J069145m80613j744576j069755
$$ plain form
605.6 482373619 482509537 483440399 483357391 483164864 484690094 484359856 485380592 486271896 486661835 488104706
615.3 488104706 489353065 490328064 491762085 495357552 498493347 500029945 501431465 504080849 505793152
624 505793152 506264954 508185577 509785538 510798225 512364693 514251480 515659637 517766075 519889450
632.7 519889450 520986099 522152901 522685432 522624702 520905876 519386826 520306511 522484970 524671097
641.3 524671097 525224075 525896912 527478447 528912392 529296684 529359779 529132462 529215088 531305122 531240044
651 531240044 528768959 526913643 527136192 529067650 530038528 531704826 533491249 534264832 535215836
659.7 535215836 536105118 536887283 537857895 537486610 535626831 534802780 534457245 530448151 522549744
668.3 522549744 532182541 538171349 540170822 542005501 543947334 545016479 544535866 542791290 541721535
677E41721535o89965R0180N2490K61841J577225J588974J115150J933975K076912Q96988
686.7E50625305J213150K97165j897812j765060p11212p33338q66050j83526N21775
695.3E46500397J361274K21100r66072j262855j821976j543121k724305k749557k740860
704E34274025l111000q03795j54991o4011J3657M63333J336365J019668J666413K045936
713.7E36685600P42951K79884P58820O52122J999130K719078L003540N031662M894486
722.3E56767273L457642K298660K555694K950135J802787K019883K925605K189637
730.1E76967316J179733R87205J812516J653137J247635K305145J686058J404572J838874
738.7E91082191P80068l24974n49736j58577q52699q88443r52187o61659J25961j628265
$$ plain form
677 541721535 541031570 541121750 541174240 541436081 543013306 544602280 545717430 547651405 549728317 550625305
686.7 550625305 551838455 552135620 550237808 548472748 547761536 547028198 546162148 545978622 546500397
695.3 546500397 547861671 548082771 547116699 545853844 544031868 542488747 539764442 537014885 534274025
704 534274025 531163025 530359230 530204239 530140228 530153885 530617218 531953583 532973251 534639664 536685600
713.7 536685600 537428551 537708435 538467255 539119377 541118507 543837585 546841125 551872787 556767273
722.3 556767273 560224915 562523575 565079269 568029404 569832191 571852074 574777679 576967316
730.1 576967316 578147049 579134254 580946770 582599907 583847542 586152687 587838745 589243317 591082191
738.7 591082191 591862259 591537285 590987549 590828972 589976273 589087830 588135643 587473984 587599945 585971680
748.4E85971680k647972k745591k667312j842423j711235k236519l270454k558975
756.1E66291199q98094j775361l466911k778587j389275j529922j609001j671143q15773
764.8E50357132N89828Q14171J269875K042389L316154K806473J727371K616654M019966
773.5E69560013M069290L523102M612922M831086M531440L786927L269233K769699
781.2F00953712K718049M402275M605331L773270J106376Q87337K612915J044541Q02612
789.9F22906418J143341Q31528J832428K323341K794342M130821L233795J593934J522064
798.5F42312012J371155J524887J746902J762695M23508J153565L251037K631226K136917
807.2F58313904K128296K322464J748733J440582L92075p55234K6856k00424l26920
$$ plain form
748.4 585971680 583323708 580578117 577910805 576068382 574357147 572120628 568850174 566291199
756.1 566291199 565393105 563617744 560150833 557372246 555982971 554453049 552844048 551172905 550357132
764.8 550357132 550946960 551761131 553031006 555073395 558389549 561196022 562923393 565540047 569560013
773.5 569560013 573629303 577152405 581765327 586596413 591127853 594914780 598184013 600953712
781.2 600953712 603671761 608074036 612679367 616452637 617559013 618446350 621059265 622103806 622906418
789.9 622906418 624049759 624881287 626713715 629037056 631831398 635962219 639196014 640789948 642312012
798.5 642312012 643683167 645208054 646954956 648717651 649141159 650294724 653545761 656176987 658313904
807.2 658313904 660442200 662764664 664513397 665953979 666346054 665590820 665617676 665417252 665090332
815.9F65090332o95801n96084P88192K280503K149429J317444J750107L89175j424103
824.6F71049194k895736k714920k583542m058686l649902j907043p31125j129685p19833
833.3F50658722j104355j803970r20792j983795l727112n234299m728775l693428l678665
841.9F23783531k599983j778374p09419l12500o49147k48184j9226j1216j732444l046189
851.6F12676849k924499l127632k584267k382317k167053j192474j500702j249657
859.3E95548248R59015K045288J830368K320214K470741L075638L458481L053970L674011
868F18435974M867592N468903O024055P054291P107086O348801N476074M006042J706162
876.7F66494980J835480J170349j103211j867218k315902j129990q38852j208267j510849
$$ plain form
815.9 665090332 664394531 663798447 664586639 666867142 669016571 670334015 672084122 672473297 671049194
824.6 671049194 668153458 665438538 662854996 658796310 655146408 653239365 652508240 651378555 650658722
833.3 650658722 649554367 647750397 646829605 644845810 641118698 635884399 631155624 627462196 623783531
841.9 623783531 621183548 619405174 618695755 618383255 617734108 617485924 617466698 617455482 615723038 612676849
851.6 612676849 609752350 606624718 604040451 601658134 599491081 598298607 596797905 595548248
859.3 595548248 596507263 598552551 600382919 602703133 605173874 608249512 611707993 614761963 618435974
868 618435974 623303566 628772469 634796524 641850815 648957901 655306702 660782776 664788818 666494980
876.7 666494980 668330460 669500809 668397598 666530380 664214478 663084488 662245636 661037369 659526520
885.3F59526520j637116j868896k821274k936249l888550l978500l879700m255142
893F34261093l741493l016472k168465k163810j980400j320649j490020k082291j943703
901.7F14353790k013969k717781k781677l904839m348030l058395l576165m437713
909.4E87515221m083939l960495m323692n063095m490776m432221n388679m666253
917.2E51106071m195251m492722m793701l448333j699791j672974k329865j450538
924.9E27022896L8223p34291n29251k51122n2795P80296R23767J119767J285171K166100
934.5E31768761K046814K006187K109299K181663K416420K359619L438912L421821
942.2E51749496L261490K748413J325837K98423r39941k092590l543167m271584n099297
$$ plain form
885.3 659526520 657889404 656020508 653199234 650262985 646374435 642395935 638516235 634261093
893 634261093 630519600 627503128 625334663 623170853 621190453 619869804 618379784 616297493 614353790
901.7 614353790 612339821 609622040 606840363 602935524 598587494 595529099 591952934 587515221
909.4 587515221 583431282 579470787 575147095 570084000 565593224 561161003 555772324 551106071
917.2 551106071 546910820 542418098 537624397 534176064 532476273 530803299 528473434 527022896
924.9 527022896 527061119 526326828 525797577 525546455 525493660 526273956 527197723 528317490 529602661 531768761
934.5 531768761 533815575 535821762 537931061 540112724 542529144 544888763 548327675 551749496
942.2 551749496 555010986 557759399 559085236 559383659 558443718 556351128 552807961 548536377 543437080
950.9E43437080o034050n997696o377525o506462o967468o698837p250252p773438
958.6D89831352p949638r021416q672218r325676q611336q788185r820976r922333
966.3D17719574j0007019r101143r700127q986244r641876r375725r523735j0533943
974.1C40849762r756699r871025p969932r157639q891659p957153o890793n603561
981.8B74751301n758190l403359m755821l606644k882709j867562r81369j788482k34795
990.5B49472370j049862P46689k08759M42734Q83712L81241K094021K06966J723023
999.1B54692135Q04977J176663Q71334j49117J018601m1008J756134k34776p46746
1007.8B59148197m90341O3000Q28361l97892O17447m00333O92215k54326Q04977O75450
$$ plain form
950.9 543437080 537403030 531405334 525027809 518521347 511553879 504855042 497604790 489831352
958.6 489831352 481881714 472860298 464188080 454862404 446251068 437462883 427641907 417719574
966.3 417719574 407712555 398611412 388911285 379925041 370283165 360907440 351383705 340849762
974.1 340849762 331093063 321222038 313252106 304094467 295202808 287245655 280354862 274751301
981.8 274751301 268993111 265589752 260833931 257227287 254344578 252477016 251495647 249707165 249472370
990.5 249472370 248422508 249169197 248960438 249403172 250286884 250668125 252762146 252969112 254692135
999.1 254692135 255497112 256673775 257545109 257395992 258414593 258373585 260129719 259894943 259148197
1007.8 259148197 258657856 258720856 259549217 259151325 259768772 259368439 260060654 259806328 260611305 261286755
1017.5B61286755o28930J360760k84939J706963J229382J876812J656818Q88386L109760
1026.1B72201767J893177K856960Q45204J507606J449337R14479K423954J127891J954060
1034.8B87174435P19585J579475L69797P52220J716862L01876Q93688r02881J161270
1043.5B93766327K47288N03120O54793k33555J678028M49162K134132J267452K379132
1052.2C02845879K795429K987499L199749J684609M257965K195663L996944M651833
1059.9C28615570M356194N294761M498825O512947N507966O521568M911957L678932
1067.6C69898720K836113L53927k254524o884193o255722p137146o065598n638008
1075.3C38853569n523643l036080l595314j010780j878166j10398j66816J59301K450600
$$ plain form
1017.5 261286755 260657825 262018585 261733646 263440609 264669991 266546803 268203621 269092007 272201767
1026.1 272201767 274094944 276951904 277797108 279304714 280754051 281668530 284092484 285220375 287174435
1034.8 287174435 287894020 289473495 289843292 290595512 292312374 292614250 293507938 292605057 293766327
1043.5 293766327 294013615 294516735 295171528 294937973 296616001 297065163 299199295 300466747 302845879
1052.2 302845879 305641308 308628807 311828556 313513165 317771130 319966793 323963737 328615570
1059.9 328615570 332971764 338266525 342765350 349278297 354786263 361307831 366219788 369898720
1067.6 369898720 372734833 373088760 370834236 363950043 357694321 350557175 344491577 338853569
1075.3 338853569 333329926 330293846 326698532 325687752 323809586 323699188 323532372 323691673 326142273
1084C26142273P37572J856880R85794K964020J933899J832428L113021K592926L756257
1092.7C45915070J925773L890000K728042K519303K458763J361618K604637Q40568
1100.4C64243774J028672o52275K39753p8964n12352J153717N49889J879616N21240
1109.1C68373070K130241K225495K204132K515030J156120K600097R04999J453743
1116.8C83562927J693497K205315J415786J3657J007805J70631J919823J199570J310730
1125.5C94499741J428184J509247J881218N92956K479096J549721K070312K001915
1133.2D08012390J778221J526566n02815R40017m0970j509971l612404l701325l573036
1141.9C99316673m690551m212418n615349l882522m038888l655281l726654l928985
$$ plain form
1084 326142273 326879845 328736725 329722519 332686539 334620438 336452866 339565887 342158813 345915070
1092.7 345915070 347840843 351730843 354458885 356978188 359436951 360798569 363403206 364243774
1100.4 364243774 365272446 364620171 364859924 364780960 364268608 365422325 365972214 367851830 368373070
1109.1 368373070 370503311 372728806 374932938 377447968 378604088 381204185 382109184 383562927
1116.8 383562927 385256424 387461739 388877525 388891182 389898987 390069618 391989441 393189011 394499741
1125.5 394499741 395927925 397437172 399318390 399911346 402390442 403940163 406010475 408012390
1133.2 408012390 409790611 411317177 410814362 411754379 411713409 410203438 406591034 402889709 399316673
1141.9 399316673 394626122 390413704 384798355 380915833 376876945 373221664 369495010 365566025
1149.6C65566025k085572k562828p71064k365570j644478j517143k222901j386070
1157.3C51010399k007370M44946j831J789131J419106J379089K430420J860657L700027
1166C62024574K436257M409218M284820M267731M347420L836326O177406N108300O420898
1174.6D03312950O833305P041932O531868O469917Q105545O990356O933022N963554
1182.4D58182449N811425N699806N172195M704514M800606O084442M940986M859887
1190.1E00256310M880523M167900L379708K197990J724358R56306K74162k82898M197
1198.8E17558556O09359J342850J659355J560173K114983J653366J443977J527634
1206.5E29470253J441994Q17642Q95157J608238J481323K004967K013664K487641L180160
$$ plain form
1149.6 365566025 363480453 360917625 360146561 357780991 356136513 354619370 352396469 351010399
1157.3 351010399 349003029 349447975 349446144 351235275 352654381 354033470 356463890 358324547 362024574
1166 362024574 364460831 368870049 373154869 377422600 381770020 385606346 391783752 396892052 403312950
1174.6 403312950 410146255 417188187 423720055 430189972 438295517 445285873 452218895 458182449
1182.4 458182449 463993874 469693680 474865875 479570389 484370995 490455437 495396423 500256310
1190.1 500256310 505136833 509304733 512684441 514882431 516606789 517563095 517837257 517554359 517558556
1198.8 517558556 518167915 519510765 521170120 522730293 524845276 526498642 527942619 529470253
1206.5 529470253 530912247 531729889 532625046 534233284 535714607 537719574 539733238 542220879 545401039
1215.1E45401039L270912L194657L301925L173600J758575J140213R64737Q19969N3253
1223.8E63078880j006508o61125q468J66969K5597J59492O447P2441L15666m77753
1233.5E61671638j191864j397056j041794q49991q94623j105880r67865J16272L25279
1242.2E54664116J63574l0708N34935J291847J349831J013755L66555Q29773M84428
1250.8E60668106O42586J379738Q25348Q54301J124039J345215J062622P48863P87315
1259.5E69438133O86035P57103J294327J447525N91126K87513M71726Q24013Q85238
1268.2E76682739P05948J026459J222572Q33435O97365J203041J209641R55238l4714
1276.9E84501724k20604K96326k97279q97408j412887q36182l04756m87252m46891
$$ plain form
1215.1 545401039 548671951 551866608 555168533 558342133 560100708 561240921 562205658 563025627 563078880
1223.8 563078880 562072372 561411247 561402779 561569748 561595345 561754837 561761284 561833725 562149391 561671638
1233.5 561671638 560479774 559082718 558040924 557190933 556296310 555190430 554222565 554338837 554664116
1242.2 554664116 554827690 554796982 555331917 556623764 557973595 558987350 559353905 560183678 560668106
1250.8 560668106 561310692 562690430 563515778 564370079 565494118 566839333 567901955 568650818 569438133
1259.5 569438133 570124168 570881271 572175598 573623123 574214249 574501762 574973488 575797501 576682739
1268.2 576682739 577388687 578415146 579637718 580471153 581168518 582371559 583581200 584536438 584501724
1276.9 584501724 584281120 584577446 584280167 583382759 581969872 581133690 580828934 580341682 579894791
1285.5E79894791k09275L11966l8r0027j06277l41492p37991j453133j356964j548309
1295.2E74363251j942101j869697j120758r6054m1657k87857l63312k08359q62007
1303.9E67571449q56361l0022q55865j429940j596069j421051r29108q87680p0800
1312.5E59494553N82008O28052K27699J93977K25678p01904j469384j784477j911812
1321.2E55484390k160034k173576j986466j746139j516037j394272j346397j878167
1328.9E41283302j612167j887627k705688k900124l259849k674752k591781k202797
1336.7E21448517j551171l92227K68441m70467R35860N61332K47231K42576K36741
1345.3E21526833l19825r06906n15709j207428q49609m09355j86730j21269L82271
$$ plain form
1285.5 579894791 579685516 579997482 579997444 579907417 579801140 579459648 578721657 577268524 575911560 574363251
1295.2 574363251 572421150 570551453 569430695 569334641 569292984 569005127 568641815 568433456 567571449
1303.9 567571449 566715088 566685066 565829201 564399261 562803192 561382141 560453033 559565353 559494553
1312.5 559494553 560076561 560704613 560932312 561126289 561351967 560650063 559180679 557396202 555484390
1321.2 555484390 553324356 551150780 549164314 547418175 545902138 544507866 543161469 541283302
1328.9 541283302 539671135 537783508 535077820 532177696 528917847 526243095 523651314 521448517
1336.7 521448517 519897346 519505119 519773560 519303093 520238953 520800285 521047516 521290092 521526833
1345.3 521526833 521207008 520300102 519784393 518576965 517727356 517318001 517131271 517010002 517392273
1354E17392273Q95958l0480J71547l19862k82173p71141j760445j050873r19609j283149
1363.7E12042046o52771N12847J59531N94444R00765M01268P42569J02768Q60595n02662
1373.3E15161400p19185N16281P6027P24373J18370J201401J121483J352348J213188
1382E20765686Q23441J464691J458282K566262J974601J363373J152992J843796J497231
1390.7E34910355Q84323J747207J410065K026291K91443M62379P36542P60384k73476
1399.3E42955513j992264Q7128o20766m89158n52521j768875o37627l43246l24822
1408E36313362r74197r7924n188m68330r72938j159287o21986r98116l80897r16977
1417.7E29717522j47019j978760m14695J425667J2817J137390k04353K42004O94542
$$ plain form
1354 517392273 518288231 518257751 518429298 518109436 517827263 517056122 515295677 514244804 513325195 512042046
1363.7 512042046 511389275 511902122 512061653 512656097 513556862 513958130 514700699 514803467 515664062 515161400
1373.3 515161400 514442215 514958496 515034523 515758896 515877266 517078667 518200150 519552498 520765686
1382 520765686 521589127 523053818 524512100 527078362 529052963 530416336 531569328 533413124 534910355
1390.7 534910355 535794678 537541885 538951950 540978241 541269684 541732063 542468605 543228989 542955513
1399.3 542955513 540963249 541050377 540429611 539940453 539387932 537619057 536981430 536638184 536313362
1408 536313362 535339165 535241241 535236053 534767723 533794785 532635498 532013512 531015396 530634499 529717522
1417.7 529717522 529570503 527591743 527177048 528602715 528615532 529752922 529548569 529790573 530485115
1426.3E30485115n5046R03854L34206M75502o71692N39017L09715J12877J707954J052819
1436E35194321P68051l65257J687660J102829R30176R38262K09198J106682k34337
1444.7E41337585J97983j78795j40152j170044o12487Q19473n25704M88587q35304
1453.3E39381142K70347L6354k323455k077141k910080J014099j960678J036682j45874
1462E32321396L67203K056160j03608K999421J288147L163299K160416L364715M239235
1470.7E51856384K308007M929313J092873N210495K726097M480934M259567L440781
1478.4E80304451M729919L285218N733337L180046L565712K459107K018165L286972
1486.1F08562927R37004L403321J263046L453865J944504K630462L519669K455177
$$ plain form
1426.3 530485115 530430069 531333923 531668129 532143631 531471939 532010956 532320671 532433548 534141502 535194321
1436 535194321 535962372 535597115 537284775 538387604 539317780 540256042 540465240 541571922 541337585
1444.7 541337585 541535568 541356773 541216621 540046577 539434090 540253563 539727859 540216446 539381142
1453.3 539381142 539651489 539687843 537364388 535287247 532377167 533391266 531430588 532467270 532321396
1462 532321396 532688599 534744759 534641151 537640572 538928719 542092018 544252434 547617149 551856384
1470.7 551856384 554164391 559093704 560186577 565397072 568123169 572604103 576863670 580304451
1478.4 580304451 585034370 588319588 594052925 597232971 600798683 603257790 605275955 608562927
1486.1 608562927 609499931 612903252 614166298 617620163 619564667 622195129 625714798 628169975
1493.8F28169975M522553K316246K663955J884537J194077m95758P34482J856079L17077
1502.5F43163223K529145K112503L477935J88370o82068P113877R32693K707138M47464
1511.2F61990280J013718j322479P29599J280136n4245L152771k050248L954545L084487
1519.9F71778564J837082J777039k297134L738479J594238L90778j375732N76782j85623
1528.6F77834473j99051K322998Q71734K178498L72390J145707K471542J302414J960373
1537.2F90261078J491318J045227j0600968M886856J111451o52237L102874N07660
1545F91153259J150513J272888J979752J137848L24859l60718P48139J504974k50091
1553.6F98661423j604538p50962L317414L449707o245041p55920J072998M673080J181641
$$ plain form
1493.8 628169975 632692528 635008774 637672729 639557266 640751343 640255585 640990067 642846146 643163223
1502.5 643163223 645692368 647804871 651282806 651471176 650789108 657902985 658835678 661542816 661990280
1511.2 661990280 663003998 661681519 662411118 663691254 663637009 666789780 664739532 668694077 671778564
1519.9 671778564 673615646 675392685 673095551 676834030 678428268 678819046 677443314 678020096 677834473
1528.6 677834473 677635422 679958420 680830154 683008652 683381042 684526749 686998291 688300705 690261078
1537.2 690261078 691752396 692797623 682196655 687083511 688194962 687542725 690645599 691153259
1545 691153259 692303772 693576660 695556412 696694260 697019119 696658401 697406540 698911514 698661423
1553.6 698661423 697056885 696305923 699623337 703073044 696828003 696072083 697145081 701818161 702999802
1562.3G02999802J221695J053314n80673j59150j11007J218109K57492k739334L9367
1571G03199615J381531R00727N93719K216110P28379l080979N24826J049347k43606
1579.7G07269669o47889j84097n66788l39584l08762j21765j83258j71661l47214J9455
1589.3G04418106N20706m83093j030426p99713l64380j249390j333694j353531j500855
1598F96823730j209793j273651q41293q96072r39713j284790j252518j109314j723327
1606.7F86293259k382660j759568k245025l377075k102890k275315k154617k349472
1614.4F67646637m33807j54267p801895m34799p30591j712494k496872j570816k593384
1623.1F49717712o892623j457367j342774m12216k658043l222580r13925j050491q91304
$$ plain form
1562.3 702999802 704221497 705274811 704694138 704534988 704423981 705642090 705899582 703160248 703199615
1571 703199615 704581146 705481873 706075592 708291702 709020081 705939102 706463928 707513275 707269669
1579.7 707269669 706621780 706437683 705870895 705531311 705222549 705100784 704917526 704745865 704398651 704418106
1589.3 704418106 704938812 704455719 703425293 702625580 702261200 701011810 699678116 698324585 696823730
1598 696823730 695613937 694340286 693498993 692602921 691663208 690378418 689125900 688016586 686293259
1606.7 686293259 683910599 682151031 679906006 676528931 674426041 672150726 669996109 667646637
1614.4 667646637 667212830 667058563 659256668 658821869 658091278 656378784 653881912 652311096 649717712
1623.1 649717712 642825089 641367722 640024948 639612732 636954689 633732109 632818184 631767693 630876389
1631.7F30876389j451264Q0605q7052n886688k786293J92375j435470j114121l71704
1640.4F18016777j132698M23470j63613J306877K318993m54674q91609j560020J274223
1649.1F19137726P04765J720657L112717L071327o659965o26946K575760K148743K276115
1657.8F27460899J827660K050362J752395K001267J449814j047173J494865J227074
1665.5F38217163J193466J618576K285767J680450J931000L708954J558914K856217
1673.2F55050507L506164J612168p21207K017212K120285J497650J852951Q54492L124924
1681.9F70915146M403686J761170k666321M631348M386825K662277J754914J537933
1689.6F89386978J24054P27615J501999J559296K929230K919388k507477L148117M286957
$$ plain form
1631.7 630876389 629425125 629505730 629418678 623531990 620745697 620938072 619502602 618388481 618016777
1640.4 618016777 616884079 617307549 617143936 618450813 620769806 620315132 619423523 617863503 619137726
1649.1 619137726 619842491 621563148 624675865 627747192 621087227 620460281 623036041 625184784 627460899
1657.8 627460899 629288559 631338921 633091316 635092583 636542397 635495224 636990089 638217163
1665.5 638217163 639410629 641029205 643314972 644995422 646926422 650635376 652194290 655050507
1673.2 655050507 658556671 660168839 659447632 661464844 663585129 665082779 666935730 667790222 670915146
1681.9 670915146 675318832 677080002 674413681 679045029 683431854 686094131 687849045 689386978
1689.6 689386978 689511032 690238647 691740646 693299942 696229172 699148560 696641083 699789200 704076157
1698.3G04076157L978653o05088k544021L897552K518463J516648K09808J008911m93393
1707G13563690Q32138K702866K133636J565552J584625J775437K003555J318436K29
1715.6G27480164J951370k29340o030960K972641K730484J657181J520615J327514
1723.4G33379669M86756J236801J446838P23496J057128R42765n57099n96237K453003
1732G40573120K911682k161789m325638L249207L258972J075592K096863J247940j780014
1740.7G46145935J447907Q75701j84783m85764J250763Q67538K72522N82962l76129
1749.4G50396652K327194p44247j097488J999588J006469R32465Q82645n18799l78037
1758.1G54806442J034165J123275J699982o38199j592331J121674N24292O25076P70493
$$ plain form
1698.3 704076157 708054810 707449722 704905701 708803253 711321716 712838364 713048172 714057083 713563690
1707 713563690 714395828 717098694 719232330 720797882 722382507 724157944 726161499 727479935 727480164
1715.6 727480164 729431534 729202194 723171234 726143875 728874359 730531540 732052155 733379669
1723.4 733379669 733866425 735103226 736550064 737273560 738330688 739273453 738716354 738120117 740573120
1732 740573120 743484802 741323013 736997375 740246582 743505554 744581146 746678009 747925949 746145935
1740.7 746145935 747593842 748469543 748284760 747798996 749049759 749917297 750189819 750772781 750396652
1749.4 750396652 752723846 751979599 750882111 752881699 753888168 754820633 755703278 755184479 754806442
1758.1 754806442 755840607 756963882 758663864 758025665 756433334 757555008 758079300 758704376 759474869
1766.8G59474869Q27560r01718O37589K275924M87824j618195j909485K508164J557693
1775.4G63340225r01336O30416J75171Q09937K69012n58243L51410J194382J341934
1784.1G66652908m46243j12991N66406N45578j4191L65067P22198K92511j047363j167908
1793.8G66355972J603318P12585R0027J535263J647949L40653j128922M62418p57370
1802.4G70861893o68946q3465m83933O50025R14077O38276P79800J369324K63519N99289
1812.1G74839859N49774m95987n8975m19312k7389q45337n26123M65317O14013J222382
1821.7G75318222P44247J492920Q20923j219482L40347J332092J164551r24530m242782
1830.4G74826508q65632J188050P23190P62024Q71124J002960J142121M73022P96204
$$ plain form
1766.8 759474869 760302429 759400711 760038300 762314224 762802048 761183853 759274368 761782532 763340225
1775.4 763340225 762438889 763069305 763244476 764054413 764323425 763765182 764116592 765310974 766652908
1784.1 766652908 766206665 766093674 766660080 767205658 767191467 767556534 768278732 768571243 767523880 766355972
1793.8 766355972 767959290 768671875 768761902 770297165 771945114 772285767 771156845 771619263 770861893
1802.4 770861893 770192947 770109482 769625549 770275574 771189651 771827927 772607727 773977051 774240570 774839859
1812.1 774839859 775389633 774893646 774834671 774415359 774387970 773542633 773016510 773481827 774095840 775318222
1821.7 775318222 776062469 777555389 778376312 777156830 777497177 778829269 779993820 779069290 774826508
1830.4 774826508 773960876 775148926 775872116 776634140 777505264 778508224 779650345 780123367 780919571
1839.1G80919571j89667n28412j024398p1183M81873l699417O15768J367340M73328
1847.8G78344803K90451J044540J403885L92761M54102n79758n39474p84302j139450
1856.4G78887558n84946q32443J70975K56424J002502J241913Q73489R20029O45218
1865.1G82580719O89087n24826k39029j463852k249451j17798J57319N63736M91409
1873.8G79887314M99878N97000J141739O58798J49918K32849m33579n92422r89609
1882.5G81151886k71835k24762l86048M3412O17065J951218Q78753n36956N53131J169510
1892.1G84945374J91726l43628o97784j416626L5171m5623q5678J79901J29089P64160
1901.8G83656082Q99887O77033k92893M0360J24969m82025l99551j24207o72226j015777
$$ plain form
1839.1 780919571 780729904 780201492 779177094 779105911 779587784 775888367 776504135 777871475 778344803
1847.8 778344803 778635254 779679794 781083679 781476440 781930542 781350784 780811310 780027008 778887558
1856.4 778887558 778302612 777470169 777641144 777897568 778900070 780141983 781015472 781935501 782580719
1865.1 782580719 783269806 782744980 782505951 781042099 778792648 778674850 778832169 779395905 779887314
1873.8 779887314 780387192 780984192 782125931 782784729 782934647 783167496 782733917 782141495 781151886
1882.5 781151886 780880051 780655289 780269241 780312653 780929718 782880936 783759689 783222733 783775864 784945374
1892.1 784945374 785137100 784793472 784095688 782679062 782714233 782668610 782582932 782762833 782891922 783656082
1901.8 783656082 784555969 785233002 784940109 784980469 785105438 784623413 784223862 784099655 783427429 782411652
1911.4G82411652N55725K53906M16794O42090O70547J547165j244736j221466M94614
1920.1G84526291P92160P00989j129456j065597j47934K79998J89286L67889J61743
1928.8G84675369J53504O48651Q9187r7656m15878J23215J03683j29394p9346n07965
1938.4G84563370J60217J02844M99802R1934j036224J11313K66342K04925K43378K73743
1948.1G85481644M7226M8065M120Q4839k594l48282K13012J85013J31989k22016l84216
1958.7G85238800J67847M89807N68695K91595L99857j96915J41526L82614n50537m98276
1968.3G86435013m85993l23944l25470M13056N48401K59628O34689K05765L60718K3041
1978G87744904J5182r308p50809p07321l33023M6768j03073K30332L12957M13361L65830
$$ plain form
1911.4 782411652 782967377 783221283 783638077 784280167 784950714 786497879 785253143 784031677 784526291
1920.1 784526291 785318451 786019440 784889984 783824387 783676453 783956451 784145737 784513626 784675369
1928.8 784675369 784828873 785477524 785566711 785469055 785053177 785176392 785280075 785150681 785071335 784563370
1938.4 784563370 784723587 784826431 785326233 785418167 784381943 784493256 784759598 784964523 785207901 785481644
1948.1 785481644 785528870 785576935 785581055 785665894 785663300 785315018 785528030 785713043 785845032 785623016 785238800
1958.7 785238800 785406647 785896454 786465149 786756744 787156601 786959686 787101212 787483826 786933289 786435013
1968.3 786435013 785949020 785625076 785299606 785712662 786261063 786520691 787155380 787361145 787721863 787744904
1978 787744904 787760086 787750778 786999969 786292648 785959625 786006393 785903320 786133652 786446609 786859970 787225800
1988.6G87225800J87149J138916O52694p94601r30786m38996m37469m85001o10351
1997.2G85507355m48838L76282L26004P81021Q53653K05307J90964J85394j17263p56989
2006.9G87102890q84552j288147o56738J24893q6594J23749J37863O48575Q51822O77872
2016.5G86751633P2555l12652m20075p70263p26700j294861r31168m17175j23673O7902
2026.2G81895523L68805J130829N49087N51072J55334p12128r52530p38372l21656
2034.9G81925964r85260j041488q88291K2431M99725L95889P10984J06659M41436K11716
2044.5G81399765P0953k76870r30329m72030p99790o27594m72564k7924M67529N66712
2054.1G78897858N65872J43509O84585N79834m9133n00183n43289p01294o76346K4567
$$ plain form
1988.6 787225800 787412949 788551865 789204559 788409958 787479172 787040176 786602707 786117706 785507355
1997.2 785507355 785058517 785434799 785760803 786541824 787395477 787600784 787791748 787977142 787859879 787102890
2006.9 787102890 786218338 784930191 784273453 784398346 784311752 784435501 784573364 785221939 786073761 786751633
2016.5 786751633 786824188 786511536 786091461 785321198 784594498 783299637 782368469 781951294 781827621 781895523
2026.2 781895523 782264328 783395157 783944244 784495316 784650650 783938522 782985992 782247620 781925964
2034.9 781925964 780940704 779899216 779010925 779033356 779533081 779928970 780639954 780746613 781188049 781399765
2044.5 781399765 781470718 781193848 780263519 779791489 778991699 778364105 777891541 777863617 778331146 778897858
2054.1 778897858 779463730 779607239 780291824 780871658 780822525 780322342 779779053 779077759 778401413 778425980
2063.8G78425980m83933k93350J69525L89328N52521L80630O10886L80630L17307k976
2073.4G80446548j32827n55573r54819o25000m01763L78646L60108K96249N18646M84772
2083.1G79814987K48184J03455N90210K16522j69296n28336o49719l39355j48850l20892
2092.7G78816910o02417L15170P29446O74286K69623m9667L27225M04129L70254l52936
2102.4G80902023k55661n8670n14068p90329n08271L63236M50363P67288M76837L18070
2112G81150818Q23746L72161k82440o06842j11923k92969p81173n40390P8506P1793
2121.6G79881287k15912L80172O59562R89837M92020R9487L17383m654l51944j048431
2131.3G81198807r80911q10700k35214k8763J78680R66797M81262P02439N96466M19388
$$ plain form
2063.8 778425980 777942047 777648697 777818222 778207550 778760071 779140701 779751587 780132217 780449524 780446548
2073.4 780446548 780313721 779758148 778803329 778178329 777776566 778155212 778515320 778811569 779330215 779814987
2083.1 779814987 780063171 780166626 780756836 780973358 780804062 780275726 779626007 779286652 779137802 778816910
2092.7 778816910 778214493 778529663 779259109 779933395 780203018 780153351 780480576 780884705 781254959 780902023
2102.4 780902023 780646362 780587692 780073624 779283295 778775024 779138260 779588623 780355911 780832748 781150818
2112 781150818 781974564 782346725 782064285 781457443 781345520 781052551 780271378 779730988 779809494 779881287
2121.6 779881287 779665375 780045547 780705109 781694946 782186966 782286453 782603836 782599182 782247238 781198807
2131.3 781198807 780217896 779407196 779171982 779143219 779321899 780288696 780769958 781472397 782068863 782488251
2140.9G82488251L41720k29797l45764n33905k57111p24563o49720m79660n03998L05253
2150.6G79410706P24411J067504Q09784P94297M74624K04544k67181j030502o00281
2159.3G81587906p43179m95224m6540M77982L89328M27322J433869R60617O71768J19324
2168.9G84783173M9743J80207l34549o60019j252976l48434o0806K81295P68357O40182
2178.5G84046173J336899J280823R13467P9193L0060J85699l64532o62994r92585p07397
2188.2G85144806l11890O36292O64673O15005J424179J191101O83670L28522N63431
2196.9G90939789m8065r25522j046982q29697l79028m83627M8675P22122Q13065Q40225
2206.5G89650955J407013J369324N32455o7291n38711k27967p33108q01163l76358
$$ plain form
2140.9 782488251 782829971 782600174 782254410 781720505 781463394 780738831 780089111 779609451 779105453 779410706
2150.6 779410706 780135117 781202621 782012405 782806702 783281326 783485870 783218689 782188187 781587906
2159.3 781587906 780844727 780349503 780302963 780780945 781170273 781597595 783031464 783992081 784663849 784783173
2168.9 784783173 784832916 785013123 784678574 784018555 782765579 782417145 782356339 782637634 783405991 784046173
2178.5 784046173 785383072 786663895 787577362 787656555 787686615 787872314 787507782 786844788 785852203 785144806
2188.2 785144806 784832916 785469208 786133881 786748886 788173065 789364166 790047836 790376358 790939789
2196.9 790939789 790891724 789966202 788919220 788089523 787710495 787226868 787275543 787997665 788810730 789650955
2206.5 789650955 791057968 792427292 792959747 792892456 792353745 792125778 791392670 790591507 790215149
2215.2G90215149k63214K24609L54080J069870J110917J251907P91473k6169K65656
2223.9G94994278m39529n03235m70124m17404k13852j46026K62451K09961M87900N63507
2233.5G94327927O30493L35998M18549O31485r995n46188r20410l19748n11017k12097
2243.2G93824997M71649K20947N92652O92215P96051L55072L30887L7231n59387k23236
2252.8G96539078l87726j82800l29972j87454n3711K60544P81784J96457K29645J21307
2262.4G96987152K42767K74888J82418K27661q1176j31378n28794k87857j57089r308
2272.1G96719284j5411R3994N56869N56259R90830L23486K06375L00446j92108r9945
2281.7G99440079k93427j51672m47540m57383m53720J64719N96924K72445N01938L4790
$$ plain form
2215.2 790215149 789951935 790176544 790530624 791600494 792711411 793963318 794754791 794728622 794994278
2223.9 794994278 794554749 794051514 793581390 793163986 792950134 792804108 793066559 793276520 793764420 794327927
2233.5 794327927 794958420 795294418 795712967 796344452 796334457 795788269 794867859 794548111 794037094 793824997
2243.2 793824997 794296646 794517593 795110245 795802460 796598511 796953583 797284470 797321701 796762314 796539078
2252.8 796539078 796151352 795968552 795638580 795451126 795397415 795657959 796439743 796636200 796865845 796987152
2262.4 796987152 797229919 797504807 797687225 797914886 797833710 797702332 797173538 796885681 796728592 796719284
2272.1 796719284 796703873 796797867 797354736 797910995 798901825 799225311 799431686 799732132 799540024 799440079
2281.7 799440079 799146652 798994980 798547440 798090057 797636337 797801056 798397980 798670425 799172363 799207153
2291.4G99207153M26255M8141j56631J12991o35605m15039n36270k27356m82864m25873
2301G96914902N8059J42975M44413K18963L42178n13916J68076J8845q76389m08249
2310.7G96509857j266784m19541r28726l04794N31768k02560O12411m54864k4796K98768
2320.3G94350739n38025q75550o16302q45108j920014m61044p74765m73862m21219
2329G87424850o03408K20184M86526J977387Q39310Q32672J17264j098633j972580
2337.7G88223572k617417m80957m67453K98767k92968j679J803513J598739J374665
2346.3G89438782J059036K381210J275559q18939k044373l012695k930069k201996
2354.1G83146515o68945n94712o68182n98374j11312N13916M45633J465606J28022
$$ plain form
2291.4 799207153 799633408 799681549 799524918 799637909 799002304 798587265 798050995 797823639 797340775 796914902
2301 796914902 796972961 797115936 797560349 797779312 798121490 797607574 797775650 797794495 796918106 796509857
2310.7 796509857 795243073 794823532 793894806 793590012 794121780 793919220 794531631 794076767 794051971 794350739
2320.3 794350739 793812714 792937164 792320862 791475754 789555740 789094696 788319931 787846069 787424850
2329 787424850 786821442 787041626 787528152 789505539 790344849 791177521 791294785 790196152 788223572
2337.7 788223572 785606155 785125198 784657745 784956512 784663544 784661865 786465378 788064117 789438782
2346.3 789438782 790497818 792879028 794154587 793335648 791291275 788278580 785348511 783146515
2354.1 783146515 782477570 781882858 781214676 780616302 780504990 781018906 781464539 782930145 783058167
2362.7G83058167O23550R34906j367188j676254J15357R98077J315079J274109N47103
2371.4G85822906K302475K563859J432266Q73565M07868P00226M41742j46637o51703
2380.1G93746567q0185L97796P46689P27692M82559J297989R50546N89142L30429M807
2389.7G99194031q4229o08673p29904j053238o48270p01141k87323P10907L69034N36423
2399.4G96697617N98297P87582M30679n5770j57013p79801q25119p22198m67453o81916
2409G94824905l26919K94571K60696N19715L77655K74047O028k1363k40402n66788
2418.7G95402145o68106j012726r82284r17664j69220J52359M60892O85654J73416
2427.3G93124466L58963K46887q2321p76901o31943m11835q01544l67355o35376o26679
$$ plain form
2362.7 783058167 783681717 784616623 783249435 781573181 781688538 782686615 784001694 785275803 785822906
2371.4 785822906 788125381 790689240 792121506 792995071 793402939 794103165 794544907 794398270 793746567
2380.1 793746567 793666382 794064178 794810867 795538559 796021118 797319107 798269653 798858795 799189224 799194031
2389.7 799194031 799109802 798501129 797771225 796717987 796069717 795368576 795081253 795792160 796161194 796697617
2399.4 796697617 797295914 798083496 798514175 798458405 798301392 797521591 796696472 795974274 795506821 794824905
2409 794824905 794497986 794792557 795053253 795572968 795950623 796224670 796230698 796209335 795968933 795402145
2418.7 795402145 794734039 793721313 792739029 791821365 791652145 791804504 792265396 792951050 793124466
2427.3 793124466 793483429 793730316 793647995 792871094 792239151 791827316 791025772 790658417 790023041 789396362
2437G89396362k10724J76163J79672j3733L04261L22189L23792j89820n00488q63571
2446.6G88924103q73261m02984n60379m52576l38287O5918P8964J80359L04489K17438
2456.3G87143784M89120j01852k13318l47519p17316j069107j000366j70212j73035
2465G83840179k7999q0033J5106K54059K88620L25012l70636m01535j97219j59684
2474.6G83485870l51333q20313j051941n82580L3111n7373L73535N48249N87692K55508
2484.2G82420425j41372J5793m54865o04401p81478n28260n45196n03845k04468n84870
2493.9G78087463M62952Q41217N42832M57458J58615J19019n40543n10254l58734n51681
2503.5G78708344n96619n41001k45285J48240J79596N950N74036O16684M69818k2507
$$ plain form
2437 789396362 789185638 789361801 789541473 789527740 789832001 790154190 790477982 790288162 789787674 788924103
2446.6 788924103 788050842 787647858 787087479 786634903 786296616 786362534 786441498 786621857 786926346 787143784
2456.3 787143784 787632904 787531052 787317734 786970215 786252899 785183792 784183426 784013214 783840179
2465 783840179 783812180 783732147 783747253 784001312 784289932 784614944 784244308 783842773 783645554 783485870
2474.6 783485870 783134537 782314224 781262283 780679703 780712814 780655441 781028976 781577225 782164917 782420425
2484.2 782420425 782279053 782294846 781839981 781235580 780454102 779925842 779380646 778876801 778672333 778087463
2493.9 778087463 778550415 779391632 779934464 780391922 780550537 780669556 780129013 779618759 779260025 778708344
2503.5 778708344 778111725 777570724 777325439 777473679 777653275 777659225 778233261 778849945 779319763 779297256
2513.2G79297256m18853l81928o45904k27661q43583r21020k94876l8834N81436K40479
2522.8G76346512M12979K73132q2779J60370k62756l19367l52935q73337p90634l05939
2532.5G74205246o32629m99573J24283K49939J57241Q4305M08249Q4076l54767o48803
2542.1G73177567o15693l42788n11170p47452r34143j11160O4316J06354N75790J53122
2551.7G70814743P3471K3728l9521o44150q01315m79812n95704l43780n22995n52063
2561.4G66932602m17938J43966L35389K22168N76629j61285o59867m56848k35748n98450
2571G65680618o06689l24860n81207j03149j11771k11182j48773P7820K21329m0284
2580.7G63851852L8529o08292n13839k03858k99072k42615m14352j2284o8054l20282
$$ plain form
2513.2 779297256 778878403 778496475 777850571 777622910 776779327 775858307 775563431 775524597 776106033 776346512
2522.8 776346512 776759491 777032623 776949844 777110214 776847458 776528091 776175156 775301819 774511185 774205246
2532.5 774205246 773572617 773073044 773197327 773447266 773604507 773688812 774097061 774181137 773826370 773177567
2542.1 773177567 772561874 772219086 771707916 770960464 770026321 769915161 769979477 770085831 770661621 770814743
2551.7 770814743 770888214 770911942 770872421 770228271 769426956 768947144 768351440 768007660 767484665 766932602
2561.4 766932602 766514664 766658630 766994019 767216187 767792816 767631531 766971664 766514816 766279068 765680618
2571 765680618 765073929 764749069 764167862 764064713 763952942 763741760 763592987 763670807 763892136 763851852
2580.7 763851852 763890381 763282089 762768250 762564392 762265320 762022705 761608353 761596069 761528015 761207733
2590.3G61207733O1493O67725L47747k75421m90646n96390k96478l32184M4708k50549
2600G60087738m91943Q0108m18472n94406J44348P20596K5483k49939j34049l64151
2609.6G58805313k35824l09449k9525p39823q65249m59977m87289M5929k71835j35422
2619.3G55316849j30768J02692J80816r14383r90143j58844L41645q03452j067505
2627.9G51876907o31332o26984l0212m45862o78406m62265o2637J43967k65656o18896
2637.6G48198624q46405l66288j77307m82635q73795j045227p67593n7831j85852q24890
2647.2G42570801j32828k51923m56008j47095j97754m24881r47800p50122q32977m52423
2656.9G37976990k00119p57752o74972l83759k3575j65558o5460j37405m16412m18244
$$ plain form
2590.3 761207733 761269226 761936951 762284698 762009277 761518631 760922241 760625763 760293579 760338287 760087738
2600 760087738 759595795 759675903 759257431 758663025 758807373 759527969 759553452 759303513 759169464 758805313
2609.6 758805313 758569489 758260040 758230515 757490692 756625443 756165466 755678177 755724106 755452271 755316849
2619.3 755316849 755186081 755288773 755469589 754555206 753565063 753406219 753747864 752944412 751876907
2627.9 751876907 751245575 750618591 750588379 750142517 749464111 749001846 748939209 749083176 748817520 748198624
2637.6 748198624 747352219 746985931 746808624 746325989 745452194 744406967 743639374 743581543 743395691 742570801
2647.2 742570801 742437973 742186050 741730042 741582947 741385193 740960312 740012512 739262390 738429413 737976990
2656.9 737976990 737776871 737019119 736344147 735960388 735936813 735771255 735705795 735568390 735151978 734733734
2666.5G34733734n98831l52097p46536j189117n47715Q2398n42603o76651K02485K05764
2676.1G30570831M0894o1035N8059l93829q55942o34231n93186m70123q43735p32193
2685.8G26085510n18799k62069K02408M09164L01743q36716o19431K1439j69220n10330
2695.4G24103699r57032q98666q31680k87857l75901m93774r9564m2038k15377m72412
2705.1G19429398P4768l12882m63943k98462j152573j057052n61448l55377o27746
2713.8G14674683o34995k35901K21558J26877n13764k83355l20588k60849n50842j050949
2723.4G11171875l62930k54212q61664q99658j28937J65940k13394m19159o7978J52740
2733G08282623l70025o26755o53229m19235n62821o49642l02124k35749j53274l86353
$$ plain form
2666.5 734733734 734134903 733782806 733036270 731847153 731299438 731381836 730839233 730162582 730365067 730570831
2676.1 730570831 730611725 730550690 730608749 730214920 729358978 728724747 728131561 727661438 726817703 726085510
2685.8 726085510 725566711 725304642 725507050 725916214 726217957 725381241 724761810 724783249 724614029 724103699
2695.4 724103699 723146667 722248001 721416321 721128464 720752563 720258789 720159225 720117187 719901810 719429398
2705.1 719429398 719504166 719191284 718727341 718428879 717276306 716219254 715657806 715302429 714674683
2713.8 714674683 714039688 713803787 714025345 714152222 713638458 713355103 713034515 712773666 712222824 711171875
2723.4 711171875 710808945 710554733 709693069 708793411 708664474 708830414 708617020 708197861 708129883 708282623
2733 708282623 707912598 707285843 706632614 706213379 705650558 705000916 704698792 704463043 704309769 703923416
2742.7G03923416j66244j15662k16446N5084j4801j81350m56772m71192q98056q44269
2752.3G00613708k83050j49384K66495q3542o51855l23944Q8577j13602J51368K18276
2762F99733047n37567n82733n74875l74221l45231l98178j14288j22910p7896j07498
2771.6F96497650J07956o7520k29950l26691n44891l65372o51932r00268p36313q392
2781.3F92774277k04697q43658l84827o2332l9902m44946j27716k747m73862m45480
2790.9F89744110p15866o70471n35355m89654r43833j029663m93316l52402j96686
2799.6F84316864n98755o39191o04782m59213l73077j202164j108475q11081q58993
2808.3F77661133m95682n04913j003189j077347j104889p91092l64380p55844p90253
$$ plain form
2742.7 703923416 703757172 703641510 703425064 703480148 703465347 703283997 702827225 702356033 701457977 700613708
2752.3 700613708 700330658 700181274 700447769 700364227 699712372 699388428 699477005 699363403 699514771 699733047
2762 699733047 699195480 698612747 698037872 697663651 697318420 696920242 696805954 696683044 696605148 696497650
2771.6 696497650 696605606 696538086 696308136 695981445 695436554 695071182 694419250 693518982 692782669 692774277
2781.3 692774277 692569580 691725922 691341095 691278763 691238861 690793915 690666199 690663452 690189590 689744110
2790.9 689744110 689028244 688357773 687822418 687332764 686388931 685359268 684865952 684513550 684316864
2799.6 684316864 683718109 683078918 682474136 682014923 681641846 680439682 679331207 678520126 677661133
2808.3 677661133 677165451 676660538 675657349 674580002 673475113 672684021 672319641 671563797 670773544
2816.9F70773544j101761p99789o66885j320191j057739j283722r70612j012115j127777
2825.6F61432953o97556j013031o69326q67691q00095o24085j032714j103440j368561
2834.3F53256454j328582j540680j295319j005249j066818j117478j348571j152726
2842F43401031j387710j118393r82361j481438j384086j582871j809196j496239j150589
2850.7F31008148j482773j607704j365623j272049o69670l62473j202545j756439j219406
2859.4F20069466j475792j979637j884232j954231k037926j836090j632004k168236
2867.1F05101318k104225j884422k191734k427483k694511k308922k485771k947655
2874.8E86056595k881241k626724k764931l012352k219849k090377k237740j813049
$$ plain form
2816.9 670773544 669671783 668871994 668205109 666884918 665827179 664543457 663572845 662560730 661432953
2825.6 661432953 660735397 659722366 659053040 658185349 657385254 656761169 655728455 654625015 653256454
2834.3 653256454 651927872 650387192 649091873 648086624 647019806 645902328 644553757 643401031
2842 643401031 642013321 640894928 639912567 638431129 637047043 635464172 633654976 632158737 631008148
2850.7 631008148 629525375 627917671 626552048 625279999 624610329 624247856 623045311 621288872 620069466
2859.4 620069466 618593674 616614037 614729805 612775574 610737648 608901558 607269554 605101318
2867.1 605101318 602997093 601112671 598920937 596493454 593798943 591490021 589004250 586056595
2874.8 586056595 583175354 580548630 577783699 574771347 572551498 570461121 568223381 566410332
2882.5E66410332j186257j022644j986198k080193j109619l52554o51283q11310o26412
2891.2E56583862o43730r8533j57967l2234o3935l97987l55034l41720J8539n92041
2900.8E53919220p60727l96996o63452k56118r3499p62558r14077o45790p57218l92418
2910.5E48276367j065864j773491j300049j446838r49364j619721k397461j767921
2918.2E35955658j862030j515312j473618j290207r17968j267624j195984j242218
2925.9E25190697j414681r45778m89769p29866l69339n0087m0626N29136P96166J110725
2935.6E23586578J053505R71451J651230K303009K253838J962318K326508K556305
2943.3E38664742K387161K083816K229767K742310K374000K271500K892074K698365
$$ plain form
2882.5 566410332 565224075 564201431 562215233 560135040 559025421 558672867 558021584 557210274 556583862
2891.2 556583862 555940132 555841599 555683632 555651398 555587463 555189476 554834442 554492722 554511261 553919220
2900.8 553919220 553158493 552761497 552098045 551841927 551748428 550985870 550071793 549426003 548668785 548276367
2910.5 548276367 547210503 545437012 544136963 542690125 541740761 540121040 537723579 535955658
2918.2 535955658 534093628 532578316 531104698 529814491 528896523 527628899 526432915 525190697
2925.9 525190697 523776016 522830238 522340469 521610603 521241264 521191177 521150551 521679687 522475853 523586578
2935.6 523586578 524640083 525611534 527262764 529565773 531819611 533781929 536108437 538664742
2943.3 538664742 541051903 543135719 545365486 548107796 550481796 552753296 555645370 558343735
2951E58343735K413101K818184L191986K876587K222595K524414K606087K313614K480736
2959.7E81791039K658348K631683J985550K153015K250366J951256K224998J984520
2967.4E99630775J565056J640663K481347K109336J336518J483917J641502J825753
2975.1F13714867J181335J470451J705170J319542J819801J748162J362877J204071
2982.8F25526276J313972R91783R53141J432533J441078Q85620N72128J178589P19452
2991.5F35014572P61490R60464N03197R64508P70188R45396P29828j60294l45688k75993
3001.1F39867668J64375L65983L85055J84937j19248j08871M20532J24664m84085k88238
3010.8F40512772o03600o43539r72710r50699o27823r35020n72357l06855m67834j046524
$$ plain form
2951 558343735 560756836 563575020 566767006 569643593 571866188 574390602 576996689 579310303 581791039
2959.7 581791039 584449387 587081070 589066620 591219635 593470001 595421257 597646255 599630775
2967.4 599630775 601195831 602836494 605317841 607427177 608763695 610247612 611889114 613714867
2975.1 613714867 614896202 616366653 618071823 619391365 621211166 622959328 624322205 625526276
2982.8 625526276 626840248 627832031 628785172 630217705 631658783 632544403 633116531 634295120 635014572
2991.5 635014572 635776062 636736526 637239723 638204231 638974419 639919815 640649643 640489349 640143661 639867668
3001.1 639867668 640032043 640398026 640783081 640968018 640848770 640739899 641160431 641285095 640801010 640512772
3010.8 640512772 639909172 639265633 638292923 637342224 636714401 635779381 635207024 634900169 634432335 633385811
3020.4F33385811q79517l56369k99988o26220j695786j699409j175766p28455o57196
3029.1F25267105r21860j096267j382790j161995j177025p76825j020622j601105j070213
3037.8F15058403p73926r32655j629334j510505j092682j102104j154404j700783j543846
3046.5F03618164p43751m52881q51860r63478j313668j769180j743965j754379j457863
3055.1E92567139j591797j234780o88934j178017j645965j170960p63931j439514j305504
3063.8E81547737r38759j195717j824569k183152j554603j210327r93271j191521j172180
3072.5E69283638j120911j176147j289177j636276r55506j115036j424484j508102
3080.2E59057999j880074j713028j534653q88595r88617j211472j379280j387329j227035
$$ plain form
3020.4 633385811 632506294 632149925 631849937 631223717 629527931 627828522 626652756 625924301 625267105
3029.1 625267105 624345245 623248978 621866188 620704193 619527168 618750343 617729721 616128616 615058403
3037.8 615058403 614284477 613351822 611722488 610211983 609119301 608017197 606862793 605162010 603618164
3046.5 603618164 602874413 602421532 601569672 600606194 599292526 597523346 595779381 594025002 592567139
3055.1 592567139 590975342 589740562 589051628 587873611 586227646 585056686 584292755 582853241 581547737
3063.8 581547737 580608978 579413261 577588692 575405540 573850937 572640610 571647339 570455818 569283638
3072.5 569283638 568162727 566986580 565697403 564061127 563105621 561990585 560566101 559057999
3080.2 559057999 557177925 555464897 553930244 553041649 552053032 550841560 549462280 548074951 546847916
3088.9E46847916j496544j283989j861458j375008q97255j534881j232643j350251
3096.6E35815887j212387j164703j324730j314697j183319j121064j589736j377182
3104.3E25528069j235390j153870j128540j364250j590309j647186j130867r85642
3112E15292015j185417j134911o14929j117210j771202j466675j571198j177215j024018
3120.7E04229240j306839j574592j582451j146202r00574r84955j193504r51920j345443
3129.4D93242760j094628p05948j211051j310044j655922j285591j197929j276589
3137.1D83505058j265945j253204o17486j025123j123581j399193j533966q24203o82831
3145.8D73779526p95403j403961j474419j250839q91380p57523r75647r76143j054687
$$ plain form
3088.9 546847916 545351372 544067383 542205925 540830917 539933662 538398781 537166138 535815887
3096.6 535815887 534603500 533438797 532114067 530799370 529616051 528494987 526905251 525528069
3104.3 525528069 524292679 523138809 522010269 520646019 519055710 517408524 516277657 515292015
3112 515292015 514106598 512971687 512356758 511239548 509468346 508001671 506430473 505253258 504229240
3120.7 504229240 502922401 501347809 499765358 498619156 497718582 496733627 495540123 494588203 493242760
3129.4 493242760 492148132 491442184 490231133 488921089 487265167 485979576 484781647 483505058
3137.1 483505058 482239113 480985909 480368423 479343300 478219719 476820526 475286560 474462357 473779526
3145.8 473779526 472984123 471580162 470105743 468854904 467963524 467206001 466230354 465254211 464199524
3154.5D64199524o55861j135330j221543p18536q26683p73773j381722j564865j034508
3163.1D54886703q00285r72977r77058j108017j444359j102485o23970j04371n22537
3171.8D47230644j039810r97696j463890j298828o32439p86133j298904q66356o42815
3180.5D38203773n59654n73959j132889p86705o06041q36601p36122n12810q65707
3189.2D31593285j305046j077958j109390q42285l87688j49460p42912r50966m23660
3197.9D24603920p09419p07741j001816p56607o12831j153336j040954r97734m14505
3206.5D17208977m02718n22919l19061m10194n98908o93550P7591k35214j092491j562996
3216.2D11448517j252403j04905k69355q08220j006813m93622k32086o85616q47854
$$ plain form
3154.5 464199524 463543663 462408333 461186790 460468254 459641571 458867798 457486076 455921211 454886703
3163.1 454886703 454086418 453113441 452136383 451028366 449584007 448481522 447857552 447753181 447230644
3171.8 447230644 446190834 445193138 443729248 442430420 441797981 441011848 439712944 438846588 438203773
3180.5 438203773 437644119 437070160 435937271 435150566 434544525 433707924 432971802 432458992 431593285
3189.2 431593285 430288239 429210281 428100891 427258606 426870918 426721458 425978546 425027580 424603920
3197.9 424603920 423894501 423186760 422184944 421428337 420815506 419662170 418621216 417623482 417208977
3206.5 417208977 416806259 416283340 415964279 415554085 414955177 414261627 414339218 414104004 413011513 411448517
3216.2 411448517 410196114 410091209 409821854 409013634 408006821 407513199 407281113 406595497 405747643
3224.9D05747643o37703K22892M0360q32024r24988n71403j81999l67127j006012r20143
3234.5D00569496k69012q5678j01090p83386q44154k24419k39525j24435k56424m73862
3244.2C97167511q30002q50868o14662m09928r7313l01590l65028l71628J44959K6817
3253.8C93498268o11381l85437l37906l47214r58672j060218m56620K632j27906n29862
3263.4C88685684q5258m48265n00489R652m3946k85606m11949k59133m42695j59188
3273.1C86058807m03137l60260k96860q70094j28517j85928k70043J7472j79749l36113
3282.7C83045578o52313k43492j37902k88963l06435n42869m92974p057L09677k78587
3292.4C80404663n11131l0670k83890p75871j83297o7253l47786j26533m20609o98547
$$ plain form
3224.9 405747643 405109940 405332832 405373192 404541168 403616180 403044777 402862778 402495651 401489639 400569496
3234.5 400569496 400300484 400214806 400113716 399330330 398486176 398261757 398022232 397897797 397641373 397167511
3244.2 397167511 396337509 395486641 394871979 394462051 394364738 394063148 393698120 393326492 393471451 393498268
3253.8 393498268 392886887 392501450 392163544 391816330 390857658 389797440 389340820 389343452 389215546 388685684
3263.4 388685684 388600426 388152161 387651672 387661324 387617378 387331772 386919823 386660690 386217995 386058807
3273.1 386058807 385655670 385295410 384998550 384128456 383999939 383814011 383543968 383561440 383381691 383045578
3282.7 383045578 382393265 382149773 382011871 381722908 381416473 380873604 380380630 380373573 380683250 380404663
3292.4 380404663 379893532 379862862 379578972 378803101 378619804 378552551 378204765 378078232 377657623 376959076
3302C76959076q52661m48837q3657l6125l510k20146J3428k48718o30875o31065r9297
3312.6C73717613J05973m75731l81203j48659J5564n08461p97996n23529l53737m00238
3322.3C70249596n32761O21872K93617j034241j024322k14920K45933n05142m25606
3330.9C67674026m65927l49388q8348n92156k83851j77841l86162n02548m07372n28068
3340.6C63892365l65105j46027l21655N4893m49371p20634n25666l73916j86310j72234
3350.2C60686340m9400o06956l16430l06244o07566n19104q73490m39644j80320P63
3359.9C56787949l0976k19269m34837n24788k55356o67190n80712k03552K55547j79939
3369.5C53946877j037293o70357m13971k39448k35558j02463l85818m64020R995k47269
$$ plain form
3302 376959076 376106415 375657578 375573921 375537796 375534286 375314140 375327568 375078850 374447975 373816910 373717613
3312.6 373717613 373823586 373347855 372966652 372817993 372833557 372325096 371527100 371003571 370649834 370249596
3322.3 370249596 369716835 370338707 370632324 369598083 368573761 368358841 368604774 368099632 367674026
3330.9 367674026 367208099 366858711 366770363 366178207 365894356 365716515 365330353 364827805 364420433 363892365
3340.6 363892365 363527260 363381233 363059578 363114471 362665100 361944466 361418800 361044884 360858574 360686340
3350.2 360686340 360636940 360029984 359713554 359407310 358799744 358280640 357407150 356967506 356787186 356787949
3359.9 356787949 356756973 356537704 356102867 355578079 355322723 354655533 354074821 353871269 354126816 353946877
3369.5 353946877 352909584 352239227 351825256 351585808 351350250 351247787 350861969 350397949 350407944 350160675
3379.2C50160675j06621j07956n12809j055375n14640L65142j20086n7259j12114l64837
3388.8C47574120k20108k08931k31591k42614m87557l48587K46353k94456n39170k6855
3398.4C45220604J58386K6512j79825K9183k10114l27377n8556J40687m89464n61829
3408.1C43748207J38359q1901M49600J91040m76418m96406q71926l68805K07291M80118
3417.7C42919159L19366L7766o8779j7738p2098m61045m25567l63922L12843L19862
3427.4C42499847n5542J13907j65214J03302q78j35612L92494K45972m10805J89705
3437C42777176P30553j9188K24456K94190j79329n98946k97393M37278N88761N49583
3446.7C44507141m61311l8605M15459K46391N97954o8283p8926M19235N20744J76964
$$ plain form
3379.2 350160675 350054054 349946098 349433289 348377914 347863274 348228416 348108330 348051071 347938957 347574120
3388.8 347574120 347354012 347145081 346913490 346670876 346183319 345834732 346081085 345786629 345247459 345220604
3398.4 345220604 345378990 345405502 345225677 345254860 345044746 344717369 344658813 344799500 344310036 343748207
3408.1 343748207 343886566 343804665 344254265 344445305 343968887 343472481 342600555 342231750 342439041 342919159
3417.7 342919159 343238525 343276291 343207512 343189774 343117676 342656631 342231064 341867142 342179985 342499847
3427.4 342499847 342444305 342558212 342392998 342496300 342495422 342359810 342752304 342998276 342587471 342777176
3437 342777176 343507729 343488541 343712997 344007187 343827858 343228912 342931519 343368797 343957558 344507141
3446.7 344507141 344045830 344007225 344422684 344669075 345267029 345198746 345119820 345539055 346059799 346236763
3456.3C46236763J21880K07786k16141J5412L63006N87120n8326K34451R88693J44158
3466C48624802m00658l38745K07786K71798K53715K50015M92745J021461r3040j92948
3475.6C50096931J051789Q95691j5984J63231M46930O48j78260L1318R93538N78079
3485.2C54063911J54572K91557l05519K90032O25343O88934M18015K79770M36973L43285
3494.9C57286873L47824l07198N00069Q39653J94626O75812R64431N28069m41628k14843
3504.5C60373688P78808P05223L19672J280708P71141p81669M17023O32362L0594l66249
3514.2C64161301N47485J102562L92647Q30841K56233J35880P30094J196061P47070
3522.9C70100174o99158M89617P60574O0005J39618P23801R74807J017571M53186l16734
$$ plain form
3456.3 346236763 346358643 346566429 346350288 346365700 346728706 347315826 347257500 347491951 348480644 348624802
3466 348624802 348224144 347885399 348093185 348364983 348618698 348868713 349361458 350382919 350289879 350096931
3475.6 350096931 351148720 352044411 352028427 352191658 352638588 352639236 352460976 352492294 353485832 354063911
3485.2 354063911 354218483 354510040 354204521 354494553 355119896 355808830 356226845 356506615 356943588 357286873
3494.9 357286873 357634697 357327499 357827568 358667221 358861847 359537659 360502090 361030159 360588531 360373688
3504.5 360373688 361152496 361857719 362177391 363458099 364229240 363447571 363864594 364496956 364527550 364161301
3514.2 364161301 364708786 365811348 366203995 367034836 367291069 367426949 368157043 369353104 370100174
3522.9 370100174 369401016 369890633 370651207 370711212 370850830 371574631 372549438 373567009 374020195 373703461
3532.5C73703461O56891Q19511J196098L93105o93245Q96797P30591N61409O89392
3541.2C78954010J050339P76214o256m2381L34511J303024j41144R11141J249389R70917
3550.8C85359764J442108r48791M26521O47697R51310J524696M18625J530418R61190
3559.5C92313538K29072L55721J892967P06215J25923M084816N70984p11899J05515
3568.2C99672852o27213K791214J387062R81102J217537J504250Q96682N94673J316948
3576.9D09735107J22528K135506J451225R1401J410637J712722J458092J037292M017258
3585.5D23171768J476669k075958J655007l72925K243347K340202K512360J734428
3593.2D32684898Q36563K756119j160774K396545L983345R33114J944542l95585N34707
$$ plain form
3532.5 373703461 374360352 375179863 376375961 376769066 376075821 376972618 377703209 378264618 378954010
3541.2 378954010 380004349 380780563 380774307 380731926 381066437 382369461 382228317 383139458 384388847 385359764
3550.8 385359764 386801872 385853081 386279602 386927299 387878609 389403305 389821930 391352348 392313538
3559.5 392313538 392542610 392898331 394791298 395497513 395623436 399708252 400279236 399567337 399672852
3568.2 399672852 399045639 401836853 403223915 404205017 405422554 406926804 407823486 408418159 409735107
3576.9 409735107 409857635 411993141 413444366 413535767 414946404 416659126 418117218 419154510 423171768
3585.5 423171768 424648437 422572479 424227486 423854561 426097908 428438110 430950470 432684898
3593.2 432684898 433521461 436277580 435116806 437513351 441496696 442429810 444374352 443978767 444513474
3601.9D44513474K406120J640281J844140L224067K445298p45354L755417r51042l27034
3610.6D57805367P633209P36541j984176L730049m41017L644943L814163L16201K371482
3619.3D77626762o28624Q25730L069420K253799J899872K224922K217674L256760O827888
3628D99574203k760200r774628N831223N045509N440178J119270j286125K978096L433571
3636.6E09601097K232933J51978J684456K431793L190689K097053K93694K523880L798180
3645.3E28005753N876503j621895j826973P407875j084862l766861j810760N861435
3653E37040215N138626M304809M953232q048363K183876N230713K053871K298546R17168
3661.7E56072693K307854O71348J991196K773247J532821N021553K923432l84789j272430
$$ plain form
3601.9 444513474 446919594 448559875 450404015 453628082 456073380 455328026 459083443 458132401 457805367
3610.6 457805367 465438576 466175117 464190941 467920990 467479973 471124916 474939079 475255280 477626762
3619.3 477626762 476998138 477823868 480893288 483147087 485046959 487271881 489489555 492746315 499574203
3628 499574203 496814003 487039375 492870598 497916107 503356285 504475555 503189430 506167526 509601097
3636.6 509601097 511834030 511986008 513670464 516102257 519292946 521389999 521683693 524207573 528005753
3645.3 528005753 533882256 532260361 530433388 537841263 536756401 532989540 531178780 537040215
3653 537040215 542178841 546483650 551436882 543388519 545572395 550803108 552856979 555155525 556072693
3661.7 556072693 558380547 559051895 561043091 563816338 565349159 570370712 573294144 572909355 571636925
3670.4E71636925n871735M618302R343452Q881645k392120j7969246L876152Q837547
3678.1E80960922N509453k050476J51939L481484K669754J760521Q95653J313858M560203
3686.8E99253311N648995r816361j464805R403343o799584N9471O442299J331787K085877
3695.5F06144333M98085M36554K336960Q89854K934075K258720o339493j686172N042457
3704.1F12515373J950417J009521J511803L195267L752098o600571N059586M122505
3711.9F26515999j3225784N766067M990845O15883Q47854K098351P19452l813820K015457
3720.5F26530304O415520l787690l521690O489563J484566j024170l321838K02484
3728.3F29467049M708213K145997O402969k897377o746292J0332908P94373r772339
$$ plain form
3670.4 571636925 565765190 570383492 579726944 588608589 586216469 568247223 572123375 580960922
3678.1 580960922 586470375 584419899 584571838 588053322 590723076 592483597 593379250 594693108 599253311
3686.8 599253311 604902306 595085945 593621140 603024483 596224899 596284370 602726669 604058456 606144333
3695.5 606144333 606642418 607078972 609415932 610305786 613239861 615498581 609159088 607472916 612515373
3704.1 612515373 614465790 615475311 616987114 620182381 623934479 617333908 622393494 626515999
3711.9 626515999 613290215 619056282 624047127 624663010 625510864 627609215 628328667 624514847 626530304
3720.5 626530304 632945824 629158134 625636444 632126007 633610573 632586403 629264565 629467049
3728.3 629467049 634175262 636321259 642724228 639826851 633080559 643413467 644207840 634435501
3736F34435501L16849K099266N52063L402748L878021l482132L977280J2056503j2806396
3744.7F44429703j4030991J1520310O790924P929535m180832j1171875J2221832q299789
3752.4F45208817n877800P115821M825211K838821o310501L468018N723648r067841
3760.1F47924194q67767M778595K004318J033631L274917l181305l813095M444275
3767.8F55597763N616303m37699r920730K263412L777237P08313J076965P34406J988602
3776.5F61404572O55517K355957j381607p674332L418198K689133J436920K168655
3784.2F65073013l227844p73010J706772J372299R09195n73120L30276O60095J233292
3792.9F66710968J67236J449738M262009m278412m553376L231736N135421N990601
$$ plain form
3736 634435501 634752350 636851616 637403679 640806427 644684448 641202316 645179596 657236099 644429703
3744.7 644429703 630398712 641919022 648709946 656639481 652458649 641286774 653508606 645208817
3752.4 645208817 639331017 646446838 651272049 654110870 647800369 651268387 656992035 647924194
3760.1 647924194 647056427 651835022 653839340 654872971 658147888 654966583 651153488 655597763
3767.8 655597763 661214066 660776367 650855637 653119049 656896286 657604599 658681564 659415970 661404572
3776.5 661404572 662060089 664416046 663034439 655360107 658778305 661467438 662904358 665073013
3784.2 665073013 661845169 661072159 662778931 664151230 665060425 664487305 664817581 665477676 666710968
3792.9 666710968 666878204 668327942 672589951 668311539 663758163 666989899 672125320 678115921
3800.6F78115921j0325317j0138321O341476M164505N749817N155258j2070770l491364
3808.3F63501205N540085J929856J178360J198654O58798K166061N955887j736374
3816F80392532j4754409N939941O846619N283889J090851k0819778L384933O897125
3823.7F74261703K619858K373200p94678l167801J257172K024612L352509J306534
3831.4F83233109q723450L365021O817092o865463J406326R324265r316711l046341
3839.2F76193848Q303527p076644k66571O979217l249817l793640L231354K094421
3846.9F82415695Q13599K531509n6000K677079N322723o307449M05578k0200500M617691
3855.6F72219925J2387009j253281j608200K521210L329696K627411o368027J275940
$$ plain form
3800.6 678115921 667790604 657652283 663993759 668158264 673908081 679063339 666992569 663501205
3808.3 663501205 669041290 670971146 672149506 673348160 674006958 676173019 682128906 680392532
3816 680392532 665638123 671578064 678424683 683708572 684799423 663979645 667364578 674261703
3823.7 674261703 676881561 679254761 678460083 675292282 676549454 678574066 681926575 683233109
3831.4 683233109 674509659 677874680 684691772 677826309 679232635 688556900 679240189 676193848
3839.2 676193848 684497375 677420731 677154160 684133377 680883560 677089920 680321274 682415695
3846.9 682415695 683229294 685760803 685704803 688381882 693704605 687397156 687802734 667602234 672219925
3855.6 672219925 684606934 683353653 681745453 684266663 687596359 690223770 683855743 685131683
3863.3F85131683Q044968o519165n582504N174637N368881N176697j0653306q938064
3871F77203827N973968O639481L136826j0597001J271668M980621J82114L175735M786530
3879.7F96753769p451935o635284O873016J455841J898956M654847j3823014J536484
3887.4F85262680M746170J510544M675980k218934q524551K360077L043594o23932
3895.1F90231628K053757J360779K456894Q15658q990936O123123K487641n224076
3902.8F91314468M006806l144226k216339l73078J069870K328339j0147M75311m89731
3911.5F92961273O7673J002502N60608J641083K053070l526611l326950M629364q14057
3920.2F95247955m395523L039246K621231J086502l203201k828980K115174J512985
$$ plain form
3863.3 685131683 693176651 686657486 681074982 686249619 691618500 696795197 686141891 677203827
3871 677203827 683177795 689817276 692954102 682357101 683628769 688609390 688791504 691967239 696753769
3879.7 696753769 689301834 682666550 689539566 690995407 692894363 697549210 683726196 685262680
3887.4 685262680 690008850 691519394 696195374 693976440 685451889 687811966 690855560 690231628
3895.1 690231628 692285385 693646164 696103058 696918716 687927780 694050903 696538544 691314468
3902.8 691314468 695321274 692177048 689960709 689587631 690657501 692985840 692975693 693451004 692961273
3911.5 692961273 693028946 694031448 694592056 696233139 698286209 694759598 691432648 696062012 695247955
3920.2 695247955 690852432 693891678 696512909 697599411 694396210 691567230 693682404 695195389
3927.9F95195389J686096p25403N68924K552490m343261j512452K506638O52618O91376
3936.6F97272415l97415r65881O2179k69928J851731J523056m070740J07956J682815
3945.2F96796188Q09861J494293k445755R60464M00162k914810K217331J276779m08020
3953.9F98186493l01895L11889Q46558m83856J60141j30234J234055Q76922j542358
3962.6F99157715l96576k44598M6844M41284M73786j78376j155777L99475R93042o36291
3972.2F98900528l16162Q34808J0910J3809J4191r7961M69055Q1253J29623M54712
3981.9G00494766K2507l34778K76566J80740n8136K88391p4386M7760m28620l26233
3991.5G00088577N40085O22177L63617m51736n2872K57187k8915K75573O40488
$$ plain form
3927.9 695195389 696881485 696156082 696725006 699277496 694934235 693421783 695928421 696581039 697272415
3936.6 697272415 696875000 695909119 695971298 695701370 697553101 699076157 695005417 695113373 696796188
3945.2 696796188 697606049 699100342 696654587 697615051 698015213 695100403 697317734 698594513 698186493
3953.9 698186493 697884598 698196487 699043045 698559189 698719330 698589096 699823151 700700073 699157715
3962.6 699157715 698761139 698516541 698563385 699004669 699478455 699300079 698144302 698543777 699536819 698900528
3972.2 698900528 698584366 699419174 699430084 699443893 699458084 699360123 699829178 699910431 700040054 700494766
3981.9 700494766 700517273 700182495 700459061 700639801 700581665 700870056 700795670 700843430 700414810 700088577
3991.5 700088577 700628662 701250839 701614456 701162720 701109848 701367035 701338120 701613693 702254181
4000.2G02254181
$$ plain form
4000.2 702254181
##END=$$ End of the data block
