##TITLE=$$ Begin of the data block
##JCAMP-DX=5.00 $$ ACD/SpecManager v 10.08
##SPECTROMETER/DATA SYSTEM=Varian
##DATE=20 Nov 2012 09:38:56
##DATA TYPE=INFRARED SPECTRUM
##DATA CLASS=XYDATA
##ORIGIN=
##OWNER=
##NPOINTS=3735
##FIRSTX=399.26403809
##LASTX=4000.35498047
##MAXX=4000.35498047
##MINX=399.26403809
##MAXY=80.06610107
##MINY=24.84547997
##XFACTOR=1.0000000000
##YFACTOR=0.000000100000000
##FIRSTY=52.27665710
##DELTAX=0.96440572
##XUNITS=1/CM
##YUNITS=TRANSMITTANCE
##XYDATA=(X++(Y..Y))
399.3 522766571 532720757 548661880 539832306 534220581 527846107 524811401 531378937 526792603
407 526792603 520147247 516861229 514877510 510953903 513814507 524157333 531201973 533853455 532973442
415.7 532973442 530925217 523123474 506049042 515503578 534515686 530439491 521818886 525343094
423.4 525343094 527220764 530585213 533226166 527775154 522259254 521123962 523628273 520280914
431.1 520280914 514645691 514802170 517818184 515449944 510621071 507683983 506820869 510354958 511211357
439.8 511211357 514246330 515720329 513850212 516305656 518717041 526472626 529484329 523701553
447.5 523701553 522475739 526413727 529842453 528557510 528512268 529243622 532657013 537299156 537190399
456.2 537190399 532829018 526654625 528458824 531611366 531058502 529499092 532080727 529048195 525450058
464.8 525450058 526350632 523206940 524833488 528129425 525359268 520921898 518596764 515448418 510408440
473.5 510408440 512306480 513175659 511603889 508756485 504125900 499422798 500455322 506755180 508927574
482.2 508927574 511893349 511327019 508267403 508082924 511144829 514453659 509659004 506459236 504089966
490.9 504089966 501328812 501840439 501756096 504591637 506983643 505982857 504894142 507578278 505474739
499.6 505474739 500540428 501302414 500348663 498127213 496019745 494817009 495131187 496607323 495915451
508.2 495915451 494454842 495105591 493372536 490292397 484444084 480762215 479064331 476600418 477062683
516.9 477062683 475614510 473609581 468073273 467783356 471283836 470772705 470859184 469030685 467476959
525.6 467476959 465318108 463325996 461467743 459359665 459416313 459718056 462694778 466337776 469248734
534.3 469248734 470703621 472709999 475317078 477441025 480972252 483322754 484841766 485689316 486479912
543 486479912 486919174 489552002 494579849 494919434 495198402 497759781 498815765 496704292 493098717
551.6 493098717 490763817 488832359 486473236 483995094 483945122 482833786 481593437 482390442 481426468
560.3 481426468 479658203 476762505 473456993 469071655 466377449 463217278 456333733 453521652
568 453521652 451484489 449194603 446427650 443959694 443245087 442483902 441479073 440384216 443471069
576.7 443471069 444616165 444516029 445689812 448336678 451690674 453289413 457882614 462478447 466246796
585.4 466246796 469762039 472623634 475277367 478006973 480592194 481093292 482905579 483796692 483642845
594.1 483642845 485193214 486047058 485825577 485570602 484721184 483074417 484249763 484913673 483959084
602.8 483959084 484376450 484082336 483543396 483891029 485128746 484918823 484276009 483329811 481966095
611.4 481966095 482814865 485098953 488086815 488268394 488311729 489603958 491391792 494955139 497095909
620.1 497095909 499452438 501178818 503032799 505355797 506136551 508136482 511121407 512845383 513172836
628.8 513172836 514439163 516350975 518354225 519833260 520755806 522143402 523492775 524481964 523011856
637.5 523011856 521820755 521492310 521599312 523687439 524401703 525051842 526469116 528210678 529248009
646.2 529248009 529526405 529444351 528498421 529028091 528140640 526969261 526776924 526381798 528408012 530416260
655.8 530416260 531923065 533554687 535006943 536129417 537650528 538834457 537881279 536688690 535443001
664.5 535443001 535044746 535662537 532879715 526181335 533181992 537963524 540853081 542814102 543809776
673.2 543809776 544443207 542791519 540900574 541310501 541169815 541009064 540082664 540554771 543660126
681.8 543660126 545385551 546484299 548247986 549307175 549638748 550767059 550969124 549397774 547568436
690.5 547568436 546360588 546380539 546039658 545886574 545681267 545544319 546478119 547492943 548009224 545809593
700.2 545809593 542738838 540590630 537468071 534776573 533253441 532241249 531269455 530277214 530357018
708.8 530357018 531883545 532981300 533436470 534274445 535403061 536605759 537887001 539251862 540081024
717.5 540081024 542195892 544970856 547691422 551937294 556120834 560258789 563092995 564822311
725.2 564822311 567730598 570415916 572810860 575270882 576357689 577007866 578511124 580497894 582797775
733.9 582797775 585404663 588141823 590386887 591386108 591507301 592366180 593267822 592201996 590453835
742.6 590453835 590243263 589860268 587706261 587167511 587280960 585442085 583293839 581332397 579234734
751.3 579234734 576231689 573546028 571698227 569568291 567022743 563591080 561321411 560552711 559440956
760 559440956 558076782 556319122 554407997 552337189 551551704 552159653 552180977 552803612 554748688
768.6 554748688 557467422 560010338 562810249 565946732 569164581 573087006 577118301 581726646
776.4 581726646 586464882 591459122 596056633 599288902 601704483 604740295 609138069 613029175
784.1 613029175 616230164 617949867 618870163 620440750 621578903 622366295 624030151 626631927 628243141
792.7 628243141 629673347 632885056 636498413 638952255 641161346 643379974 645051270 646133804
800.5 646133804 646993942 648964233 650265808 651382217 653536224 655956039 658869095 661252365 663511505
809.1 663511505 665172043 666428833 666988373 666912918 666851959 665766296 664844284 664231644 664536514 665617371
818.8 665617371 667436371 669552612 671091690 672704926 672808151 671711960 668873596 665039978 661579971
827.5 661579971 658642960 656256485 653931580 652900391 651687851 650243073 648637009 647359009
835.2 647359009 646697159 643898544 640305786 636220932 632396049 628898048 625142212 623237381 621197586
843.9 621197586 619105797 618473549 617630539 617157936 617386017 617491493 616633949 613794746 610283203
852.5 610283203 607297478 604437332 602028580 599794540 598370018 597578926 596669922 596849174 597847404
861.2 597847404 599454842 601664047 604411888 608184242 611737289 614778061 617776527 622546654
868.9 622546654 628676262 634806824 641826630 648770447 655192642 660231857 664357071 667029800
876.7 667029800 668541794 669271469 668008423 666125183 664515915 663008957 661072083 660453339 659602966
885.3 659602966 657867203 656354370 653458633 650266647 646350784 642751007 638937454 634254189
893 634254189 630957565 627707443 624963150 622955475 621226273 619844093 617361336 615449295 614512787
901.7 614512787 612585983 609862900 606477318 602751198 599570656 596041946 592142715 588223991
909.4 588223991 583408279 578679543 574674187 570488777 566229630 561328011 555762520 550542946
917.2 550542946 546050491 542204323 538341217 535107460 532066345 529470367 527978172 527350807 526684227
925.8 526684227 525132637 525221138 525826035 526113281 526837692 527554932 528677597 529683495 531894684
934.5 531894684 534676895 536204834 537383156 540144691 543532829 546089363 548897934 551905861
942.2 551905861 555104141 557661781 559306335 559963493 558934059 556437836 552914696 548789482 543184433
950.9 543184433 537146988 531494293 524911575 517991371 510860062 503803635 496283073 488936729
958.6 488936729 481431541 472801857 464156342 454894371 445946846 436460075 427555695 418138657
966.3 418138657 407644424 398703728 389093170 379943695 369897995 360079842 350462875 340647545
974.1 340647545 331711464 321313896 312733459 303850307 294877739 286700096 280156517 274646893
981.8 274646893 268369961 264350567 260126343 257619209 254967270 253294392 252238636 250360126
989.5 250360126 250472641 249130821 249129028 248454800 249280739 250897293 251305027 252821732 252647285 254261074
999.1 254261074 255094872 256786308 258066254 258122272 259455070 259199276 259923973 259310093 259204350
1007.8 259204350 258782177 258587952 258792610 258166523 259716263 259618378 260585365 260280304 260012074 260742588
1017.5 260742588 260729485 262065258 261919460 263674145 264393635 265890617 268410702 270579472 273120308
1026.1 273120308 273683186 276340446 277621994 279455929 281130867 282604961 284700394 284916229 286910057
1034.8 286910057 287737255 289765320 290840569 290952911 291499081 291919632 293679466 293261223 294591103
1043.5 294591103 295026531 295631332 295823402 295655308 297500401 297401981 299553452 300657921 303454418
1052.2 303454418 306580677 307788410 310701523 313534107 318150501 321185608 324487495 327273064
1059.9 327273064 331857529 337864037 342656975 349545174 354980087 361715393 366680260 370190048
1067.6 370190048 373217087 373179283 370552864 364219856 358423767 350839310 344153595 338894157 333917656
1076.3 333917656 330503082 326585503 325920448 324727135 324905777 324387970 324061928 325699120 326250305
1085 326250305 328722763 329612846 332122536 333733330 335504799 338986931 341759491 345774040 348296814
1093.6 348296814 352132607 354250565 356424675 359295235 361299210 363100777 362961731 364595261
1101.4 364595261 365190773 365905991 365458031 365317650 366666603 366614723 368532600 369518127 371831818
1110 371831818 373158455 374451294 377195625 378147430 380313301 382185287 384472771 385284195 386556702
1118.7 386556702 387631874 387850723 389903221 390730209 392075081 392753983 394591446 395994263 397103310
1127.4 397103310 399103699 399723816 402616615 404650002 406615829 408052673 409483795 410999107
1135.1 410999107 410915108 412411842 411479797 409799881 407166862 402914619 398944054 394616356 390321388
1143.8 390321388 384609070 380788765 376471901 372344627 369133797 365882530 363702126 360787430
1151.5 360787430 359369736 356864014 355433540 354049988 352348404 351349487 349684525 350241280 350043640
1160.2 350043640 351735573 352959175 354568863 357193604 358520737 362310905 365699997 369837265
1167.9 369837265 372875786 376740837 381262665 385341225 391457405 396721573 403529701 410005226
1175.6 410005226 417206879 424569588 431140022 438909073 445731506 451953697 457336082 463628502
1183.3 463628502 469457741 474598503 479882927 485017128 490580673 495302582 500477409 504926033
1191 504926033 509138069 512867737 515030899 516797180 517299919 517642136 518066826 518580513 519116364
1199.7 519116364 520075874 521883278 523419037 524987679 526297569 527924080 529665298 531208038
1207.4 531208038 531948586 532696724 534385071 535589218 537460251 539755821 542495041 545497627 548477631
1216.1 548477631 552105827 555556679 558533859 560528336 562070122 562827034 562907562 563052483 562967644
1224.8 562967644 562846680 562221184 561788940 561859894 561959991 561885490 561356506 560983925 560860367 560502357
1234.4 560502357 559302025 558169708 557330246 556435814 555686378 554805031 554865532 555135040 555060005 555139923
1244.1 555139923 555668602 556705437 557616463 558607216 559602165 560788727 561311226 562026443 563457069
1252.8 563457069 563835564 564257660 565505371 566807137 567382889 568157120 569594154 570536728 571469650
1261.4 571469650 572532082 573383141 574119987 574800606 575206871 575752754 576866875 577629242 578402519
1270.1 578402519 579782600 580878677 581826019 582872581 583882141 584894676 584961090 584751205 584619102
1278.8 584619102 584003143 583218079 582230721 581494217 580909920 580511513 580216675 579903564 580058365 580122375
1288.4 580122375 580215874 580321579 580152626 579380379 577509575 575542908 573956833 572438850 570956612
1297.1 570956612 569664612 568960114 568841400 569305496 569470024 569881325 570284309 568628502 566901321
1305.8 566901321 565940018 564378700 562898064 561675644 560667610 559894562 559847336 560165024 560593338
1314.5 560593338 561313400 561482620 561312714 560696373 559437141 557908821 555881996 553706589 551648407
1323.2 551648407 549586716 547505264 545922508 544783440 543421898 541672516 539969063 538150291
1330.9 538150291 535676193 532660294 529225578 526255760 523900070 522080002 520500298 519463387
1338.6 519463387 519359970 519565582 520188942 520797157 521599998 521755257 521697350 521324692 520689430 520059395
1348.2 520059395 518830070 518217239 517611847 517349396 517371864 517707939 518552399 518743095 518942833 518521385
1357.9 518521385 518026848 517113228 515678368 514627609 513555527 512438316 511668015 512078781 512434692
1366.6 512434692 513176498 513746872 513895988 514815712 515060768 515951691 515804749 515359688 515605125 515774155
1376.2 515774155 516635704 516536713 517192574 518106194 519630470 520844078 521694221 523352394 525147476
1384.9 525147476 527630157 529048157 530583611 532028084 533838921 535551109 536367378 537488098
1392.6 537488098 538461113 540338364 541029739 541967812 542917671 543602486 542850075 541175270 541536942
1401.3 541536942 540865135 540364189 539704132 538238258 537428551 536833229 536907539 536113777 535634308 535005608
1410.9 535005608 534558830 533912735 532712898 532195625 531368637 531292076 530512810 529984322 527563515
1419.6 527563515 527250938 528822937 528855095 529899330 529788475 530143852 530852203 530941010 531843872 531898308
1429.2 531898308 532175064 531637764 532333183 532604752 532788620 534475327 535133286 535548859 535596619 537797279
1438.9 537797279 539053230 539909210 540817032 540817604 541856880 541424217 541382561 541309776 541710396 540963516
1448.5 540963516 539896240 540577278 540017776 540266762 539571533 539749527 539795837 538710709 536751328
1457.2 536751328 532932510 534492264 532199974 532775688 532549553 532788582 534513168 534177399 537723160
1465.9 537723160 539310303 542697029 545017929 547964935 551737328 553892517 558963890 560381279
1473.6 560381279 565991554 569002876 572909698 576744919 580387993 585332451 588838005 594493599
1481.3 594493599 597482300 601178665 603880806 605892410 608821297 609417686 612740250 613819427
1489 613819427 616586189 618709030 622181816 625956116 628318634 632652397 634342842 636765175 639017525
1497.7 639017525 640671463 641081619 641614380 643099899 643470001 646039047 648250275 651819992 652037735
1506.4 652037735 651691208 658303452 658844070 661634827 662232666 663236465 662182465 662851791 663828964
1515.1 663828964 663663483 667193756 666038742 669565659 672372742 674313202 675926132 674394379
1522.8 674394379 677565842 677846375 677358170 676623611 677478333 677321396 677702866 680231323 681203003
1531.5 681203003 684021606 685176468 685576477 687462311 688869858 690963516 692365646 693457870
1539.2 693457870 683408432 687574158 687924576 687648087 691281662 691873474 692700577 693947144 695861511
1547.9 695861511 696990204 697484131 697109833 697589798 698608475 698861084 698378754 696771469 699891891
1556.5 699891891 703395920 698798676 698756104 696408691 701375504 703072662 704644165 705387039 704865570
1565.2 704865570 705139694 704693375 705776291 706098404 703295898 703408127 704739456 705805969 706296310
1573.9 706296310 708034210 708851547 706502457 706603622 707336731 707130585 706649323 706569214 706184616
1582.6 706184616 706068649 706081314 705944366 705185471 705159531 705399857 705033798 704673080 704207993 703997498
1592.2 703997498 703426056 702724609 701320190 699933929 698731079 697372589 696233292 694974976 693725510
1600.9 693725510 692696152 692015991 690550613 689221573 688380737 686830215 684222794 682072220 679893646
1609.6 679893646 676828156 674709625 672311478 670162659 667727814 666976852 666619797 659293823 658723373
1618.2 658723373 657792816 656332245 654174728 652609177 649999847 643355026 642157593 640743713
1626 640743713 639495583 636029472 633692551 633259201 631835785 630697937 629240227 629356079 629074097
1634.6 629074097 623118591 621559753 621493950 619699516 618849335 618477325 617334137 617674294 617208557
1643.3 617208557 618485489 620626221 620009995 620317192 619495201 620089951 620072021 621431122 624163132
1652 624163132 622882309 617960091 620821648 624025764 625829468 627788658 629744530 632182083 634061890
1660.7 634061890 635587883 636558647 635860023 637367668 638412437 640038528 642275925 644823151 646798172
1669.4 646798172 648420334 651938629 653541031 655979843 659000778 660236130 660018616 662184143
1677.1 662184143 664226837 665789719 667721786 668461838 671212845 675242538 676515808 673382568
1684.8 673382568 679319000 684230881 686775284 688070984 690062256 691123505 691547318 692407913 693771744
1693.5 693771744 696372147 699142914 698917007 701645050 705098572 708918076 708043900 705164108 709438858
1702.1 709438858 712325211 713999023 714084091 714751968 714271469 715461807 717913513 719817810 721241989
1710.8 721241989 722601547 724681854 726934509 727571564 726671143 728686752 729155884 724578934 727471237
1719.5 727471237 729786301 731426010 732717514 733959274 734861298 735876923 737056198 737812805 739143829
1728.2 739143829 740289078 739569702 739001465 741397324 743722610 740684967 737976151 741099167 743864746
1736.9 743864746 745077209 747399139 748570938 746507111 748375626 749904938 749241943 747933121
1744.6 747933121 748947525 750068893 750677338 751129379 750574112 752976303 753177109 752174606 753569641
1753.3 753569641 754223404 755029221 755982895 755506516 755346451 756516953 757392731 759048386 758869705
1761.9 758869705 757471848 758584824 758878860 759329987 760234299 761156311 760127258 760366516 762397537
1770.6 762397537 763153610 761824646 760119629 762503128 763723831 762793732 763771133 764150162 764668961
1779.3 764668961 764656982 764366302 764909973 765682831 766730118 766456604 766388855 767208786 767767792 767670593
1788.9 767670593 768121262 768261261 768029404 767434692 766885834 768515244 769087372 769307251 770741501
1797.6 770741501 772249680 772868881 772146225 772519684 771283646 770477524 770591431 770328674 770908966
1806.3 770908966 771599426 772451324 773453064 774706192 774856186 775386124 776029968 775602798 775295410
1815 775295410 774682388 774689102 774096146 773845596 774205399 774379349 775476074 776573792 778300552 779207764
1824.6 779207764 778021851 778235550 779131851 779895325 779503403 775871277 774907150 775846252 776298218
1833.3 776298218 777164536 778032761 779014206 780130157 780548706 781426239 781167297 780572891 779646530
1842 779646530 779830170 780296555 776330719 777053223 778323746 778856354 779386978 780478439 781819305
1850.7 781819305 782039185 782537842 782080688 781350327 780515747 779712067 779320755 778340759 778377457 778712540
1860.3 778712540 779665833 780738754 781753159 782857742 783378220 783653946 782805099 782679825 781504288
1869 781504288 779592667 779437103 779384995 779869843 780384140 781124344 781715698 782579422 783334885 783792419
1878.6 783792419 784247894 783896027 783178864 781816177 781408691 781334534 780869293 781070099 781761169 783342133
1888.3 783342133 783997269 783511429 784265366 785457458 785443573 785029984 784758759 783705063 783100967
1896.9 783100967 782465439 782577667 783275375 783724823 784254532 784837265 785569000 785571899 785672913 785613403
1906.6 785613403 785185928 784993057 784870300 784177780 783246460 783711929 783927155 784303131 784725723 785254440
1916.2 785254440 786886978 786020660 784721985 785002975 785647583 786524734 785856323 784384613 784042740
1924.9 784042740 784485474 784818039 785333252 785438080 785588913 785953903 785789261 785615616 785298767 785737915
1934.6 785737915 785774384 785451202 785152054 784989929 785432739 785062561 785738449 786039429 784763641 785143738
1944.2 785143738 785752411 785945663 785878830 786167984 786160660 786055374 786069870 785877075 786015015 786164627
1953.8 786164627 786185303 785975800 786129837 786102142 786036682 786290283 786447983 787036285 787612381 787971420
1963.5 787971420 787765274 787866592 788014832 787324066 786805496 786654816 786784134 786284103 786025085 786406555
1973.1 786406555 787172928 787931442 787975006 788326111 788183517 788066177 788248291 788091812 787657700 786916428
1982.8 786916428 786452026 785894623 786185760 786870346 787393036 788064880 788404770 789171219 789456177 788429794
1992.4 788429794 787619705 787642517 787248230 786380539 785759201 785425339 785848312 786354294 786923523 787541809
2002.1 787541809 788097000 788528061 788758926 788639374 787675018 787006226 786152725 785357742 785118713 784947433
2011.7 784947433 785267181 785406494 785614090 786322708 787228775 787114182 786612167 786476517 785841370 785001678
2021.3 785001678 783706741 782944412 782713928 782595291 782690430 782580872 783055954 783876877 784434891 784522934
2031 784522934 784581680 783947372 782845535 782215347 781345673 780682068 779933014 779624329 779800949 780251160
2040.6 780251160 781073303 781458511 782178574 782684250 782759933 782166061 781227112 780340805 779160614 778605347
2050.3 778605347 778123322 778137207 778548431 779042206 779569473 780068512 780966949 781313171 781414337 780987396
2059.9 780987396 780308838 779351044 778459015 778536835 778185730 778272247 778917542 779658966 780173569 780376740
2069.6 780376740 780959702 781434631 781703644 781325607 781023483 780349350 779518051 779177322 778654327 778657837
2079.2 778657837 778729477 779378357 780095062 780270920 780457611 780754318 781429062 781346283 780960388 780413589
2088.9 780413589 779892731 779705658 779524918 779363098 779055862 779404755 779793472 780424881 781073761 781396408
2098.5 781396408 781959534 782131500 782003555 781409683 781177750 780903778 780458984 780258331 780061035 780448380
2108.1 780448380 780705414 781310730 781529236 781599731 782387009 782745514 782800217 782250900 781848145 781436996
2117.8 781436996 781012802 780924988 780574265 780488815 780611572 780841675 781155319 782007370 782747498 782943954
2127.4 782943954 783002090 782918320 782752457 781952591 781343689 780665131 780118637 780105209 780286560 780732956
2137.1 780732956 780995255 781951447 782631149 783152237 783643036 783361816 783098145 782246552 781764679 781272278
2146.7 781272278 780333481 779969864 780205917 780667572 780910492 781733322 782562180 783442841 784448166
2155.4 784448166 784637985 784138336 783325882 782534637 781623993 781026230 780642700 781026077 781658401 782055817
2165 782055817 783202286 784297104 785295944 785835342 785936966 785735397 785346451 784924469 783934937 783547134
2174.7 783547134 783347549 783408203 784146194 785085602 786264877 787425232 788442688 788684769 788643112
2183.4 788643112 788183365 787495728 786903992 786319885 786096497 785926056 786458664 786747208 787380676 788928757
2193 788928757 790148239 791153107 791417007 791542587 791214294 790543442 790036163 789160080 788426743 788166962
2202.6 788166962 788485336 788867035 789601593 790575638 791760178 792899399 793399658 793745270 793471680
2211.3 793471680 792892838 792010193 791380539 791058273 790801697 791047668 791200333 792156525 793453293
2220 793453293 794540939 795189133 795375824 795559921 795278168 795235825 794804077 794256210 793800354 793518143
2229.7 793518143 793756485 793797073 794618149 795586014 795999451 796140518 796457138 796895828 797067642 796918335
2239.3 796918335 796104584 795826950 795374680 794946518 795038757 795181808 795850372 796243362 796966324 797628784
2248.9 797628784 797950897 797950211 797700424 797894821 797471237 797084808 796872101 796511078 796076660 795997086
2258.6 795997086 796592865 797122726 797627335 797759018 798062973 798462677 798565063 798502426 798548355 798576584
2268.2 798576584 797900391 797862625 797996292 797781448 797710037 797848816 798239975 798894196 799956284 800207291
2277.9 800207291 800293350 800479050 800661011 800655212 800043488 799626999 799015808 798934631 798690643 798646011
2287.5 798646011 798880157 799005356 800052032 800070496 800081558 800412369 800499573 800526352 799831085 799343185
2297.2 799343185 798819809 798726273 798300552 797910461 797746658 797616043 798076553 798168716 798824158 798811874
2306.8 798811874 798630829 798250732 797287064 796880264 795897827 795561600 794550858 794407883 794992294
2315.5 794992294 794949417 795668640 795153732 795029144 794466324 793540726 793078918 792604752 792027054 789967728
2325.1 789967728 789349976 788634033 788402557 788778000 788124390 787650986 788080673 790238647 790964050
2333.8 790964050 791703186 791465378 789889221 789138336 788151550 787522736 786051407 785402451 784965134
2342.5 784965134 785716171 786812744 787566452 790124512 791623840 793770142 795006104 793709183 791556015
2351.2 791556015 788865051 786129608 784171143 783345566 781928329 780829315 781619492 782111816 782457199
2359.8 782457199 783534241 784002991 782864838 782437057 782947311 783204269 782333832 782457809 783086472
2368.5 783086472 783313751 785117264 787074966 789663239 791930237 793211823 793666306 793971481 795111618
2377.2 795111618 795260620 794854889 794476471 794680252 795066376 795462418 796740875 797681274 798612671
2385.9 798612671 799588852 800108109 800311966 800248184 800181122 799619827 798490448 797524872 797104645 796417847
2395.5 796417847 796141891 796441803 796822357 797652893 798230667 798942795 799248886 799166489 798952942 798182983
2405.2 798182983 797457275 796522827 795921097 795457840 795274887 795579147 795833588 796299744 796725082 797233124
2414.8 797233124 797350693 797265320 797106628 796432800 795588531 794973602 794359055 793337631 793025131 793077545
2424.5 793077545 793280334 793820801 794117355 794470444 794635925 794370956 793606415 793395081 793050308 791992569
2434.1 791992569 791296692 790613174 790281219 790017471 790014725 790195770 790530014 790842667 790536575 790839767
2443.7 790839767 790913391 790647659 790013580 789067764 788535690 787593765 787167511 787113419 787127151 787334595
2453.4 787334595 787507782 787864227 788182907 788346176 788130569 788080215 787490005 786565323 786049728 785455933
2463 785455933 785005875 784569855 784526596 784497147 784624405 784880676 784890289 785283890 785436707 785490189 785316696
2473.6 785316696 784617004 783687057 782801514 782242050 781731491 781182175 780958710 781761017 782584915 783030090
2483.3 783030090 783292236 783130875 783075638 782702103 782202225 781701279 781336517 780790787 780047760 780031052
2492.9 780031052 779731445 779393539 779723892 780444870 781255035 781639328 781665268 781285400 780873795 780746078
2502.6 780746078 780341492 779261322 778424072 778382034 778538437 778504105 778715591 779256744 779437256 780002060
2512.2 780002060 780298538 779855576 779742966 779246368 778363800 777655792 777269745 777063370 776957169 776889954
2521.9 776889954 777174454 777711868 777604065 777900238 778040924 777519913 777525406 777043839 775751801 774987183
2531.5 774987183 774933548 774559708 774087677 774044876 774482803 774864273 774721909 774804077 775165710 775379028
2541.1 775379028 774651718 773787766 773346100 772653503 771883392 771093521 771171494 771245651 771156387 771540070
2550.8 771540070 771698227 771987076 771919937 771604767 770959473 770192719 769774704 769055481 768453827 768047943
2560.4 768047943 767797852 767850876 768314285 768466721 768195724 768233109 767966385 767634659 767675095 767582016
2570.1 767582016 766975021 766335220 765685272 765272598 765131531 764763336 765012817 765018845 764795761 764747620
2579.7 764747620 764546967 764867401 764851074 764380569 763688583 763070145 762673950 762466431 762558365 762435989
2589.4 762435989 762301712 762252960 762589111 762454071 762113800 762312927 762358093 762398987 761843033 761273346
2599 761273346 760802765 760450821 760430603 760064240 759695511 759575958 760299988 760754852 760933609 760811844
2608.6 760811844 759781189 759396133 759241180 759053421 758407745 757560043 756909485 756508179 756719818
2617.3 756719818 756106262 755849075 756189117 756186218 756023254 755402527 754859695 754642563 754832916 754159851
2627 754159851 752791901 751867294 751505966 751631393 751045990 750297623 750196304 750360107 750058060 749463348
2636.6 749463348 749113617 748527527 747837219 747174454 746678238 746043243 745312576 744757767 744339676 743881607
2646.3 743881607 743301697 743288498 743149948 742943115 742659454 741999741 741559067 740935287 740543213 739996414
2655.9 739996414 739115829 738592224 738093796 737556992 737370987 737461090 737213440 736944504 736598358 736254120
2665.5 736254120 735942612 735261383 734540482 733750458 733170929 732722778 732408524 731876144 731249161 731549530
2675.2 731549530 731946106 731844177 731543045 731372681 731201553 730843811 730018997 728933334 728353958
2683.9 728353958 727698517 727128754 726668625 726375046 726580276 726800156 726959839 726684570 726187439 725734406
2693.5 725734406 725408020 724909668 724022446 723188400 722670746 722438583 721876450 721567230 721150970 720675812
2703.1 720675812 720956726 720873947 720510559 720227051 719970703 719056625 717886963 717421951 716866760 716320877
2712.8 716320877 715751953 715379028 715261383 715034103 714760361 714531250 714289093 713779144 713734589 713182449
2722.4 713182449 712101669 711752548 711458740 711039352 710200043 709460983 709375992 709372711 709235458 709096603
2732.1 709096603 709043427 708818207 708504868 708062439 707521515 706847687 706093979 705481720 705412903 705685959
2741.7 705685959 705200348 704701004 704618759 704521332 704487152 704361191 704187927 703967056 703581696 702711487
2751.4 702711487 701870575 701399384 701285934 701476669 701471863 701190796 700579300 700242081 700264740 700537643
2761 700537643 700681534 700352020 699973373 699069824 698392105 698233871 697959137 697752609 697722549 697645264
2770.7 697645264 697397232 697490616 697423553 697335281 697232361 696849670 696416931 695539169 694876785 694274902
2780.3 694274902 693950500 693551865 692730408 692793732 692723389 692300568 691938095 691631851 691735229 691349258
2789.9 691349258 690633469 690200882 689461212 688563004 688153687 687711716 687084503 686102295 685301285 685267487
2799.6 685267487 684570084 683742371 683328247 682726135 682282028 681588669 680618515 679718857 678828964 678235092
2809.2 678235092 677709732 676584778 675391922 674451828 673751907 673399734 672809143 672049484 671218567
2817.9 671218567 670128326 668749084 667859192 667047348 665251160 663945541 663445740 663111420 662445831
2826.6 662445831 661384125 660609207 659794998 658994446 658090744 656832352 655236664 654006958 652939987
2835.3 652939987 651336136 650109787 648935013 647954636 646963196 645471191 644416275 643479767 642434921
2843.9 642434921 641303101 639851074 638080330 636362686 634259529 632108307 631147461 630161438 628833618
2852.6 628833618 627777977 626913948 625855980 624776955 623887978 622118492 620394592 619028587 617130508
2861.3 617130508 615137711 613324051 611447868 609319382 607593956 606048431 603907890 601574669
2869 601574669 599460869 597042274 594780655 592776070 589792671 586700516 583735046 580878716 578423347
2877.7 578423347 575868568 573693314 571553497 569469261 567546196 565925446 564761353 563256874
2885.4 563256874 561582642 560046844 559026642 558101997 557405014 557212830 556907501 556890411 556682701
2894.1 556682701 556607590 556859818 556647644 556021690 555283356 554921722 554483643 554070358 553700714 553159409
2903.7 553159409 552835884 552131500 550977631 550272751 549967422 549501572 549095497 548207016 546896858
2912.4 546896858 545439873 543593330 542233162 540666656 538780899 537017860 535174332 533709793
2920.1 533709793 531775169 529826431 528798294 527591286 526076546 525092049 524034233 523101006 522899055
2928.8 522899055 522163010 521495476 521744194 522166100 522693520 523672409 524939919 526012077 527144012
2937.5 527144012 528493385 530145950 531854706 533958893 536845551 539522362 541785851 543936806
2945.2 543936806 546474838 549262009 551793404 554211617 556749611 559444160 562170677 565035629
2952.9 565035629 567444077 569812431 572472191 575010757 577687302 580135002 582646904 585354118
2960.6 585354118 587768326 589925461 592318878 594754753 596694336 598624153 600599823 602459755
2968.3 602459755 604188347 605969429 607667618 609116325 610748558 612444000 614053688 615893402
2976.1 615893402 618063354 619806442 621039619 622220535 623591194 625109215 626521759 628167191
2983.8 628167191 629407272 630426025 631691628 632755051 633653488 634506721 635573044 636492500 637527237
2992.5 637527237 638403778 638971634 639769783 640474319 641288986 641515656 641591263 642009811 641801376 641647491
3002.1 641647491 641984482 642066345 641805878 641785660 641941757 642364273 642663574 642322235 641631775 641030960
3011.7 641030960 640529327 639279938 638238106 637607994 636859093 636384468 636048355 635794601 634741669
3020.4 634741669 633803520 633638344 633111153 632144775 630964470 629735641 628274574 627111206 626343117
3029.1 626343117 625754318 624622993 623052177 622232437 621247520 620405350 619405632 617959404 616740646
3037.8 616740646 615358887 614196472 612869911 611468697 610102539 609016571 608096619 606672096
3045.5 606672096 605822220 604829330 603376732 602122765 600856476 599878311 598705330 597174683 595469131
3054.2 595469131 593963661 592978363 591755676 590388374 589121819 587623100 586506577 585274582
3061.9 585274582 583746948 582860374 581636734 580200653 578747139 576572189 574731827 573732910 572876396
3070.6 572876396 571660652 570392494 569179573 568157959 566954765 565589638 564454765 563097610
3078.3 563097610 561861496 560106735 558437576 557235756 555495262 554002495 552716904 551896744
3086 551896744 551144104 549825020 548126678 546453972 545313873 543762512 542292290 540971146 539678268
3094.7 539678268 538573494 537075005 535826302 534619980 533460236 532165680 530817184 529659119
3102.4 529659119 528265190 526870003 525382233 524307785 522996216 521368561 520357742 519115791
3110.1 519115791 517607803 516152077 514673042 513827400 513361702 511781006 510268402 509515877 508170013
3118.8 508170013 506787643 505633583 504523849 502950554 501472626 500333290 498831406 497857132
3126.5 497857132 496734200 495366783 494033012 492680130 492152405 491618919 490113869 488080254 486805496
3135.2 486805496 485825653 484566422 483646011 482676506 481586151 480471954 479469299 478504791 477168274
3143.9 477168274 475836411 475030632 474173965 472813759 471808968 470934296 469431458 468098869 467251282
3152.5 467251282 465999641 464966698 464214706 462797470 461805382 461405945 460499306 459167786 458217773
3161.2 458217773 457206688 455878830 454853592 453798218 452885704 451861076 450932846 450043526 449035606
3169.9 449035606 448607178 447608490 446204147 445123024 444456902 443748322 442710686 441930466 440913582
3178.6 440913582 440219498 439309540 438186722 437507706 436652222 436039391 435199776 434287872 433328934
3187.3 433328934 432562943 432158203 431010513 430007210 429456291 428660622 427869186 427483788 426636467
3195.9 426636467 425259933 424682732 424530869 423947678 422971191 422194214 421295357 420285912 419537048
3204.6 419537048 418884315 418076897 416990242 416672745 416377563 415671120 415040588 414627419 414736786
3213.3 414736786 414301987 413508072 412276840 411148109 410899544 410382233 409524498 408713455 408233070
3222 408233070 407840919 407437134 406648636 405856590 405693321 405402756 405071335 404478073 403895988 403384781
3231.6 403384781 402800179 402224426 401777267 401614380 400628662 399683609 399117699 398896027 399210281 399098320
3241.3 399098320 398759003 397854385 397173920 396864548 396243477 395647011 394980087 394669304 394580002 394250526
3250.9 394250526 393654251 393415756 393145409 392826157 392839394 392265968 391441536 390826111 390598373 390163155
3260.5 390163155 389730682 389459114 388861122 388957863 389026794 388488045 387776070 387578506 387526169 386939621
3270.2 386939621 386352959 385781174 385915718 385675430 385230751 385257721 384751053 384332466 384140739 384352913
3279.8 384352913 384023132 383620796 383728447 383425369 383154907 382429466 381706886 380969048 380483589 380903778
3289.5 380903778 381224442 380992432 380296288 380284996 380449753 380095482 379643326 379181900 378790169 378369598
3299.1 378369598 378065948 377477303 377182121 377204666 376902771 376513786 376153946 375899048 375492706 375252953
3308.8 375252953 375068588 374850311 374599953 374383698 374074707 373279572 372938499 372719116 372407379 372110214
3318.4 372110214 371674194 371196938 370467339 370202599 370352440 370514412 370016632 369313087 369022064 368354759
3328.1 368354759 367956047 367757530 367294922 366616096 366244087 366224442 365752563 365599136 365812378 365499954
3337.7 365499954 364876556 364188538 363375206 363365211 363800964 363491058 362929955 362435532 362087746 361485596
3347.3 361485596 360893135 360517311 360166130 359908905 359656754 359789772 359462700 359119377 358607407 357515373
3357 357515373 357032814 356704521 356500206 355968208 355608292 355583954 355293503 355058784 354619408 354485016
3366.6 354485016 353961182 353629684 353362541 352402344 351815643 351100960 350827522 350682831 350160522 350004234
3376.3 350004234 350202942 350224953 349550133 349112701 349021568 348722916 348302040 348479042 348451881 347804146
3385.9 347804146 347446327 346984100 347165871 347142868 346798172 346497574 345361862 344897156 345157547 345457001
3395.6 345457001 345218506 344736977 344483452 344299431 344416733 344100456 344015198 344198151 344207306 343772011
3405.2 343772011 343001442 343060722 343527870 343627968 343229637 343092880 342767792 342362213 342483292 342344780
3414.8 342344780 342337227 341769104 341178360 341655464 342025681 341787682 341593552 341626015 341498528 341800461
3424.5 341800461 341787910 341488533 341782379 341585197 341293983 341523895 341557655 341590805 342122803 342079048
3434.1 342079048 341448212 341333160 341597672 341968536 341894760 341522598 341763649 342363739 342173271 341958237
3443.8 341958237 342420464 342920761 343391304 342979622 342731094 343287621 343874130 344025345 343914604 344628448
3453.4 344628448 344986763 344745865 344972954 345379639 345416641 345519180 346110306 346222382 346291466 346449928
3463.1 346449928 347045403 347558289 347362289 347839775 347800980 347665634 348247566 348611183 348953705 349339943
3472.7 349339943 349769478 349889297 350148315 350571327 350822334 351047058 351544151 352319107 352578735 352362518
3482.3 352362518 351850166 352046700 352636490 352956848 353674469 354360237 354788322 355261269 355754089 355812607
3492 355812607 355977745 356217041 356538315 357262497 357150154 357147827 357329674 357471733 358325577 359527168
3501.6 359527168 360363693 360005035 360153236 360780334 361037674 361515732 362625923 362993813 362032318
3510.3 362032318 362835884 363938980 364030647 364291725 364708633 365042343 365236664 365966911 366721115 367251968
3520 367251968 367786789 368506050 368410530 367593880 368832169 370139656 370249786 370507088 371432991 372372208
3529.6 372372208 373306732 373546982 373011665 373622284 374377747 375331306 375641479 375317001 376304665 376952362
3539.2 376952362 377676353 377977180 378450623 379768372 380918922 381185875 381169586 382839088 382737617
3547.9 382737617 383187561 384810219 385969048 386669197 385312881 386179810 387101974 388050079 389371681
3556.6 389371681 389720879 391188316 391838379 392619629 392986488 394454384 395860977 396065941 400044174
3565.3 400044174 400768166 398717041 398015671 398121300 401128883 402426605 404013367 405518837 406662140
3574 406662140 407371292 408344345 410410614 410892181 412869873 413820229 413460884 414991264 416779861
3582.6 416779861 417890930 419283714 423819275 424784279 422931213 424918823 424102173 426332474 428977547
3591.3 428977547 431582069 432743568 433373070 435515175 434577560 437981796 440899887 441295967 444315453
3600 444315453 444746857 445853539 448386993 449739304 451069336 454049454 457133331 457044868 460489807
3608.7 460489807 459511490 459133568 466130791 466769180 465842590 469101601 467890129 472665977 477262115
3617.4 477262115 476427460 477532387 476654472 477874107 480835724 483471832 486294365 489016533 491559944
3626 491559944 494127274 499949913 497826004 487711029 493915291 499717598 504688835 505139351 504024277
3634.7 504024277 507265587 510897598 513408051 513568230 514892731 517549133 520469856 521533661
3642.4 521533661 521913185 525223274 529814415 536124916 534731522 531308517 536528358 534989738
3650.1 534989738 531295052 531279068 538289070 543912697 548506126 552734909 544433632 547410927 553191299
3658.8 553191299 554838524 556366997 557642822 560320892 561002235 562876320 565139122 565984802 570373573
3667.5 570373573 572863579 573293877 573558998 567121277 570921402 580468178 590430450 589389992 570028534
3676.2 570028534 573966026 583157005 588236771 585666580 586434708 589955444 592080803 594151802
3683.9 594151802 594990501 595511208 600243111 607026024 597428131 594235802 603047485 598108253 598514824
3692.6 598514824 603746643 604892082 607528076 608025665 608086700 610471573 611815224 614950905 617679100
3701.3 617679100 611538620 609320946 614190369 616087875 616901512 617991409 621397858 625716095
3709 625716095 619541664 625030975 628900642 614724998 620057831 624859467 625029335 625562515 628683891
3717.7 628683891 630458527 626869049 629063148 635697212 632275505 627812881 632937202 633578262
3725.4 633578262 632677574 630471687 632008820 637024460 638091125 643525314 640709839 634454193
3733.1 634454193 644528427 644268494 633587265 633668404 636989365 638609810 642049789 646196518
3740.8 646196518 643501663 647918549 658845520 642085114 629682579 642247086 648749084 655381012
3748.5 655381012 652697830 643431168 654225006 646729279 641421814 647738495 652054977 655404358
3756.2 655404358 649955902 653194046 658232269 648528900 648531876 653868790 655457993 656426773 660853271
3764.9 660853271 657888184 652662506 657131424 663103027 662763443 652769852 655007935 658575821
3772.6 658575821 659007721 660255051 660508499 661890030 662627640 665454102 664564972 656835175 660537949
3781.3 660537949 663353577 664692001 666969376 663508682 662625427 664854660 666343765 666729813 666099548
3790 666099548 666348572 666854401 667957611 667901535 669480820 673332520 669915695 666910095 669206848
3798.7 669206848 673471909 679813614 671096115 659791565 664585114 669425507 676037979 680583801
3806.4 680583801 667629776 664967499 671091309 672891159 673664322 674804001 675268097 677577972
3814.1 677577972 683798981 681228485 666648254 673491135 680957413 685493851 684199905 664300308
3821.8 664300308 668571243 675410461 678184586 681141281 681146698 677246094 677635727 680005722 683653488
3830.5 683653488 684261169 675398254 679686050 686803131 680064926 682462006 691605377 680170746
3838.2 680170746 676958542 685332489 678739700 679186935 686777878 683574677 678674088 681600876
3845.9 681600876 683639984 684810333 688034668 687755508 690292664 695856247 687845154 687282715 670174026
3854.6 670174026 675019608 686968155 685053024 682699432 684890060 688116302 691156693 685535965
3862.3 685535965 686637039 694248810 688274307 682556686 687241058 693126602 698817368 689032440
3870 689032440 680362549 685589523 692386703 695149918 684203033 686342545 691506958 691778870 694263000
3878.7 694263000 697582016 689737778 683872223 691512985 693301086 694427032 697996140 684610367
3886.4 684610367 686948242 692097931 693965759 698365173 696016159 687173309 689330444 693065948
3894.1 693065948 692277222 693682938 694543915 697042313 698550720 689537582 695833282 698240204 692802200
3902.8 692802200 696386414 692653580 691707077 692030945 693219604 695373383 694594345 694843369 694701538
3911.5 694701538 694972610 695739441 696214142 698125534 699893646 695675354 692811661 698228912 698015976
3920.2 698015976 693507690 695754013 697867889 699335403 696585464 693266144 695642776 697570496
3927.9 697570496 698941727 698778763 698436584 699338608 696536255 696014175 697443924 697496872 698249512
3936.6 698249512 697927170 697381439 697709351 697946091 700193405 701153336 697043915 696732559 698659058
3945.2 698659058 699874496 700348282 698225937 699711380 699792938 696524200 698508682 699619141 699006271
3953.9 699006271 699626389 700102310 700590057 700453949 700598373 700854187 701572571 700940475 699537582
3962.6 699537582 700874329 701735764 701402512 701139603 701203156 701469193 700683365 700182800 700980453 701048050
3972.2 701048050 700522308 701319656 701981888 701555328 700778961 700696259 701459198 702058792 702536163 702479095
3981.9 702479095 702175446 702367325 702561188 702191620 701890945 702221298 702643585 703059311 702879715 702250671
3991.5 702250671 701827545 702368546 703138504 702545929 702128677 702501526 703287964 703670731 703680878
4000.2 703680878
##END=$$ End of the data block
