##TITLE=$$ Begin of the data block
##JCAMP-DX=5.00 $$ ACD/SpecManager v 10.08
##SPECTROMETER/DATA SYSTEM=Varian
##DATE=20 Nov 2012 09:38:50
##DATA TYPE=INFRARED SPECTRUM
##DATA CLASS=XYDATA
##ORIGIN=
##OWNER=
##NPOINTS=3735
##FIRSTX=399.26403809
##LASTX=4000.35498047
##MAXX=4000.35498047
##MINX=399.26403809
##MAXY=80.16715240
##MINY=24.88675499
##XFACTOR=1.0000000000
##YFACTOR=0.000000100000000
##FIRSTY=55.02077484
##DELTAX=0.96440572
##XUNITS=1/CM
##YUNITS=TRANSMITTANCE
##XYDATA=(X++(Y..Y))
399.3 550207748 545618820 554173584 543422585 532195435 525335922 524535904 530090561 524774094
407 524774094 515576439 512888603 522805824 526402893 526604958 535773125 538709869 533889122 529188728
415.7 529188728 529311752 529926987 525189438 530966415 536720047 530453796 524379807 525715904 525817070
424.3 525817070 527307510 529419136 529966469 526511497 523826065 525921860 523510895 522916870 520081749
433 520081749 515068970 512406349 510031052 511529617 515061226 518886681 517115288 521713562 528046913
441.7 528046913 521262665 518542061 519996758 525724983 527390289 522784386 523909225 528802834
449.4 528802834 533821411 534569855 534427071 534168205 535227394 536502800 538602524 539363937 532478790
458.1 532478790 536100578 537703705 536609612 535954056 531297646 527584038 525429459 528358650 530027542
466.8 530027542 526879921 525406418 522137985 517662773 516194763 512768860 510203819 512746811
474.5 512746811 512829323 511236305 505416069 501149025 502145500 505222130 511599464 512217178 512010422
483.2 512010422 510459938 507335396 507360229 506927528 509445877 507771111 504538612 503739243 502801323
491.8 502801323 502290306 501455612 503792877 507571869 510512466 508396034 504188538 502411308 501002731
500.5 501002731 498569679 495231590 496321754 496314888 497235336 496863365 493117523 493290329 492363777
509.2 492363777 490230446 489718781 489467506 486330299 483231583 481510010 479508057 477720871 474507980
517.9 474507980 472732430 469483604 468808823 468975220 467715836 469016342 470462570 473029213 470213928
526.6 470213928 465600128 462780876 461506500 462960625 462568588 463924828 466273384 468635712 470417252
535.2 470417252 472009888 475156174 476882706 479018440 483271255 485602989 483103485 482567101 485935783
543.9 485935783 488778191 491320915 493049889 494498749 495750313 496939697 497101746 496283150 494721756
552.6 494721756 490881577 487556801 485642700 484475021 482524338 481026306 480473289 479555511 479099960
561.3 479099960 476507378 474514847 471781731 466758194 462584610 458661575 455750999 451512833
569 451512833 448533325 446772995 444731331 442555008 442305107 443385468 441939850 443446045 445098839
577.7 445098839 445862198 446078720 446975937 450733070 453801117 457260857 460111084 464694786 469892998
586.4 469892998 474157715 477344856 478623695 479613800 480573654 483024750 484238510 484452934 484493408
595 484493408 484442024 484811058 484087563 483858032 483341446 483209839 483141060 482889023 483739052 483844795
604.7 483844795 483476944 483369179 483826675 483899612 484476318 484533424 484534492 485775719 486026573 486863365
614.3 486863365 487150116 488208923 489958572 491864738 495295410 497948303 500612907 501820221 502853279
623 502853279 505011902 507044296 508633690 510861435 513197098 513288727 514545097 516603127 518756065
631.7 518756065 520412331 521726036 523615646 523902779 524216690 522324944 521662750 523380127 523268051
640.4 523268051 524168015 524964981 526335678 527517281 528989449 530857353 530082283 528784294 528832932
649 528832932 530137520 528571091 526395531 526568832 527076302 528309669 529564438 532501678 534806328
657.7 534806328 535945168 536834183 537655449 538879814 537759285 536368332 535606766 535158730 535368881
666.4 535368881 532830353 526056938 532110100 537414513 539809875 541456833 542819977 543046875 542457886
675.1 542457886 541264954 541455040 541505470 541377716 541473885 542116699 544166832 546125641 548130188
683.8 548130188 549571228 550362930 550934105 551374283 551407509 550471191 549278297 548047791 547500610
692.4 547500610 546808243 546176872 546859055 547891541 548115921 547516060 547304611 546407814 543766022
701.1 543766022 540450974 537129326 533777962 531393700 530831642 530780716 531050224 531103706 531641159
709.8 531641159 533301086 534946251 536270866 537385101 537914505 537867470 539345360 541733818 543558960
718.5 543558960 544816475 546976852 551331215 555774345 560385284 563933792 566082382 568422470
726.2 568422470 570763741 573693008 575745926 576694565 578233643 579597015 581024132 582970619 585325623
734.9 585325623 588299789 590870857 591490288 591160202 592171936 593148689 592777405 591416473 590054359
743.6 590054359 589476585 588033218 587176704 587235527 585814095 583770981 581695404 579575043 577642479
752.2 577642479 575445404 572691002 569332352 566698036 565050812 562970695 561640701 560436172
760 560436172 557948380 555387268 553365746 552275734 551585808 551503181 552032051 552866631 555246353
768.6 555246353 558683891 561187820 563435135 566995697 571042786 574874115 578347588 581394958
776.4 581394958 585652733 590969276 595102005 598841705 602291107 605857277 610234146 613842049
784.1 613842049 616556282 618018379 618924599 620566864 622214432 623138809 624796257 627134743 628594398
792.7 628594398 630672531 634100990 637784386 641128082 643400574 644355545 646117554 647442017 646940079
801.4 646940079 647731400 649170761 651291199 653910980 656496582 659212189 661625671 664184036 665550232
810.1 665550232 667297897 667860184 667506866 668165131 667267609 666000366 665257797 665998917 667339249
818.8 667339249 668879623 670298309 671175766 672902985 672394257 670421753 668505630 665838776 663117294
827.5 663117294 660730896 657355347 653975372 652590179 651385498 650968781 650015182 648492432 647175140
836.1 647175140 644220505 640669632 636011276 631806717 627852669 623714485 621336060 619935989
843.9 619935989 619810104 619641838 618556900 618048668 617720985 616992760 615914459 613817558 610498581
852.5 610498581 607365875 604834442 602211876 599690056 598417778 597385674 596417732 596885338 598460999
861.2 598460999 601069145 603100319 604872131 608953056 613335838 615916824 618256531 623081360
868.9 623081360 629299698 635993233 643227692 649236221 655192947 660763016 664473801 666516113
876.7 666516113 668790588 669475479 667734604 666555405 665329742 663833618 662549286 661735153 659561844
885.3 659561844 657284775 655907593 653368759 649922562 645357056 641161270 637170868 633733521
893 633733521 630445976 626893539 625232811 623700714 621894989 620167274 618310356 616333618 614078255
901.7 614078255 612580719 610456276 606666756 602248192 598411026 594586220 590653381 587239609
909.4 587239609 583333015 578977966 574310226 569883728 565929070 560832787 555677185 551340904
917.2 551340904 546324577 541143036 537247581 534722786 531889000 529629517 528559380 527262802
924.9 527262802 525585403 524581223 525907707 526870499 526934433 527150002 527260666 528144646 529645500
933.6 529645500 532323647 534310532 535443268 537032509 539199486 542350235 545389671 548445473
941.3 548445473 551404610 554411659 557221069 558953209 559821053 559150925 556687508 552799187 548296318
949.9 548296318 543381729 537394142 531319122 524937630 517963600 510797119 503672371 496800461
957.7 496800461 489688263 481107483 472364883 464062576 454139671 444772758 435767708 426615028
965.4 426615028 416881371 406899338 397846413 387890892 379282494 370390015 360658607 350377083
973.1 350377083 340362053 331034164 321063461 312974663 303717976 295221233 287099304 280078278
980.8 280078278 275198708 269630013 265642776 260644779 257796612 255387135 252858925 251292725
988.5 251292725 249792500 250565586 249688568 249268951 248867550 249816437 250387878 250320549 252239170 252835026
998.2 252835026 254771843 255183010 256707420 258540287 258679543 259489822 259455948 260042915 258583050
1006.8 258583050 258640327 258802280 259029961 259853306 259315491 260422001 259992752 260952759 260727310 260484161
1016.5 260484161 261298103 261058102 262695389 263231983 264749222 265232639 266968021 269378185 270531540
1025.2 270531540 272224102 273267269 276640129 278309860 280554752 282036591 282614746 284277687
1032.9 284277687 284705734 286807346 287532635 289622002 290714531 291042118 292136021 292136478 293399429
1041.6 293399429 292717152 293607311 294521103 295449238 295354424 294814854 297388191 298410378 300516472
1050.2 300516472 301847038 303815536 306532650 309210300 311925240 313951035 318217869 320839233
1058 320839233 325120125 329368935 333625870 338621445 343100967 349421310 354647446 361468353 366778526
1066.6 366778526 370999222 373477669 373117523 371128273 364888954 359591408 352653313 345079498
1074.4 345079498 338322754 333411636 331753960 328269310 326133919 324371605 324744072 324697800 324374428
1083 324374428 325268898 326334038 329083900 329777641 332726097 334584427 336879768 340103340 342332687
1091.7 342332687 346369743 348665962 352649269 354948959 357447701 359703789 360410385 362566948
1099.4 362566948 363064232 364944458 365108490 365495949 365432434 364718781 366139641 366641502 368699112
1108.1 368699112 370174561 372634354 374369469 375697784 377540016 378269653 381132393 383163338
1115.8 383163338 384724121 385442200 386618385 387236862 388154564 390418549 390535278 392620087 393572502
1124.5 393572502 394260559 395524139 397265778 400050507 400663490 403052063 404931297 406277962 407762489
1133.2 407762489 409423599 411253052 411371651 411765022 411159210 410015831 406912880 403651924 400149536
1141.9 400149536 394963531 390273209 384585762 380707588 376688118 372943611 369161720 365859985
1149.6 365859985 364551659 362031212 360507851 357620888 356322899 355057602 352922783 351910667
1157.3 351910667 350032883 350152550 349834099 351330032 352248726 353820915 357349243 359582977 362891884
1166 362891884 365317993 369156265 372563553 377128716 382211494 386346931 392030792 396908684 403513985
1174.6 403513985 409709625 416848297 424492989 431606979 439328079 445827332 452876930 458657036
1182.4 458657036 464272461 469777336 475212021 480410118 484726906 490547409 495812035 500861626
1190.1 500861626 505155067 508741837 512530632 515434914 517521057 518322296 518929749 518949394 518756714
1198.8 518756714 519233627 520311127 522084656 523708839 525607071 526938667 528176079 529746323
1206.5 529746323 531076431 532071762 533031578 534185677 535427399 537956581 540496330 543213844 546509666
1215.1 546509666 549352036 552237968 555289192 558308678 560519485 562109642 562681541 562693367 562780685
1223.8 562780685 562372246 562384186 562202606 561987762 562196960 562116013 562195969 562122231 561780396 561248093
1233.5 561248093 560658073 559570389 558372192 557753220 556767540 556046791 555650902 555337219 555101357
1242.2 555101357 555033073 555534554 555887604 556400833 557530365 558801880 559548874 560074005 561075974
1250.8 561075974 562195358 562937584 563632545 564649773 565943489 567328072 568269501 569037857 569892654
1259.5 569892654 570540886 571492195 572878304 574018517 574713364 575050240 575590973 576473465 577045708
1268.2 577045708 577804985 578856087 580089073 581341324 582400398 583443565 584115105 584886093 585109978
1276.9 585109978 584915085 585042953 584749413 584069138 582927742 581535721 580842705 580811653 580477829
1285.5 580477829 580103989 580304031 580805016 581020660 580665894 580377846 579693260 577937431 575997353
1294.2 575997353 574770699 573529816 571736450 570141373 569336166 569227638 569196358 569231033 568986549
1302.9 568986549 568918076 569424782 568655777 567060547 565674400 564058723 562472878 561250954 560570984
1311.6 560570984 560323448 560663986 561439819 561799469 561747551 561603813 561072197 559691200 558178864
1320.3 558178864 556564217 554434967 552231750 550155792 548231621 546286240 544687767 543656273
1328 543656273 542327919 540655441 538495789 535957756 533177490 529939461 526904602 524009056 521801796
1336.7 521801796 520215492 519497795 519700470 520011253 520996552 521670609 522181969 522294731 522545700
1345.3 522545700 522119026 521206970 520451622 518973846 518340187 517969894 517844353 517767906 517947350 518640099
1355 518640099 518826370 519352951 518968620 518349571 517536049 516377907 515544395 514278336 512954788
1363.7 512954788 512145691 512671738 512982330 513528214 514117813 514337540 515443573 515455551 515986938 516070213
1373.3 516070213 516138077 516329651 515861893 516504478 516617928 517547188 518350754 519711418 521379623
1382 521379623 522331200 523696404 525249863 527563782 529093132 531026497 532625198 533915329 535262299
1390.7 535262299 536326447 538074875 539824715 541799965 541843529 542124405 542695045 543650589 543531685
1399.3 543531685 541883812 541934395 541076469 540398560 539872665 538633461 537772102 537090454 536735268
1408 536735268 535930595 535914383 535754051 535418854 534323692 532968445 532463913 531594925 531313286 530267563
1417.7 530267563 529846382 527907028 527799644 529259071 529449692 530633163 529977798 530480804 531473427
1426.3 531473427 531319351 532017937 531898117 532087288 531912918 532982788 533398590 533132095 534372597
1435 534372597 535016861 535374641 535802803 538312874 539355621 539971657 541062508 541259308 542322655
1443.7 542322655 542189178 542478371 542412605 542879372 541997337 540555038 540952911 540425682 540801926 539867363
1453.3 539867363 540223351 540656586 539502296 538588333 534460716 534768486 532223930 532742844 532307472
1462 532307472 532595825 534809647 535081444 538173943 539620399 543378220 545701103 548598404 552501106
1470.7 552501106 554170265 559237289 560842590 565911293 569143906 573600731 577021217 580510826
1478.4 580510826 585776329 589219398 594545822 597328911 601144142 604259186 606399765 609301567
1486.1 609301567 609593163 613246307 615180779 617894478 619519043 622875443 626751747 629182014
1493.8 629182014 633551788 635901031 638219109 639994469 641685867 641620178 641955719 643531494 644014969
1502.5 644014969 646525421 648547211 652655792 657004852 654365692 657494278 658133163 661809845
1510.2 661809845 662692261 663547211 662255325 662939835 664525986 664805069 667167664 665595169 669872818
1518.9 669872818 672355194 672149963 674896851 675221252 678944321 679806213 679341660 678114014 679265594
1527.6 679265594 679131088 678022690 679885406 681245651 684079285 684103622 684575424 687669754 689287415
1536.3 689287415 691392975 693140717 694297409 684062805 687642441 688451080 688406982 691993942 693066483
1545 693066483 693190765 693989334 696275558 697647552 697753220 697779388 698482285 699404602 699687195 699309006
1554.6 699309006 697818451 700307388 702679672 697286377 699345169 698188171 702766113 704356461
1562.3 704356461 705402679 705725403 704398346 704282684 704646301 706294937 706474457 702757645 703400040
1571 703400040 705164337 706357040 707477188 709702911 710511780 707070465 707168579 707919769 707458572
1579.7 707458572 707058716 706941681 706561279 706467514 706286392 706262970 705948257 705916061 705772705 705531387
1589.3 705531387 705413132 704806137 704249344 703854141 703347855 701416702 699944458 698786621 697472305
1598 697472305 696450272 695156403 693856430 692526703 691856384 690725861 689589462 688688126 686920624
1606.7 686920624 684666977 682843704 680294495 677059174 675065918 672365799 670177612 668190231
1614.4 668190231 667564545 667146149 659144592 658405609 657839813 656538620 654215622 652543411 649730301
1623.1 649730301 642924271 641721268 640598297 639966049 636851845 634236679 633525238 632365227 631666107
1631.7 631666107 630223312 630130424 629730759 623770599 621264725 621116180 619743385 619089851 619062538
1640.4 619062538 617734489 617903404 617566414 618781052 621093903 621014137 621776657 620010567 620273285
1649.1 620273285 620751534 622432976 626739159 636196098 622924728 620939255 623896065 626097946
1656.8 626097946 628601570 630645485 632640572 634529762 636222267 637241096 636811256 638490486
1664.5 638490486 639572792 640647888 642796707 645797424 647232285 648867035 652399063 654110794
1672.3 654110794 656898117 660188675 662063751 661160812 662982101 665089417 666615067 668490524
1680 668490524 669099503 672215500 676858978 679602737 678212814 681243668 685068283 687594223 689019775
1688.6 689019775 690709152 691584854 692446365 693712463 695189209 697890701 700987625 700279083 702063370
1697.3 702063370 705411682 709692993 709356918 706014557 710548248 713597794 714838791 714237289 715041580
1706 715041580 714798660 716067963 718665085 720511017 721927261 723412781 725442276 727580185 727972336
1714.7 727972336 727144775 729624863 730394058 725006485 727899551 730445480 731892014 733044434 734378510
1723.4 734378510 735287552 736738815 738370361 738977432 739894180 740758972 740071945 739351196 741505051
1732 741505051 744148407 741784210 738737030 742001114 744835892 745939407 748073044 749583282 748210144
1740.7 748210144 749429398 749978561 749335022 748677826 750103912 751003723 750942841 751442642 751206818
1749.4 751206818 753886566 754003525 752973862 754714966 755317535 756117096 757040024 756477203 756484070
1758.1 756484070 757358398 758358154 760223465 759395752 757952576 759014664 759337921 760027618 760974350
1766.8 760974350 761803741 760564346 761124191 763430939 764380569 763288116 761039658 763335114 764452286
1775.4 764452286 763309250 764084549 764224243 765106964 765321732 764659195 765420227 766606445 767750015
1784.1 767750015 767657318 767835236 768536224 768828812 768339386 768549576 769024734 769202347 768362274 767382431
1793.8 767382431 769020996 769939194 770197525 771237183 772722168 773469849 772456207 772914810 772228928
1802.4 772228928 771737823 771602020 771029968 771768265 772463760 773030777 773956223 775560074 776195068
1811.1 776195068 776483841 776723099 776329041 776421661 775935822 775564499 774512100 774193726 774818649 775106964
1820.8 775106964 776230469 777259445 778945694 780143661 778852463 778822250 779648743 780054245 779466934
1829.4 779466934 776302490 775708923 776861649 777068176 777594223 778605804 779787064 780973816 781274719
1838.1 781274719 782072296 781849365 781347885 780735321 780897598 781223602 777306061 777695160 778764038
1846.8 778764038 779210129 779929504 781220474 782593155 782825012 783177567 782734146 782040176 781041183
1855.5 781041183 779985809 779618607 779223480 779301071 779136047 779950180 781210556 782452621 783200073
1864.2 783200073 783282318 783953247 783789444 783845825 782409592 780205765 779931793 779947968 780603561 781091690
1873.8 781091690 781769638 782590790 783527603 784006348 784447250 784939957 784611816 784257736 783088379
1882.5 783088379 782458725 782124100 781623535 781592255 782093430 783991318 784768753 784300156 785026245 785931702
1892.1 785931702 785876389 785628052 785287247 783976517 783721924 783567657 783602524 784055481 784274292 784854965
1901.8 784854965 785583267 786373901 786457825 786517410 786540604 786070099 785394135 784915619 784475327 783979340
1911.4 783979340 784471970 784492264 784909592 785525589 786175003 787782974 786689911 785636063 786107330
1920.1 786107330 786461945 786909790 785969772 784939117 784906921 785356979 785577393 785796738 785965576 786298752
1929.7 786298752 786692123 786462173 786318588 786116486 786576843 786742783 786418228 786176682 785919189 786266632
1939.4 786266632 786154861 786429520 786031494 784770050 785310059 786007919 786482239 786689606 786900482
1948.1 786900482 786853409 786651154 786551285 786599350 786738358 786751022 786955109 786723022 786600189 786729507
1957.7 786729507 786969376 787184448 787312469 787692032 787888489 788313675 788417206 788710556 788816910 787940369
1967.3 787940369 787288284 786840591 786933823 786746445 786773071 787385712 787831650 788216782 788107529 788491364
1977 788491364 788981934 789000702 788946228 788709030 787988586 787337952 787205276 786974564 787282410 787765503
1986.6 787765503 788339539 788640671 788812790 789991455 790588684 789724274 788690948 788402939 787888489
1995.3 787888489 787193375 786706696 786247864 786694031 787126312 787744064 788625259 789104996 789385452 789658966
2005 789658966 789670792 788686142 787878418 786777344 785726089 785719070 785856934 786039658 786067810 786452332
2014.6 786452332 787079239 787720566 787880096 787963562 788072739 787258530 786189728 784625397 783759689
2023.3 783759689 783607941 783311310 783437805 783843384 784506454 784980927 785536804 785677567 785384750 784663162
2032.9 784663162 783676987 783052063 781968689 781201019 780611115 780537262 780945587 781245117 781936493 782346878
2042.6 782346878 782926788 783018494 782717819 782294159 781780930 781349106 780165253 779339066 778878403 779074249
2052.2 779074249 779571533 779979858 780683517 781043472 781724548 782079163 782066269 781913452 781472321 780676041
2061.9 780676041 779733429 779754181 779444885 778936920 779195862 779832458 780446167 780888824 781351471 781624985
2071.5 781624985 782122116 782262421 781974106 781404648 780624161 779975739 779541092 779694748 779757156 780179062
2081.1 780179062 780772705 780954895 781397324 782031784 782244492 781993713 781987076 781711884 781302261 780595322
2090.8 780595322 779931870 779980011 780289536 780823822 780789566 781249237 781912994 782140121 782590561 782805862
2100.4 782805862 783150635 782835693 782320938 781679916 781132050 781081619 780564194 780578690 780965576 781633377
2110.1 781633377 782182693 782669144 783581848 783853531 783641815 783264694 783073730 782279968 781544724 781687317
2119.7 781687317 781582413 781228790 780926514 781322479 782000046 782812347 783455200 783666534 784167328 784440765
2129.4 784440765 784093857 783104095 782174759 781454086 781151276 781047516 780958405 781560211 782202988 782989044
2139 782989044 783527451 783836517 784078217 784182053 784299164 783561554 782868576 782421951 781713181 780946198
2148.6 780946198 781136017 781860428 782033539 782851486 783456879 783951035 784902649 785299149 784885178 784004669
2158.3 784004669 783281021 782247620 781542053 781439972 781863861 782416000 783072357 784379654 785023193
2167 785023193 785727463 786579742 786879196 786897354 786442566 785545197 784436646 784107285 783863754 784011459
2176.6 784011459 785063171 786180725 787455597 788515930 789268723 789496765 789404449 789224396 789065933
2185.3 789065933 788502808 787479248 786865997 786608047 787139435 787612457 788192291 789344254 790390167
2194 790390167 791607590 792283783 792475662 792144012 791656647 791147690 790231323 789645004 789276123 789076462
2203.6 789076462 789280777 790510635 791867599 792866821 794128113 794677429 794533463 794153976 793771896
2212.3 793771896 793150940 792615662 792250290 791956787 792236023 792589569 793412857 794561157 795594101
2221 795594101 796167755 796453781 796936951 796798630 796406021 795828476 795015335 794170303 793962631 794542084
2230.6 794542084 794875641 795340118 796254654 797221680 797363663 797560501 798283539 798257141 797614899 796753769
2240.3 796753769 796196442 795646133 795448074 795776749 796259232 796695557 796897354 797780457 798457031 798682709
2249.9 798682709 798926773 799048615 798910446 798311462 798005219 797594833 797182083 796897964 797053757 797609177
2259.5 797609177 797920990 798387527 798659592 799117203 799593506 799852905 799906464 799655457 799416580 798862457
2269.2 798862457 798682327 798797531 798751831 798537140 798652573 799104767 799814148 800672379 800706329 801141663
2278.8 801141663 801671524 801588821 801332397 801071777 800751114 800061340 800063858 799672012 799605408 800109024
2288.5 800109024 800514755 801382294 801151047 801116257 801296005 801363754 801372299 800729446 800039673 799095917
2298.1 799095917 799262085 799111328 798463211 798337402 798514481 798989334 799175949 799775620 799485321 799445877
2307.8 799445877 799139099 798178253 797929535 796806107 796336594 795519943 795424271 795608521 795177078 795714188
2317.4 795714188 795068436 795336304 795538177 794943237 794392776 793796616 793184662 791109772 790489655
2326.1 790489655 789768982 788936234 788134766 787255325 787730179 788347855 790730133 792336960 792927856
2334.8 792927856 792442169 790709305 789285660 787689590 786651077 785992813 787074738 787036133 786252289
2343.4 786252289 786530685 787683487 790486145 793054428 795905914 796581268 794320374 791560745 788879547
2352.1 788879547 785964813 783796997 783065872 782333603 782425003 783599930 782924957 781064911 782556839
2360.8 782556839 785014343 784105072 783967285 784207916 784132690 782680435 781652222 783496628 784876099
2369.5 784876099 786504364 787995453 789506912 791667480 793901520 795077286 795282211 796386414
2377.2 796386414 796702118 795779724 794973755 795208817 796055450 796746826 797535248 798209839 799336929
2385.9 799336929 800392151 800924225 801375809 801433258 800919800 800214767 799478683 798509827 798158875 797920303
2395.5 797920303 797565384 797771988 798171234 798665924 799256210 800210342 800572433 800356903 799991302 799289551
2405.2 799289551 798653641 797919464 797529449 796780090 796391296 797005615 797172623 797600479 798201218 798346710
2414.8 798346710 798307343 798070297 797663498 797316742 796909790 796113892 795075989 794376831 794325485 794062347
2424.5 794062347 794048080 794538879 794893036 795168533 795318985 795537567 795267105 794746704 793850479 792739410
2434.1 792739410 792338791 791913147 791291962 790864182 791048279 791289139 791683884 792116394 792171555 792572327
2443.7 792572327 792249146 791786194 791240768 790190887 789601288 788834991 788407516 788469238 788339310 788203049
2453.4 788203049 788694763 789251175 789275894 789374847 789052353 788547058 788055191 787731705 787429504 786570663
2463 786570663 785930710 785718842 785797119 785699081 785501175 785602493 786107483 786936951 787087097 786529007
2472.7 786529007 786043777 785644379 784627914 783619003 783317337 783192825 782838440 782454987 782791824
2481.3 782791824 783478088 784088821 784193573 784130173 784374695 784184036 783764877 782992249 782064972 781212311
2491 781212311 780779800 780724792 780248795 780353088 780910187 781430588 782229843 782851028 782858353 782380219
2500.6 782380219 781912155 781594696 781172791 780429306 779991913 779561844 779256744 779464645 779716949 780336685
2510.3 780336685 780688934 781091156 781549149 781352615 780816040 780050659 779546967 778988571 778423462 777918396
2519.9 777918396 777694092 777849045 777980194 778485107 778825455 779082413 779033737 778738785 778727417 778048172
2529.6 778048172 776937866 776315155 776224365 775781631 775122147 774962387 775227509 775593262 775880966 776428452
2539.2 776428452 776732483 776523972 775753174 774804993 774148788 773474808 772739639 772065048 772006302 772064896
2548.9 772064896 772094650 772273483 772546082 773150711 773261108 772821579 772100143 771593704 771159210 770508270
2558.5 770508270 769977875 769363403 769121323 769086761 769280319 769280853 769110947 769505081 769458008 769138412
2568.1 769138412 768956528 768513794 767940292 767631073 767139969 766583633 766523514 766402588 766454391 766403198
2577.8 766403198 766523895 766745605 766403732 766171570 765956116 765740891 765045700 764263840 764055786 763878937
2587.4 763878937 763753433 763553696 763204193 763133469 763715515 763847885 763580093 763516922 763329010 763153915
2597.1 763153915 762740250 762607346 762224884 761666336 761334839 760830765 760877457 761285782 761811142 761745911
2606.7 761745911 761494598 761422195 761196213 761050415 760395889 760028992 759536972 759023437 758924408 758385544
2616.4 758385544 758023987 757615814 757193527 756958466 757123032 757235107 756616592 756099014 755961304 755875854
2626 755875854 754972305 753905106 753170853 752544937 752444611 752159042 751540604 751075363 751217117 751266022
2635.6 751266022 750806351 750422134 749910965 749360886 748774719 748209686 747492218 746608124 746052780 746017914
2645.3 746017914 745810318 745139389 744828491 744352341 743764877 743499603 743439713 743251114 742467194 742020645
2654.9 742020645 741460800 740465546 739971771 739443512 738578491 738228378 738321457 738131866 737997894 737897949
2664.6 737897949 737669144 737274628 736583023 735940704 735294952 734436951 733814316 733823013 733327484 732450409
2674.2 732450409 732548828 733143005 733181534 732579880 732221451 732187958 731724548 730541229 729835434 729798889
2683.9 729798889 729291000 728730774 728091812 727701797 727891769 728366928 728583527 727985687 727503738 727115555
2693.5 727115555 726634903 725952072 725173035 724715195 724208221 723620224 722824707 722492447 722553940 722457504
2703.1 722457504 722225342 722023163 722035522 721544647 721038895 720572357 719807205 718936081 718033142 717401657
2712.8 717401657 716939240 716857605 716617508 716317902 716146545 715910339 715692673 715151138 714941711 714632034
2722.4 714632034 714142456 713577728 712690506 712206650 711630707 711135559 710985718 710629883 710163040 710210114
2732.1 710210114 710418167 709994202 709410095 708752136 708379364 708103943 707390213 706833572 706617203 706470490
2741.7 706470490 706079788 705849380 706046066 706258621 706253586 706187897 705826645 704907837 704038696 703395309
2751.4 703395309 703050079 703001480 703042297 702801514 702192230 701765900 701767960 702003708 702071838 702346497
2761 702346497 702358398 701475525 700329285 699722366 699948578 699903641 699477615 699136047 699036255 699117126
2770.7 699117126 699044266 698947067 698739243 698635254 698277054 697888718 697486115 696808395 696275406 695732040
2780.3 695732040 695435638 694905014 694600067 694263458 693664093 693789215 693551788 693231430 692896500 692489395
2789.9 692489395 692103195 691332245 690573654 689621735 688954544 688199921 687808380 687712021 687051544 686697159
2799.6 686697159 686196747 685460663 684507065 683922958 683716431 682983170 682219315 681137772 679974213
2808.3 679974213 679170227 678548584 677716751 676826553 676012573 675107727 674654617 674064941 673394394 672707901
2817.9 672707901 671719131 670751801 669658585 668545761 667293930 666022491 664912720 664059982 663089600
2826.6 663089600 662139511 661569901 660870972 660285339 659491043 658439026 657109070 655600815 654246674
2835.3 654246674 652762451 651455917 650084839 649165497 648154602 646562881 645509186 644477386
2843 644477386 643502960 642333832 640621414 639023437 637546463 635733337 633789482 632643967 631862335
2851.7 631862335 630581322 628882828 627594070 626748581 625920143 624980240 623623428 622091217 620169487
2860.3 620169487 618353233 616662827 614420700 612309074 610713501 609036484 606738930 604658737
2868.1 604658737 602806664 600678978 598396568 595898056 593279686 590479507 588056297 585257721
2875.8 585257721 582153931 579571648 576677322 574223785 572432213 570826187 569235954 567571831
2883.5 567571831 566163559 564187584 561998558 560730171 560091019 559316483 558321457 557519722 557285728
2892.2 557285728 557294998 557007179 557208519 557497330 557399788 557263374 556522369 555916252 555680542 555203514
2901.8 555203514 554836044 554480057 553899231 552916870 551737823 551322136 551246414 550653801 549850998 548853989
2911.4 548853989 547780228 546498451 544884644 543114243 541183128 539369850 537320213 535358849
2919.2 535358849 534143600 533070984 531799507 530776329 529707909 528216248 526812401 525160675
2926.9 525160675 524085045 523848534 523268509 522840614 522408066 522376175 523330307 524573059 525628738
2935.6 525628738 526490784 527854996 529637489 531468849 533355331 535522232 537877884 540453796
2943.3 540453796 543118858 544903297 546820335 549659500 552378311 554889946 557610245 560205383
2951 560205383 563011436 565832291 567970009 570548172 573327599 576287956 579316750 581639671 584066429
2959.7 584066429 586406860 588914833 591180077 593092422 595309601 597345123 599555054 601657066
2967.4 601657066 603498611 605437927 607546120 609483452 610811920 611960907 613541527 615354118
2975.1 615354118 616887398 618780289 620729218 622461014 624068871 625209923 626479874 627782478
2982.8 627782478 629163361 630660400 631795387 632418251 633348579 634621086 635528564 636717987 637725639
2991.5 637725639 638919296 639965057 639952164 640749054 642133026 642629623 642597122 642782059 642921753
3000.2 642921753 642932816 643278961 643836899 643926010 643447113 643597412 644128799 644070587 643529434 643456955
3009.8 643456955 643553696 642935638 642083893 640937805 640477066 640280914 639245377 638429070 637868843
3018.5 637868843 637126389 636249084 635600967 635176926 634653206 633302116 631868095 630884933 629580154
3027.2 629580154 628763428 627802696 626975136 625986862 624476089 623994255 623387871 622708435 621273613
3035.9 621273613 619231720 618346596 617678413 616507645 614805946 613244667 611816902 610740204 609918442
3044.5 609918442 608490944 606995659 606096039 605541115 604194870 603076324 602042809 600123520 598386002
3053.2 598386002 596862679 595579872 594141121 592986870 592193336 590775452 589299545 588189621
3060.9 588189621 587149239 586051483 585040359 583462257 581858177 580587234 578667221 576605759
3068.6 576605759 575127754 574011154 572809753 571952362 570949097 569924431 569100800 567779160 566421204
3077.3 566421204 564792137 563470650 561917114 559903870 558505173 557132339 555881767 554618607
3085 554618607 553434448 552024460 550795708 549989510 548723068 547307167 545495796 544189720 542891312
3093.7 542891312 541171265 539944305 538351059 536656494 535409393 534732475 533752556 532577858 531437378
3102.4 531437378 529643860 528103104 526997528 526024094 524542618 522850380 521246605 519747505
3110.1 519747505 518516655 517151604 516383743 515477409 514538803 513315849 511222534 510002480 509465599
3118.8 509465599 508866692 507548752 505931702 504287529 502567291 501261368 499925079 498984299 497948112
3127.5 497948112 496712494 495425186 494135399 493335686 492340355 491149330 489757042 488648186 487474327
3136.1 487474327 486007843 484903183 483504333 482348633 481333275 480195999 479287720 477917252
3143.9 477917252 476691360 476280136 475596924 474092712 472482796 471320534 470617294 469590073 468111725
3152.5 468111725 466714592 465880623 465257530 463935013 462855301 462197876 461454277 460456467 459270477
3161.2 459270477 458548470 457799606 456644363 455089417 453666077 452799721 452196884 451248970 450197334
3169.9 450197334 449675713 448650970 447515144 446567039 445422897 444338760 443512230 443046150 441825867
3178.6 441825867 440383835 439172630 438357849 438056793 437552872 437116852 436417694 435847054 434750786
3187.3 434750786 433303986 432818184 432114487 430951767 429949875 429307861 428356781 427389336 426853256
3195.9 426853256 426506233 426302643 425363083 424207230 423155670 422691956 422239761 421124344 420448685
3204.6 420448685 419633026 418867035 418212624 417745819 417350349 416530914 415834274 415009079 414762230 414441795
3214.3 414441795 413602104 412860069 411937141 411507263 410896111 409694061 408876266 408673782 408258400
3222.9 408258400 407615891 407193146 406713715 406408310 405748253 405313873 405201950 404325027 403714485 403459206
3232.6 403459206 402710190 401750298 401236115 401127319 400642624 399922905 399743919 399660225 399131317 398328629
3242.2 398328629 397663879 397648087 397309875 396434860 395776787 395342560 395176086 394977226 394818192 394472198
3251.9 394472198 394123878 393482094 392458382 392324829 392418213 392491875 392196579 391270790 390978165 390537338
3261.5 390537338 389494591 388981972 388806992 388595352 388550606 388404770 388096161 387919235 388013878 387750587
3271.2 387750587 386903496 386447792 386294708 386049423 385471573 384658356 384412575 384675903 384853897 384499893
3280.8 384499893 384053841 383661308 383227692 382839432 382641220 382779808 382416000 381648102 381086693 380966148
3290.4 380966148 381163483 380792122 380247307 380350227 380151329 379430161 379306488 379051895 378760033 378811455
3300.1 378811455 378209534 377487793 376938744 376705742 376707611 376580582 376238518 375630646 375239677 374876022
3309.7 374876022 374671593 374497223 374401855 374249039 373564949 373117676 372418556 371850548 372166138 372111740
3319.4 372111740 371639252 371558495 371288185 370422707 369760513 369941406 370504913 369897385 368633995 367841988
3329 367841988 367511024 367456627 366801453 366503563 366529732 366205368 366141624 365905609 365455742 364887466
3338.7 364887466 364350166 363808022 363408661 363017235 362454643 362350349 362343826 361973610 360899506 360309525
3348.3 360309525 360526619 360278587 359979324 359480629 359102783 358941002 358345299 357782211 357156372 356537247
3357.9 356537247 356381378 356181984 355826492 355728874 355540924 355082245 354167900 353554840 353724060 353473511
3367.6 353473511 352686729 352099228 352039032 351492653 350748138 350571976 350197983 349750481 349492874 349566383
3377.2 349566383 349397888 348909531 348329277 348287811 348590736 347957039 347467270 346419449 345720024 346084862
3386.9 346084862 345794907 345927162 345969887 345897827 345627670 345043907 344764862 344501610 344793587 344452477
3396.5 344452477 343912163 343845444 343605080 343360023 343085747 343057785 343079720 343335190 343213654 342942772
3406.2 342942772 342665672 342342873 342691307 342687454 342489204 341994095 341544762 341798019 341724510 341042442
3415.8 341042442 340606918 341262474 341927719 341790771 340770187 340383034 341051865 341044006 340973625 340853920
3425.5 340853920 340678596 340898972 341135406 341067810 340787048 340407448 340348778 341142464 341248016 340870171
3435.1 340870171 340606918 340266380 340627899 341407585 341916122 341599503 341560402 341798058 341896095 341954842
3444.7 341954842 342118225 342689972 341941032 341806564 342643013 343218842 343586082 343267212 343291969 343603706
3454.4 343603706 344096947 343786278 343378410 344032478 344504509 345061836 345378151 345712776 345518723 345680885
3464 345680885 346606598 346615448 346515694 346180191 346505127 346910706 347246017 348303261 348767204 349398727
3473.7 349398727 349273605 349040871 349723587 350224571 350704269 350439262 350736389 352007217 352113037
3482.3 352113037 351356010 351405067 352019081 352535133 353180923 353386993 353467560 354094124 354498138 354331551
3492 354331551 354475403 355406876 356142731 356420746 356959724 357382698 357615051 357962494 358079300 358827667
3501.6 358827667 359685822 359576035 360012245 360887451 361089478 360786781 361587334 362384109 361984367 362473717
3511.3 362473717 363071213 363104248 363331261 364393196 365089760 365184975 365940361 366385918 366337318 366769562
3520.9 366769562 368191223 368969269 368858070 369156914 369504852 370416222 370930748 371501350 371726913
3529.6 371726913 371978264 372419548 372544403 373709717 374170914 375403137 376503563 375563469 376211777
3538.3 376211777 377111855 377766266 378318939 378914375 379615402 380297737 380496178 380518150 381678925 381192398
3547.9 381192398 382039795 383736687 385191269 386613274 385352516 385974045 386956177 387724266 388484764
3556.6 388484764 388278656 389962807 391859741 393206062 393627625 395194817 395998726 395818443 399195442
3565.3 399195442 400168381 400103111 398976784 398466187 401943092 403101044 404424667 406285667 407261620
3574 407261620 407613335 408596344 410643501 411037636 412456474 413382607 413835373 415415077 416905670
3582.6 416905670 418267822 419383469 423550491 426000137 425183372 426144447 424582634 426842842 429492874
3591.3 429492874 432140541 433890228 434621048 437222977 435869980 438234940 441683044 442370491 445636978
3600 445636978 446478729 446872635 448401489 449725952 452201843 455372200 457346115 456050797 459463463
3608.7 459463463 460032425 460349846 467582130 468646812 466662674 469818306 469476852 473674545 477431564
3617.4 477431564 476464195 478324852 478009377 478789711 481991577 484216919 486501884 489547272 492004242
3626 492004242 495108337 501902580 500426102 489509010 494839287 500718689 505850525 506536446 505662422
3634.7 505662422 508504295 511530190 514214630 515033722 516173553 518059120 520727348 522955284
3642.4 522955284 523635674 526201248 530843620 537660217 537309761 532552452 536701088 537214088 533630371
3651.1 533630371 533074646 539701385 544740639 549396858 554235229 545751114 548610992 554525604
3658.8 554525604 555811081 557392654 558782501 561431770 562265434 564185066 566886482 568198090
3666.5 568198090 573168945 575721664 574976387 575345306 569500427 573730812 582937241 591252365 587503777
3675.2 587503777 569223557 574810448 584040413 589256516 587138405 587992744 591397972 593448029
3682.9 593448029 595723724 596776772 597710648 602681770 608776627 598056908 596110229 605336685
3690.6 605336685 598253479 598931274 605479317 606556244 608627357 609779587 610333672 612099800 613591843
3699.3 613591843 617141685 619522095 613133545 611475258 616760597 618129120 618391991 619467010
3707 619467010 622799454 627209969 620962219 626261063 630538635 616362381 621396484 626419334
3714.8 626419334 627071037 627929077 630555687 631831551 628381042 630527382 637123909 632192154 627342110
3723.4 627342110 634238968 636575699 636061401 632751884 633412552 638127594 639766426 645792389 642355194
3732.1 642355194 636183548 646138229 645096741 634579887 636193619 640348511 641381454 644254684
3739.8 644254684 648003693 644771423 648706055 660317307 645709457 632178154 644081268 650013428
3747.5 650013428 657617340 654896851 644168396 655817337 647282257 641294022 648725967 654165268
3755.3 654165268 657075043 650953217 654599380 660078659 651667862 651929398 656855240 658126221
3763 658126221 659151382 662717590 658885422 654440384 658632278 664348221 663670731 654035187 656629639
3771.7 656629639 659707108 660351562 661687241 662126923 663877716 664516296 667736282 667567291 659111862
3780.3 659111862 662116165 664704285 665493240 667892761 665583420 665521698 667149048 667655716 668365936
3789 668365936 667765961 668165970 668945847 669996338 670269394 671705322 675813446 671931915 667591095
3797.7 667591095 670350189 675376663 681168137 671089172 662131424 667238007 671145477 677169266
3805.4 677169266 681880875 670177917 667062836 672738037 674517517 675490494 676915054 677847672
3813.1 677847672 680199356 685622864 682628326 668424683 675265274 681784439 685742111 685512848
3820.8 685512848 665103073 669894943 677332687 680420151 683363800 682820816 679357376 679557190
3828.6 679557190 680736923 683829575 685455322 677623367 681598434 689278946 683241196 684436798
3836.3 684436798 692144318 680508575 678058853 686398544 679882889 680166855 687813187 685288467
3844 685288467 680598602 683208008 685068054 686410904 689506073 688971634 691930237 698686142 692061920
3852.7 692061920 688211288 667851105 675819092 688877792 687020187 685096130 687818298 690736237
3860.4 690736237 693152008 687863693 688963547 695830841 688781128 683261490 688365173 693947754
3868.1 693947754 699440994 689784546 681215973 687061615 693747406 695723648 685146866 687790604
3875.8 687790604 692546082 692625351 696102905 700991211 693413086 686363449 693725204 695326920 696309357
3884.5 696309357 699550323 686145706 688996506 693870544 695669937 700658875 698542557 689680252
3892.2 689680252 691498566 694727097 694217606 696001663 696711655 699289169 700861511 691056519 697310257
3900.9 697310257 699024963 692738342 697627869 694703445 693102875 693160477 694355850 696828918 695951233
3909.6 695951233 696020355 696381836 697044449 697646637 697704010 699593201 701407089 697445450 695077896
3918.2 695077896 700040817 699223709 695127411 698322144 700772476 701259155 698163071 695337524 697692032
3926.9 697692032 699643860 700559921 699511566 699566345 701715469 699022141 697582397 699137802 699586639
3935.6 699586639 700210876 699783630 699046707 699461365 699548950 701702499 703002396 698517532 698766556
3944.3 698766556 700975952 701942825 703240738 700857620 701765289 702202072 698841324 700782852 702126007
3953 702126007 701249008 701036072 701747360 702842560 702617340 702531967 701871872 703071136 704039993 702153397
3962.6 702153397 702364960 702715378 702843781 703396759 702870255 702622223 702292938 702001572 703011627
3971.3 703011627 703542557 703177948 703505630 703455505 702985916 703026886 703456955 703625412 703648071 704496841
3980.9 704496841 704745407 704243317 704258270 704246597 704080124 704265366 704301453 704361267 705046158 705212860
3990.6 705212860 705060120 704706802 704577179 705305023 705095215 704746552 705236206 705527725 705510559 705445099
4000.2 705445099
##END=$$ End of the data block
