##TITLE=$$ Begin of the data block
##JCAMP-DX=5.00 $$ ACD/SpecManager v 10.08
##SPECTROMETER/DATA SYSTEM=Varian
##DATE=20 Nov 2012 09:38:44
##DATA TYPE=INFRARED SPECTRUM
##DATA CLASS=XYDATA
##ORIGIN=
##OWNER=
##NPOINTS=3735
##FIRSTX=399.26403809
##LASTX=4000.35498047
##MAXX=4000.35498047
##MINX=399.26403809
##MAXY=80.29447174
##MINY=24.91085052
##XFACTOR=1.0000000000
##YFACTOR=0.000000100000000
##FIRSTY=51.55806351
##DELTAX=0.96440572
##XUNITS=1/CM
##YUNITS=TRANSMITTANCE
##XYDATA=(X++(Y..Y))
399.3E15580635J9745255J1827392q577576j884231P62482m142571n010757l367043
$$ 515580635 535325890 547153282 538575706 536691475 537453957 533311386 528300629 524933586
407E24933586l733444l921204K707253l27378J663743Q188743K640724m186744j725121
$$ 524933586 521200142 517278938 519986191 519658813 521322556 529511299 532152023 527965279 526240158
415.7E26240158L356743m417496k0171623J2282295K0322647m473343n973129N927315
$$ 526240158 529596901 525179405 505007782 517290077 537612724 533139381 527166252 533093567
423.4E33093567J859360l486252l376084l957862m248505l00713K347031j34354j383400
$$ 533093567 534952927 531466675 528090591 524132729 519884224 519583511 521930542 521796188 520412788
432.1E20412788o943588m819488P75947J71890Q52890N00489L347892J620789L771477
$$ 520412788 513469200 508649712 509425659 509597549 510450439 510950928 514298820 515919609 519691086
440.7E19691086L837318o292267k534141L826446P841797K512207l990745L272781
$$ 519691086 523528404 517236137 514701996 518528442 526370239 528882446 524891701 528164482
448.4E28164482K375870j072769J261978N374756L957214j189041j008949k555771
$$ 528164482 530540352 529467583 530729561 536104317 540061531 538872490 537863541 535307770
456.2E35307770k528153k943229k512055k90298J124611M241104K022972n239868m267006
$$ 535307770 532779617 529836388 527324333 527034035 528158646 532399750 534422722 529182854 524915848
464.8E24915848P01790j913338l293991K630272J377105o723632m248352N936966J03378
$$ 524915848 525617638 523704300 520410309 523040581 524417686 517694054 513445702 519382668 519486046
473.5E19486046m758873l228989k270279j319160l042450l956833K011414O408386
$$ 519486046 514727173 511498184 509227905 507908745 504866295 500909462 502920876 509329262
481.2E09329262L724479j554946l339615o17104l492165j74751J822090r82551L585434
$$ 509329262 513053741 511498795 508159180 507542076 504049911 503875160 505697250 504714699 508300133
489.9E08300133J429329n119706n189666J551285M294586K323761J485595o74171j377907
$$ 508300133 509729462 504609756 499420090 500971375 505265961 507589722 509075317 508401146 507023239
498.6E07023239l367309j464158M64592j148719k584801m968185j839486o70280J452789
$$ 507023239 503655930 502191772 502656364 501507645 498922844 493954659 492115173 491444893 492897682
507.3D92897682J457863r92813O15959k119522m113197m116402j788139j931191l609657
$$ 492897682 494355545 493362732 493978691 491859169 487745972 483629570 481841431 479910240 476300583
516D76300583l202171j451149J300277k426185j71814Q66661j292343p45430j319313
$$ 476300583 473098412 471647263 472947540 470521355 470349541 471216202 469923859 469178429 467859116
524.6D67859116n77507k773285j521073j070366m9209k28043r07478K837448K206955
$$ 467859116 467281609 464508324 462987251 461916885 461867676 461639633 460732155 463569603 465776558
533.3D65776558K301216J664429L195534K935371J171799L607826K504883J581878
$$ 465776558 468077774 469742203 472937737 475873108 477044907 480652733 483157616 484739494
541D84739494j32141p93609k37923K559776M953499M34532K45056J843453K217064
$$ 484739494 484607353 483813744 483575821 486135597 491089096 491523628 491768684 493612137 495829201
549.7D95829201J12686k167664k154579k795219j310654j886635j200943k139816k014732
$$ 495829201 495941887 493774223 491619644 488824425 487513771 485627136 484426193 482286377 480271645
558.4D80271645J931152m47159j771126j637840l808250m915467l243751l288422m407234
$$ 480271645 482202797 481755638 479984512 478346672 474538422 469622955 466379204 463090782 458683548
567.1D58683548l254433m813766l560524l608971k353325n49621k1019J320381j67885
$$ 458683548 455429115 450615349 447054825 443445854 441092529 440542908 440521889 441842270 441674385
575.8D41674385J909370N25513O99692J211395P15981K669487K117157M315452M290848
$$ 441674385 443583755 444109268 444808960 446020355 446736336 449405823 451522980 455838432 460129280
584.4D60129280L922348M184532L906288L366051K709274K166138p6790J383782J672363
$$ 460129280 464051628 468236160 472142448 475508499 478217773 480383911 480307121 481690903 483363266
593.1D83363266P17201J498184K31209j554756j143417K51388o51512J20278J048507
$$ 483363266 484080467 485578651 485809860 484255104 483111687 483363075 482711563 482831841 483880348
601.8D83880348N20325j081848j751023K91176M18778J143493N21775o18248o55098
$$ 483880348 484400673 483318825 481567802 481858978 482277756 483421249 483943024 483324776 482669678
610.5D82669678L98445K321892J527481J477852O97479R71413J181526J067199K374764
$$ 482669678 483068123 485390015 486917496 488395348 489092827 490064240 491245766 492312965 494687729
619.2D94687729K394714K980728J661301J573448J511078J320992J663093R22547K228584
$$ 494687729 497082443 500063171 501724472 503297920 504808998 506129990 507793083 508715630 510944214
627.8E10944214J461182R96780J527100J746025K176399J750412J608543M69856k57263
$$ 510944214 512405396 513402176 514929276 516675301 518851700 520602112 522210655 522680511 522423248
636.5E22423248o94961K40669M79469p5645J907043K051430Q61359Q5525N66483K58674
$$ 522423248 521728287 521968956 522448425 522372780 524279823 526331253 527192612 527278137 527844620 528103294
646.2E28103294j78756N62439P59773J465454o10542k300606q15506O18248O10351
$$ 528103294 527924538 528486977 529246750 530712204 530101662 527801056 526985550 527603798 528214149
654.8E28214149N66330K637902K702751J210327L62854J195679J072120m21562j076584
$$ 528214149 528780479 531418381 534121132 535331459 535694313 536889992 537962112 537540550 536463966
663.5E36463966j716995J90544P37915m916877r517708J0013237O218109K964668J760788
$$ 536463966 534746971 534937515 535675430 530758553 521240845 531254082 537472191 540436859 542197647
672.2E42197647J334000J302070l88374j890259o37016M58107L30582j323510o36901
$$ 542197647 543531647 544833717 544445343 542555084 541918068 542376175 542706757 541383247 540746346
680.9E40746346J701850K196274K353974K450752J024742k33765J063080M13971j765480
$$ 540746346 542448196 544644470 546998444 549449196 550473938 550240173 551303253 551717224 549951744
689.6E49951744j293869l06358n44091j098327m27895k21138Q1787J311722J275978
$$ 549951744 548657875 548351517 547807426 546709099 546281204 546060066 546141853 547453575 548729553
698.2E48729553n75447k265320k001915k026596l278923l706703k245560o79168k01607
$$ 548729553 548154106 545888786 543886871 541860275 538581352 534874649 532629089 531949921 531748314
706.9E31748314K35786l25508N3101J314163J295128J208801J926727J427193M86260
$$ 531748314 531984100 531658592 531711693 533025856 534320984 535529785 537456512 538883705 539369965
715.6E39369965P93953O69136J263237K021102L092614M410095M914474M598122K501793
$$ 539369965 540163918 540833054 542096291 544117393 547210007 551620102 556534576 561132698 563634491
724.3E63634491J977501K737961K655105J838265K346153K054787Q54034K279472K016030
$$ 563634491 565611992 568349953 571005058 572843323 575189476 577244263 578098297 580377769 582393799
733E82393799J716423K531319J884460J171036M07524J098785J937104K89878j092109
$$ 582393799 584110222 586641541 588526001 589697037 590104561 591203346 593140450 593430328 592338219
741.6E92338219k96288k72484j372947j685639r23538p01790j709099j509895j697807
$$ 592338219 592041931 591769447 590396500 588710861 587787323 587085533 585376434 583866539 582168732
750.3E82168732k735939j917038j083184k492103m099007k512245j533089k813110
$$ 582168732 579432793 577515755 576432571 573940468 569841461 567329216 565796127 562983017
758E62983017k623138k453156k285309j775589o97822n86930j298790K98615L95279
$$ 562983017 560359879 557906723 555621414 553845825 553148003 552561073 551262283 551560898 551956177
766.7E51956177M65164K584076L421135K536812K487716L763542M104424L245583K909813
$$ 551956177 552421341 555005417 558426552 560963364 563451080 567214622 571319046 574564629 577474442
775.4E77474442M617881M961548M160271M307556M167900L859139L679275L296471
$$ 577474442 582092323 587053871 591214142 595521698 599689598 603548737 607228012 610524483
783.1F10524483K442436K338982K425651K035523J300697Q65135J384430J825028J835632
$$ 610524483 612966919 615305901 617731552 619767075 621067772 621932907 623317337 625142365 626977997
791.8F26977997J830482J777611K649613M147033L550873K203598J207581J366348
$$ 626977997 628808479 630586090 633235703 637382736 640933609 643137207 644344788 645711136
799.5F45711136J920471Q51288R18579R78470J843033K786407K441864K427445J471710
$$ 645711136 647631607 648482895 649401474 650379944 652222977 655009384 657451248 659878693 661350403
808.2F61350403J675415K606659J999588k1286o54297n58395j73874R2544r88312J67008
$$ 661350403 663025818 665632477 667632065 667610779 666956482 666398087 666224213 666316757 665328445 665495453
817.8F65495453O70700K029266K686997Q01162Q60138L03345k33230k370301m010009
$$ 665495453 666166153 668195419 670882416 671683578 672543716 672847061 672613831 670243530 666233521
826.5F66233521l733902l304749k774506k067642k95257j515274k356339j347961n78766
$$ 666233521 662499619 659194870 656420364 654352722 654057465 652542191 650185852 648837891 648259125
835.2F48259125r19724l152084l955383m132729l316536l990250m626464k435952j153144
$$ 648259125 647339401 644187317 640231934 636099205 632782669 628792419 624165955 621730003 620576859
843.9F20576859o65284o23016l97263q92219q04482O33049p05413l347359m240837
$$ 620576859 619911575 619288559 618891296 617999077 617194595 617827644 617122231 613774872 609534035
852.5F09534035l138199k371369j983490j611938j871681j341515m62265R18350K000084
$$ 609534035 606395836 604024467 602040977 600429039 598557358 597215843 596753578 597671928 599672012
861.2E99672012J601181J611328K452088L308487L599968L564148L557167M640350
$$ 599672012 601273193 602884521 605336609 608645096 612245064 615809212 619366379 624006729
868.9F24006729N554161O236191O796150O269608O397018N961533M203796J454163
$$ 624006729 629560890 635797081 642593231 648862839 655259857 661221390 665425186 666879349
876.7F66879349J605224J178971j066361j588974k469101j751251j456680r88846j422806
$$ 666879349 668484573 669663544 668597183 667008209 664539108 662787857 661331177 660342331 658919525
885.3F58919525k111435j467666k574997k763520l361892l967972m437714m942589
$$ 658919525 656808090 655340424 652765427 650001907 646640015 642672043 638234329 633291740
893F33291740m105644l184814j991692j354599j040687j501885k139969k370758k258987
$$ 633291740 629186096 626001282 624009590 622654991 621614304 620112419 617972450 615601692 613342705
901.7F13342705j689339k680855l646202l938064l564492l425483l705101l591233
$$ 613342705 611653366 608972511 605326309 601388245 597823753 594398270 590693169 587101936
909.4E87101936m846229m752388m103699m616051m004516m504547n177918m934425
$$ 587101936 582255707 577503319 573399620 568783569 564779053 560274506 555096588 550162163
917.2E50162163m535408m126244m541206l292237k273139j737900j278763j554031
$$ 550162163 545626755 541500511 536959305 533667068 531393929 529656029 528377266 526823235
924.9E26823235j315728r92469N15022P23533N57747K48452K1934J122131J502839
$$ 526823235 525507507 524515038 525030060 525753593 526311340 526559792 526581726 527703857 529206696
933.6E29206696K729721K581062J232796J202545K492180K663078J790009L045196
$$ 529206696 531936417 534517479 535750275 536952820 539445000 542108078 543898087 546943283
941.3E46943283M054298L952866K431183J361198O70815j552925k565804k980880l779946
$$ 546943283 550997581 554950447 557381630 558742828 559413643 557860718 555294914 552314034 548534088
949.9E48534088n095482o317558o554756p034569p019348o712494o341476p301636
$$ 548534088 543438606 537121048 530566292 523531723 516512375 509799881 503458405 496156769
957.7D96156769p866364q378906q990593q221779r313240q894501q817405r360047
$$ 496156769 488290405 479911499 470920906 462699127 453385887 444491386 435673981 426313934
965.4D26313934r914474j0015450q648033r615135q586426q920708r917984j0545768
$$ 426313934 416399460 406384010 397735977 388120842 379534416 370613708 360695724 350149956
973.1C50149956j0296059r281044j0224075q620281r085637p817306p338143p008018
$$ 350149956 339853897 330572853 320348778 311728497 302642860 294825554 287487411 280479393
980.8B80479393n521088n615825l587303m891606l079128k351837j959687r84821j599483
$$ 280479393 274958305 269342480 265755177 260863571 257784443 255432606 253472919 252488098 250888615
989.5B50888615p5741j230889K75288n15594k33174P30019O60019K073555Q39596J834392
$$ 250888615 250812874 249581985 249857273 249341679 249108505 249838524 250498543 252572098 253411694 255246086
999.1B55246086M58698R44786N74608M96292J521817o14186M48723l12214Q24967j06449
$$ 255246086 255704784 256649570 257224178 257720470 259242287 258628101 259076824 258764610 259589577 259483128
1008.8B59483128m30756K53334q58498J172524N88627J362781q33034m56925L48664
$$ 259483128 259052372 259305706 258447208 259619732 260208359 261571140 260738106 260281181 260629845
1017.5B60629845m47083J761913L16201J561813P33414J962719K304020J454048K827720
$$ 260629845 260182762 261944675 262260876 263822689 264556103 266518822 268822842 270276890 273104610
1026.1B73104610R67904K373447J139469J309452J797791J999263J896592Q10966K041702
$$ 273104610 274072514 276445961 277585430 278894882 280692673 282691936 284588528 285399494 287441196
1034.8B87441196k28538J294231J094094J685295J982403J41506O85596j532421O90594
$$ 287441196 287212658 288506889 289600983 291286278 293268681 293410187 294095783 292563362 293253956
1043.5B93253956K64244P22370P38487N00393K682667J95637J651363J027298J924152
$$ 293253956 293518200 294240570 294979057 295479450 298162117 298357754 300009117 301036415 302960567
1052.2C02960567K616196L012657L827935J794319L399391K697239M357796M051628
$$ 302960567 305576763 308589420 312417355 314211674 317611065 320308304 324666100 328717728
1059.9C28717728M242744N270653N077705O791344N180969N955467M378128M464646
$$ 328717728 332960472 338231125 343308830 350100174 355281143 361236610 365614738 370079384
1067.6C70079384K898407n87578k053337n893211n433464p222672p179565o474915
$$ 370079384 372977791 372390213 370336876 364443665 359010201 351787529 344607964 338133049
1075.3C38133049m865761k181778l548126j128273j849785L51906M00429m01573R57679
$$ 338133049 333267288 331085510 327537384 326409111 324559326 324911232 325311661 324910088 325867767
1084C25867767J59111K161141J178894K551269J789208K891235L636894K480088L684272
$$ 325867767 326026878 328188019 329366913 331918182 333707390 336598625 340235519 342715607 346399879
1092.7C46399879J949425L631745J585998K173576L123551J825256K367401L09677
$$ 346399879 348349304 351981049 353567047 355740623 358864174 360689430 363056831 363366508
1100.4C63366508J408997K19116N09186J71852J10245N24712m37470J969605Q85391
$$ 363366508 364775505 364994621 365503807 365675659 365785904 366310616 365873146 367842751 368728142
1109.1C68728142K560959K340393K143440K398910J305962K755699P54242J899796
$$ 368728142 371289101 373629494 375772934 378171844 379477806 382233505 382987747 384887543
1116.8C84887543J142502M14428P10869P62444J836929M39644K365722J095925O69746
$$ 384887543 386030045 386444473 387155342 387917786 389754715 390194359 392560081 393656006 394325752
1125.5C94325752J102104J465722K503738R23271K171326J725921K482300J925698
$$ 394325752 395427856 396893578 399397316 400320587 402491913 404217834 406700134 408625832
1133.2D08625832J164474J402474l1205N49279k87400r96208l689079l618393l282547
$$ 408625832 409790306 411192780 411161575 411710854 411423454 410427246 406738167 403119774 399837227
1141.9C99837227n021744m382362n537949m393158m664154l335571k689324l140602
$$ 399837227 394815483 390433121 384895172 380502014 375837860 372502289 369812965 366672363
1149.6C66672363k086029k969208j371269k461281j312599j812629j886178k82135
$$ 366672363 364586334 361617126 360245857 357784576 356471977 354659348 352773170 352491035
1157.3C52491035j471366K79159o95953R25331J176147J948471K520295J633644L996200
$$ 352491035 351019669 351298828 350602875 351528206 352704353 354652824 357173119 358806763 362802963
1166C62802963K786103L717575K997131M724693N303765L541259N684395N502777P195778
$$ 362802963 365589066 369306641 372303772 377028465 382332230 385873489 391557884 397060661 404256439
1174.6D04256439O350517O629677P434044P088928P555046O662293O882439N551071
$$ 404256439 410606956 417236633 424670677 431759605 439314651 445976944 452859383 458410454
1182.4D58410454N926056N401649M897461N145493N029411O220436M905129M707832
$$ 458410454 464336510 469738159 474635620 479781113 484810524 491030960 495936089 500643921
1190.1E00643921M527168M314919L498153K212639K279968J012841O30111r9487Q3351
$$ 500643921 505171089 509486008 512984161 515196800 517476768 518489609 519119720 519020233 519103584
1198.8E19103584Q35076R91897J455384O60400J572800J945839J528434J733399J752014
$$ 519103584 519938660 520930557 522385941 523046341 524619141 526564980 528093414 529826813 531578827
1207.4E31578827J207275P24564J338806J250839K027169K360076K363968L397179
$$ 531578827 532786102 533510666 534849472 536100311 538127480 540487556 542851524 546248703
1215.1E46248703L414574L030548K878113K613830J971359J612168J329574Q97103
$$ 546248703 549663277 552693825 555571938 558185768 560157127 561769295 563098869 563995972
1222.9E63995972K8648p25250k93465J9531j40647l06244m4976P782l36799q5488m21943
$$ 563995972 564024620 563299370 563005905 563025436 562884789 562578545 562533569 562541351 562204552 562119064 561697121
1233.5E61697121q94814j090813j065788p85293q66929p84454q13522n27153o8321
$$ 561697121 560802307 559711494 558645706 557860413 556993484 556209030 555395508 554868355 554800034
1242.2E54800034L40652M62570O73523J075936R15298R44672P36351N87425O27060
$$ 554800034 555140686 555603256 556276779 557352715 558268013 559212685 559949036 560536461 561163521
1250.8E61163521J097717J332474M73976O65894J620025J558991Q80050P27196O18324
$$ 561163521 562261238 563593712 564067688 564733582 566353607 567912598 568792648 569519844 570138168
1259.5E70138168P78275J351662R68322Q02117J065559N67894K40707M03328O80085
$$ 570138168 570916443 572268105 573236427 574038544 575104103 575671997 575912704 576316032 576996117
1268.2E76996117Q14323R47037J458549J021233P99370J206398J111793J084061N6915
$$ 576996117 577810440 578757477 580216026 581237259 582036629 583243027 584354820 585438881 585495796
1276.9E85495796l52554j08605o9885k40478j168938j333885q82187k24495k81220
$$ 585495796 585143242 585034637 584964752 584724274 583555336 582221451 581339264 581114769 580833549
1285.5E80833549r4375K02942k03858J99013q5640m67262q82111j617889j599655j367798
$$ 580833549 580739174 580942116 580738258 580937271 580851631 580384369 579502258 577884369 576284714 574916916
1295.2E74916916j380348j660652j418534q29925r7924J336k57683j83335o50444j33705
$$ 574916916 573536568 571875916 570457382 569627457 569529533 569530869 569273186 569089851 568439407 568305702
1304.8E68305702J34583j011124j784973j847992j366272j046829o21262r9029K79693
$$ 568305702 568440285 567429161 565644188 563796196 562429924 561383095 560761833 560662804 560942497
1313.5E60942497M81339L60183L35732m7264m51355j377678j809235j794510k452964
$$ 560942497 561423836 561784019 562119751 562072487 561621132 560243454 558434219 556639709 554186745
1322.2E54186745k111969j926194k133026j620826j069336j016617j707993j901893
$$ 554186745 552074776 550148582 548015556 546394730 545325394 544308777 542600784 540698891
1329.9E40698891k106362k206802k553864l516006k871895k314796k254944j965523
$$ 540698891 538592529 536385727 533831863 530315857 527443962 525129166 522874222 520908699
1337.6E20908699j034584n0697M47311P80678L47404N65148j06697n3215j26648p37992
$$ 520908699 519874115 519823418 520270729 521051407 521398811 521963959 521857262 521804047 521677399 520939407
1347.3E20939407q13942q80966k47192n50308J17759j0109L6011O26068R3994N19638
$$ 520939407 520125465 519244499 518997307 518446999 518564758 518554649 518590660 519216728 519310722 519830360
1356.9E19830360m73213n75523j124306j535911m64669j059456j422538j040612L43743
$$ 519830360 519357147 518781624 517657318 516121407 515656738 514597282 513174744 512134132 512477875
1365.6E12477875L93677P08961P77626J39084J077309J65290O02723K69432n1308l86238
$$ 512477875 512871552 513580513 514358139 514497223 515574532 515739822 516342545 516611977 516560669 516174431
1375.2E16174431m73786R17206J79100J150666J089172J102295J336212R66034J399574
$$ 516174431 515700645 516617851 516796951 517947617 519036789 520139084 521475296 522441330 523840904
1383.9E23840904J399117K194443J720771J866341J531105J790810J869773J195984
$$ 523840904 525240021 527434464 529155235 531021576 532552681 534343491 536213264 537409248
1391.6E37409248J224213J143494J837387O828Q36525J001472O23398j85356j517296
$$ 537409248 538633461 539776955 541614342 541621170 542457695 543459167 544082565 543897209 542379913
1400.3E42379913j05972q72688n93415p75718j579361m87442m88930m88396p30476
$$ 542379913 542273941 541401253 540807838 540032120 538452759 537965317 537476387 536987991 536257515
1409E36257515O3705l44467k74353p59620j463128q22754j159820m61693l94249p095
$$ 536257515 536321220 535976753 535702400 534942780 533479652 532656898 531497078 531035385 530641136 530634041
1418.6E30634041k155953M2572J302033J32675J287155n54580K77252Q14171l2845
$$ 530634041 528478088 528520660 529822693 529955368 531242523 530687943 530965195 531779366 531746521
1427.3E31746521M54063q7852N46913m06609Q93479L20434q6593J487198J122017P10907
$$ 531746521 532200584 532112732 532659645 532253036 533146515 533466949 533380356 534867554 535989571 536700478
1437E36700478m67644K138939J024093O05164Q67996L72276J224289m01763K65922
$$ 536700478 536232834 538371773 539395866 540001030 540869026 541241302 542465591 542063828 542329750
1445.6E42329750N837M36134r22547j092987O65169q84094J58310n18265O19583K88697
$$ 542329750 542335587 542771721 541849174 540756187 541421356 540537262 540695572 540177307 540796890 541085587
1455.3E41085587j222611j304283m186745R39408k469178O18821l03040L2005J834679
$$ 541085587 539862976 538558693 534371948 535311356 532842178 533460999 533157959 533189964 535024643
1464E35024643J3237L333321J601600L566399K253952K972755L454819J492538O360970
$$ 535024643 535037880 538371201 539972801 543539200 545793152 548765907 552220726 553713264 560074234
1472.6E60074234K022133M964065K806244L789025L618622L550910N262146L717728
$$ 560074234 562096367 567060432 569866676 573655701 577274323 580825233 586087379 589805107
1480.3E89805107N389633K651482L641624K940255K135391L096161Q56971L158951
$$ 589805107 595194740 597846222 601487846 604428101 606563492 609659653 610516624 613675575
1488.1F13675575J400490L350830J647873L185883L885688K654000M208946J401443
$$ 613675575 615076065 618426895 620074768 623260651 627146339 629800339 634009285 635410728
1495.8F35410728K189255K045441J842461L04489M03976J751633N27954K511063J966476
$$ 635410728 637599983 639645424 641487885 641792374 642196350 643947983 644475937 646987000 648953476
1504.5F48953476K951050M82635M90494N362396P49588L448792P13959Q92868j172181
$$ 648953476 651904526 652387161 652877655 658240051 658989639 662438431 663152390 664045258 662873077
1513.1F62873077J051789J575622l43628K089692j521912M572601L243485Q78067J225433
$$ 662873077 663924866 665500488 665156860 667246552 665724640 670297241 673540726 674418793 675644226
1521.8F75644226o18210L645706P25480l50953j119842R95865K43911Q5984J944809
$$ 675644226 675026016 678671722 679397202 679046249 677926407 678922272 679166183 679252167 681196976
1530.5F81196976N01327K810593Q19473j03073K160950J682510K498169K081909K626038
$$ 681196976 681698303 684508896 685328369 685225296 687386246 689068756 691566925 693648834 696274872
1539.2F96274872j0316239L550415l31420p99485L711930L84445P87277J423569K135086
$$ 696274872 685958633 689509048 689177628 688378143 692090073 692474518 693261795 694685364 696820450
1547.9F96820450J212845P25784L9597J86615R68246L2196j128006r09042L349762
$$ 696820450 698033295 698759079 698798676 698985291 699953537 699985733 698857727 697948685 701298447
1556.5G01298447L153381p614670n04532J210251M942703J866837J553421M76913j311264
$$ 701298447 704451828 696837158 696332626 697542877 702485580 704352417 705905838 706382751 705071487
1565.2G05071487k08053R1247J576310M66308l294525K80991J724395J014176Q95233
$$ 705071487 704863434 704954681 706530991 706997299 703702774 703983765 705708160 706722336 707617569
1573.9G07617569K337265N37567l506698L26461J195755j96762n77850J35803l51639
$$ 707617569 709954834 710492401 706985703 707312164 708507919 708311157 707733307 707869110 707517471
1582.6G07517471l32565l52554l47367n21774j12534J4267l128j96380n25208l12576
$$ 707517471 707184906 706832352 706484985 705963211 705850677 705864944 705861816 705665436 705140228 704827652
1592.2G04827652o76880o61468j492539j133575j214676j755753j410141j308975j028976
$$ 704827652 704150772 703489304 701996765 700863190 699648514 697892761 696482620 695173645 694144669
1600.9F94144669j132203n31005j167832j441269r75189j592636k258453k147217k394791
$$ 694144669 693012466 692481461 691313629 689872360 688897171 687304535 685046082 682898865 680504074
1609.6F80504074l105469k022094k285843k368317k228622m69742n55649q167801m28772
$$ 680504074 677398605 675376511 673090668 670722351 668493729 668023987 667468338 659300537 658871765
1618.2F58871765m35867j564255k344818j610336k811966o745835j405029j363831
$$ 658871765 658435898 656871643 654526825 652916489 650104523 643358688 641953659 640589828
1626F40589828r85832k896423k299309o34727j252289r81331j163139M3068o9886m966354
$$ 640589828 639603996 636707573 634408264 633773537 632521248 631539917 630376778 630419846 630349960 625383606
1635.6F25383606l391914n29900j524658l29437J54113j533889K2316m6235J224327
$$ 625383606 621991692 621461792 619937134 619607697 619761810 618227921 618250237 618204002 619428329
1644.3F19428329J480332q49495Q78220q00477O38848O96831K169494L453636M842568
$$ 619428329 620908661 620059166 620937386 620136909 620775757 621472588 623642082 627095718 631938286
1653F31938286r896279m7836L462563K042350K257119K057609K044258J612931J504898
$$ 631938286 622042007 621994171 625456734 627499084 629756203 631813812 633858070 635471001 636975899
1661.6F36975899Q56094o35834J649437J182251J623230K206879K721481J783448J357574
$$ 636975899 637831993 637196159 638845596 640027847 641651077 643857956 646579437 648362885 649720459
1670.3F49720459L778915K359543K580872K693100J287002j64871K079544K054444
$$ 649720459 653499374 655858917 658439789 661132889 662419891 662255020 664334564 666389008
1678F66389008J546402J922760Q17108L215790M579391J939697l387604M407120M487686
$$ 666389008 667935410 669858170 670675278 673891068 678470459 680410156 677022552 681429672 685917358
1686.7F85917358K747116J363755J211776O53000R85413J277313J517487K865906L178863
$$ 685917358 688664474 690028229 691240005 691893005 692878418 694155731 695673218 698539124 701717987
1695.4G01717987j105576K128144L555984L991089j426239j453857M438934K170029
$$ 701717987 700612411 702740555 706296539 710287628 708861389 707407532 711846466 714016495
1703.1G14016495J094055N188P64999j37024J292725K488327J748199J575470J629029
$$ 714016495 715110550 715115738 715880737 715743713 717036438 719524765 721272964 722848434 724477463
1711.8G24477463J906051K028351P00302j43051K085800Q5144n128555K385864K661286
$$ 724477463 726383514 728411865 729112167 728969116 731054916 731140060 726011505 728397369 731058655
1720.5G31058655J868133J227417J074906P10754J584931J609497M86221R27658J104050
$$ 731058655 732926788 734154205 735229111 735939865 737524796 739134293 739620514 740548172 741652222
1729.1G41652222j64032o20880K124710K676315k288742m188385K882614L217697J642609
$$ 741652222 741488190 740867310 742992020 745668335 743379593 739191208 742073822 745291519 746934128
1737.8G46934128K245636R01489j711807J415939N24674o95725m62570J540222J273880
$$ 746934128 749179764 750081253 748369446 749785385 750310059 749614334 749151764 750691986 751965866
1746.5G51965866O67038P76672o38198J979522m84314p64236J914368R18808P34634
$$ 751965866 752632904 753409576 752771378 754750900 754266586 753502350 755416718 756335526 757070160
1755.2G57070160N00030n44815N5695Q52890Q74634J971359m55475j525497J325073
$$ 757070160 757570190 757025375 757081070 757933960 758808594 760779953 760324478 758798981 760124054
1763.9G60124054L80325L16162O46439Q51440p34787O53687K244110O78864j143799
$$ 760124054 760504379 760820541 761466980 762318420 761583633 762237320 764481430 765160294 764016495
1772.5G64016495j872254K131119J076279j143494O44303R7503P64847M29993l67813
$$ 764016495 762144241 764275360 765351639 764208145 764852448 764949951 765714798 766144791 765776978
1781.2G65776978O96640J467208J018448q61053K15607R90600M08096j86767L50876
$$ 765776978 766473618 767940826 768959274 768098221 768313828 769304428 769712524 769525757 769876633
1789.9G69876633R9182o9504p11060q28704J725540Q81958O01654J230697J022950
$$ 769876633 769975815 769906311 769195251 768366547 770092087 770974045 771575699 772806396 773829346
1798.6G73829346K87475r91821O95953n91430p12509Q010l74603N51453O28814M90876
$$ 773829346 774116821 773125000 773820953 773229523 772517014 772525024 772150421 772701874 773330688 773821564
1808.2G73821564Q11920J340332M03519Q23745L72773p24640r2011l58505K09808p07168
$$ 773821564 774633484 775973816 776377335 777201080 777573853 776849213 776757202 776398697 776608505 775901337
1817.9G75901337m84391L95203M14963J266174R30100J701431P43408j782989K84881
$$ 775901337 775416946 775812149 776227112 777493286 778423386 780124817 780868225 779085236 779370117
1826.5G79370117J317902Q27255r74121l483582n53970J206665L87802L31574R79004
$$ 779370117 780688019 781515274 780541153 777057571 776503601 777710266 778098068 778429642 779408646
1835.2G79408646J387939J173325J30157R47113K05841n45807j091385q468K94800
$$ 779408646 780796585 781969910 782100067 783047180 783253021 782707214 781615829 781607361 781902161
1843.9G81902161m244690O38351J353912M38614N22919J146164J438522K00653J58616
$$ 781902161 777657471 778295822 779649734 780088348 780611267 781757431 783195953 783396606 783555222
1852.6G83555222m25415k64664n74722p42417k61154q55789P5989O9046M99191Q65478
$$ 783555222 783129807 782865143 782290421 781548004 781286850 780431061 780507050 780576096 781075287 781940765
1862.2G81940765J067505J137848L71475M59671o33621l61709j151276j973419l28446
$$ 781940765 783008270 784146118 784517593 784977264 784343643 783981934 782830658 780857239 780528793
1870.9G80528793r5443N69686O23246Q53576R91135J140823N90439J19477K93426l93753
$$ 780528793 780433350 781003036 781626282 782479858 783470993 784611816 785202255 785321732 785615158 785221405
1880.6G85221405m69971q84094p28378n56030k29416L36914O14929J581573Q42667
$$ 785221405 784751434 783867340 783138962 782582932 782353516 782690430 783305359 784886932 785729599
1889.2G85729599l25241M49600R54056J04752m78669o48727j016159r8190k71683j61896
$$ 785729599 785404358 785853958 786808014 786912766 786434097 785785370 784769211 784671021 784399338 784237442
1898.9G84237442J78146N22309R64889P45545Q48694j03684m58755j53733j67770l22800
$$ 784237442 784415588 784937897 785902786 786648331 787497025 787393341 786934586 786780853 786613083 786290283
1908.5G86290283o4926k24533r29184R5291K83280O32553K03094K69241J519852q95462
$$ 786290283 786225357 786000824 785071640 785166931 785450211 786082764 786285858 786555099 788074951 787179489
1918.2G87179489r20181N24673M42734K88925r23385q66852J80435O93817K60239L43017
$$ 787179489 786259308 786783981 787226715 787515640 786592255 785725403 785905838 786599655 786859894 787202911
1927.8G87202911o9961n3177M65088j73340k36053k84348M82254K76718l76434m88663
$$ 787202911 787132950 787079773 787544861 787371521 787135468 786851120 787333374 787610092 787233658 786744995
1937.5G86744995m85077L33786J95770Q10700J99203j143875J87531L68194K9679j39389
$$ 786744995 786259918 786593704 786789474 787600174 787799377 786655502 786843033 787211227 787240906 787101517
1947.1G87101517M51507M34342o409j54037o1875J41678k7008j02387k49404K18887
$$ 787101517 787553024 787987366 787980957 787826920 787765045 787906723 787879715 787777328 787527924 787746811
1956.7G87746811k6474l04108M3488K46887O06842O07452M85764l43094k7084L16925
$$ 787746811 787720337 787416229 787459717 787706604 788313446 788920898 789406662 789063568 789036484 789353409
1966.4G89353409l28369m19007m10690n798k90451J58920M69208L17688N37567m0589
$$ 789353409 789025040 788606033 788195343 788189545 787899094 788058014 788527222 788844910 789382477 789341888
1976G89341888Q0719J36109J66626m7226j34964m13056r28497m14276j98669M66842
$$ 789341888 789422607 789558716 789725342 789678116 789543152 789130096 788201599 787787323 787588654 788055496
1985.7G88055496M60663M59518M84086K74734J222611M82177r61914r87091m35181
$$ 788055496 788516159 788975677 789459763 789734497 790957108 791439285 790477371 789490280 789055099
1994.3G89055099l87268o41555o58493l85209O25687Q22449Q48312L72620K1515N07660
$$ 789055099 788667831 788026276 787367783 786982574 787608261 788430710 789279022 789651642 789673157 790180817
2004G90180817L74221j08718q83255p31049j026535j127014j86920J98822K17285j23596
$$ 790180817 790555038 790446320 789563065 788832016 787805481 786678467 786491547 786690369 786907654 786784058
2013.6G86784058M32891R70459R28956J19247m66232k37122n49240q02536j371994
$$ 786784058 787216949 788187408 789116364 789235611 788769379 788532257 787983017 787180481 785808487
2022.3G85808487r30862j89362j21002j01853L6850P55997P51724M56925R3383j92794
$$ 785808487 784877625 784688263 784567261 784465408 784502258 785258255 786009979 786466904 786560287 786367493
2032G86367493o62155q36487p46155j277313q94165n60379l1510K94647M35563P73162
$$ 786367493 785705338 784868851 784122696 782845383 781951218 781390839 781359329 781653976 782089539 782862701
2041.6G82862701N09797O34231j40838k97928j85852m95072n99670j050263o19659
$$ 782862701 783372498 784006729 783865891 783567963 783382111 782887039 782287369 781237106 780617447
2050.3G80617447n05066k7466L26538L58811P04422O22558P28836K75193K3117k14615
$$ 780617447 780112381 780084915 780411453 780770264 781474686 782097244 782826080 783101273 783124390 782909775
2059.9G82909775n83039q66394n62973o7443o98853k08817O02112O58188K27432K47116
$$ 782909775 782326736 781460342 780897369 780829926 780131073 779922256 780524368 781182556 781409988 781657104
2069.6G81657104P28150M92248L17154q8577j63803q29849j035156m51355k11564K60468
$$ 781657104 782385254 782877502 783194656 783106079 782942276 782112427 781077271 780625916 780414352 780674820
2079.2G80674820M5700M43878M45633J86234M36020M39987N34591J10398m2801n04913
$$ 780674820 780720520 781164398 781610031 781796265 782232285 782672272 783206863 783317261 783274460 782769547
2088.9G82769547p50275q18558k68173L85208K0447K99530O6910M48379P07245L87726
$$ 782769547 782019272 781200714 780932541 781317749 781338196 781637726 781704636 782153015 782860260 783247986
2098.5G83247986N56335K08206N4093n87464m15496l22342m70047k73590l22266K90146
$$ 783247986 783804321 784012527 784066620 783479156 783063660 782741318 782271271 781997681 781675415 781965561
2108.1G81965561K72446O38809N12695K46201O26754K93580J41830k43225l04718m34189
$$ 781965561 782238007 782876816 783389511 783635712 784262466 784556046 784697876 784454651 784149933 783715744
2117.8G83715744o17828o40412k37655O8359r0485N79834N91889O52084N21393L36151
$$ 783715744 783097916 782457504 782219849 782288208 782197723 782777557 783369446 784021530 784542923 784879074
2127.4G84879074M26254j69372m32205q79441n84106m64096n71366l05252J6632O50940
$$ 784879074 785305328 785135956 784703751 783824310 783240204 782776108 782204742 781899490 781916122 782567062
2137.1G82567062P80716J019364L60107K04697M20074Q6899n875p90557q37479p04880
$$ 782567062 783347778 784367142 784727249 784931946 785352020 785438919 785433044 784642487 783805008 783100128
2146.7G83100128o44302o54144k8153O48422L75824Q58383P65763Q89206R34448L85513
$$ 783100128 782455826 781801682 781773529 782421951 782797775 783656158 784421921 785311127 786245575 786631088
2156.4G86631088k50015p83234o59790j101684p69043m62647J50452O77948O87866
$$ 786631088 786381073 785597839 784938049 783836365 783067322 782604675 782755127 783433075 784120941
2165G84120941J251755P74155R54055Q02765L8834l38211l38593m99725j299744k33917
$$ 784120941 785372696 786146851 787100906 787903671 787942505 787604294 787265701 786765976 785466232 785232315
2174.7G85232315J91879J85624N80291O45066J271896J167068R13392K84805L58963
$$ 785232315 785424194 785609818 786190109 786835175 788107071 789274139 790187531 790472336 790831299
2183.4G90831299K79617o65817j053772j302872o34460P1945O32324O07605P99256
$$ 790831299 791110916 790445099 789391327 788088455 787453995 787525940 788158264 788765869 789565125
2192G89565125J378784J089019R13315K82746j1216j82342m18167m51050q66623r31396
$$ 789565125 790943909 792032928 792946243 793228989 793217773 793035431 792617264 792166214 791299591 790368195
2201.7G90368195n06745K59552P47528J120072J256103J374970Q47549Q164J24816
$$ 790368195 789861450 790121002 790868530 791988602 793244705 794619675 795467224 795475388 795600204
2210.4G95600204r9945l93600q58231n66558k09885m72641L9368L68118Q12073J086731
$$ 795600204 795500259 795106659 794248428 793681870 793471985 792999344 793038712 793406830 794218903 795305634
2220G95305634J156768P55692L04489J95694m9133m3564q24433p67135m38538k19497
$$ 795305634 796462402 797218094 797522583 797718277 797669144 797625580 796801147 796034012 795595474 795375977
2229.7G95375977L10516J30844N51910J016312J120987M55093J07575J74560j11541
$$ 795375977 795686493 795817337 796369247 797385559 798506546 798961639 799069214 799243774 799132233
2238.3G99132233j15052o47049p55462o81839j86386J21002L77579Q99658M83780O70242
$$ 799132233 799017181 798370132 797614670 796932831 796746445 796867447 797245026 798144684 798628464 799298706
2248G99298706N23529L37753J88981l34702n08347l22342J28785m80118m40674k71606
$$ 799298706 799822235 800159988 800348969 800014267 799505920 799183578 799312363 798832245 798391571 798119965
2257.6G98119965P5225P26242N49775N31692L5706K82974L03192J01700K46201k31553
$$ 798119965 798195190 798921432 799471207 800002899 800038605 800321579 800624771 800726471 800972672 800741119
2267.3H00741119l78799n43594j69297K8382j19782k75726K70462P91778M89655Q57468
$$ 800741119 800362320 799818726 799649429 799677811 799558029 799282303 799552765 800344543 800834198 801691666
2276.9H01691666N58548M19845K74658j87530k79236l76587k35214m77600j95618l46756
$$ 801691666 802250214 802670059 802944717 802757187 802477951 802101364 801866150 801388550 801192932 800846176
2286.5H00846176N3558L90397K02331O10886O6299K26212M3792K1286R0867m91333
$$ 800846176 800899734 801290131 801492462 802103348 802169647 802395859 802439651 802460937 802551804 802060471
2296.2H02060471m49830o73141l71780p83463m25644j4343J16730O50253N36652N21392
$$ 802060471 801610641 800937500 800565720 799782257 799356613 799342270 799459000 800109253 800645905 801167297
2305.8H01167297p83996O7291j41296j458741n35888p44248j42212p71408j78299J98594
$$ 801167297 800383301 800450592 800309296 798850555 798314667 797570419 797428207 796656799 796478500 796677094
2315.5G96677094l13569L91922o39190L34701J08414q72574j031723p03659K6321j335144
$$ 796677094 796363525 796755447 796116257 796450958 796559372 795686798 794655075 793951416 793977737 792642593
2325.1G92642593j153030j311111p31507n40924l73764L87878J041260K459030Q51441
$$ 792642593 791489563 790178452 789446945 788906021 788532257 788920135 789961395 792420425 793271866
2333.8G93271866J31836j349869j481400m97894j593170r61456j72348J248550l45077
$$ 793271866 793403702 792053833 790572433 790074539 788481369 787519913 787347565 788596115 788251038
2342.5G88251038m95911Q89969J102295J783905J535644K800980R96780j915970j890029
$$ 788251038 787755127 788645096 789747391 791531296 793066940 795867920 796864700 794948730 793058701
2351.2G93058701j710816l052292k852783j255493n36804k07901m60968O5002K87171
$$ 793058701 791347885 788295593 785442810 784187317 783650513 783442612 782981644 783046646 783333817
2359.8G83333817J123275J199646j152572m57764m349j54419n92499K2202r613P17926
$$ 783333817 784457092 785656738 784504166 784046402 784042053 783887634 783295135 783317337 783307724 784025650
2369.5G84025650L226776K263107J893387J691056J946411J042862k12326J058120
$$ 784025650 787252426 789515533 791408920 793099976 795046387 796089249 795876923 796935043
2377.2G96935043O57120l2883m53872j21918L55072M42734R66797R26132J284866Q96912
$$ 796935043 797592163 797559280 797105408 796983490 797338562 797781296 798748093 799674225 800959091 801856003
2386.8H01856003M97818L80249k34757m86755n75714o08368r73511o80771o01730j67313
$$ 801856003 802353821 802734070 802499313 802012558 801436844 800828476 799854965 799174194 798572464 798405151
2396.5G98405151M72641L19443N56488K67334P10755Q84475K46048k52685p90940q35342
$$ 798405151 798877792 799197235 799753723 800021057 800731812 801616287 801862335 801609650 800818710 799983368
2406.1G99983368j008835n26733m60282l51104J77993K09198N54200N60302L71476
$$ 799983368 798974533 798447800 797987518 797636414 797814407 798023605 798577805 799138107 799509583
2414.8G99509583k7314P1335o2332p16705p45697p34558p87278q56704l22571m2420
$$ 799509583 799482269 799553604 799491272 798774567 798028870 797294312 796507034 795650330 795327759 795285339
2424.5G95285339L13645P30591M31060J63422j47095J3809k46353n29861q30078j065674
$$ 795285339 795598984 796329575 796760635 796924057 796776962 796790771 796544418 796014557 795184479 794118805
2434.1G94118805n24674n09490m88968k36664J84631J91574L38516L43857n4168L41796
$$ 794118805 793594131 793084641 792595673 792359009 792543640 792735214 793073730 793417587 793363419 793705215
2443.7G93705215o7901m22592q03681q59985k97928p18307o28357j91880j23291l86810
$$ 793705215 793637314 793214722 792411041 791551056 791253128 790534821 789906464 789714584 789591293 789204483
2453.4G89204483J47324P66830N08957L02811l13416l59192m94842p13578n68542o42624
$$ 789204483 789351807 790118637 790627594 790930405 790616989 790257797 789762955 789049377 788480835 787838211
2463G87838211n08804k93274o9809k98996j2055M31672N66253M48761j27105j09025
$$ 787838211 787329407 787036133 786966324 786667328 786655273 787086945 787653198 788101959 787974854 787865829
2472.7G87865829k28118n14908o92597o42242o68869p35016l48892o4774M9744K20413
$$ 787865829 787637711 787122803 786430206 785787964 785119095 784384079 784035187 783970413 784020157 784240570
2482.3G84240570Q64487O19201K38038o9809o31104m06189o82144n44128q24433o87027
$$ 784240570 785105057 785724258 785962296 785892487 785261383 784855194 784173050 783628922 782804489 782117462
2492G82117462L3112k03934M97437L24707O4315M26026L46679L11738j84250l96271
$$ 782117462 782150574 781946640 782444077 782768784 782833099 783259125 783605804 783917542 783733292 783337021
2501.6G83337021m86984n70298q31375p42798k54898K25525L74298K79465P42874M41361
$$ 783337021 782850037 782279739 781448364 780705566 780450668 780676193 781050491 781329956 782072830 782514191
2511.2G82514191M19464R0790o13175m58603o25839n22079p49054n58625j28326M2419
$$ 782514191 782933655 783024445 782411270 781952667 781326828 780804749 780055695 779497070 779368744 779411163
2520.9G79411163M19617K96097L03726J57318J55411j62811k80304n6839m98352p64466
$$ 779411163 779830780 780126877 780430603 780587921 780743332 780580521 780300217 780243378 779745026 778980560
2530.5G78980560q72726n57556l66059k80151k38113N111L79792K91137L02201n1880
$$ 778980560 778107834 777550278 777184219 776904068 776665955 776671066 777050858 777341995 777644196 777592316
2540.2G77592316j85623n35889n59235m01153o62308o97098r33685r003J10779N5008
$$ 777592316 777406693 776870804 776311569 775910416 775248108 774551010 773617325 773608322 773719101 773774109
2549.8G73774109O61545K49481K5024m18319j16501l68958p79724l22723o89774p49664
$$ 773774109 774435654 774685135 774710159 774291840 774175339 773806381 773026657 772703934 772014160 771264496
2559.5G71264496o06690J9226K98157K1744k5024L5553J38931k04315j85013l54767
$$ 771264496 770657806 770677032 770975189 770996933 770971909 771007462 771146393 770942078 770757065 770402298
2569.1G70402298l32947l75442o37818n02853o10733n33905l06854L26919K57950j73111
$$ 770402298 770069351 769693909 769056091 768553238 767942505 767408600 767101746 767428665 767686615 767513504
2578.7G67513504k14157o7673K69394m9438j8311m72336p61566m49905m53949k43378
$$ 767513504 767299347 767231674 767501068 767451630 767433319 766960983 766199417 765749512 765295563 765052185
2588.4G65052185k26211Q1329R2697K24991j1978k17820J52436l62473l18985k16980
$$ 765052185 764825974 764907303 765000000 765224991 765213013 764995193 765147629 764785156 764466171 764249191
2598G64249191j64566l70483n68314j88675k35290J45798J54876K47574K16675k51999
$$ 764249191 764084625 763714142 763145828 762957153 762721863 762867661 763022537 763270111 763486786 763234787
2607.7G63234787j56250j28021k52915m59747l01590n87692o18592m74090o81229k29492
$$ 763234787 763078537 762950516 762697601 762237854 761936264 761348572 760729980 760255890 759574661 759345169
2617.3G59345169o5994P2479j04294m07486o30569m36630K19574j14747m50210q91800
$$ 759345169 759279175 759351654 759247360 758839874 758209305 757772675 757992249 757877502 757427292 756535492
2627G56535492j000977n80444n40924m89197m27322m10691l50341P3013j82724m13589
$$ 756535492 755534515 754954071 754413147 753923950 753496628 753085937 752735596 752808609 752625885 752212296
2636.6G52212296k38953p25479p79190k95792j52512o61544r66950q28628l66898m36172
$$ 752212296 751973343 751247864 750468674 750172882 750020370 749358826 748391876 747563248 747196350 746760178
2646.3G46760178o97632k50931m10614o9885J13983l31192n48172p59583l97110o12030
$$ 746760178 746062546 745811615 745401001 745331116 745445099 745113907 744565735 743806152 743409042 742797012
2655.9G42797012q14285p01752o02417l49884j30539p3471l20816J59149n2261n25894
$$ 742797012 741982727 741280975 740678558 740328674 740198135 740124664 739803848 739962997 739910736 739384842
2665.5G39384842m21982o32782n98602p33261p63703m73175l30810j041718q12378
$$ 739384842 738962860 738330078 737731476 736998215 736234512 735761337 735430527 734388809 733576431
2674.2G33576431N06745N01098L02658m5929k92282l13873p58057r81979p53632l97873
$$ 733576431 734083176 734584274 734886932 734841003 734548721 734234848 733476791 732494812 731741180 731343307
2683.9G31343307n33828o70166p76291k61383L13492L04184K28500l66745n25589m19922
$$ 731343307 730809479 730139313 729363022 729101639 729415131 729719315 729947815 729581070 729055481 728635559
2693.5G28635559l55759o28357r44900o66504n01480k80457n00183p45468m04510L16085
$$ 728635559 728279800 727651443 726706543 726040039 725538559 725258102 724757919 724012451 723607941 723924026
2703.1G23924026K76185k27280k65122o71234l75671m92783j050644r05685p87354
$$ 723924026 724200211 723972931 723707809 723036575 722660904 722168121 721117477 720211792 719424438
2711.8G19424438m99649n09414k01874j09940m17480l24631K8153K38266n9357k30026
$$ 719424438 718924789 718415375 718213501 718103561 717686081 717361450 717389603 717627869 717568512 717338486
2721.5G17338486q87223j215210p59353l58734m58374j101837o46668K27737N3177
$$ 717338486 716451263 715236053 714476700 714117966 713659592 712557755 711911087 712138824 712192001
2730.2G12192001k21100J37330k10114m02374j36337n22538m37011p45545o20804j46103
$$ 712192001 711970901 712108231 711898117 711495743 711359406 710836868 710399857 709654312 709033508 708887405
2739.8G08887405k56042l23334n33218m2572M0283p1945k54822k01187N2490p47375
$$ 708887405 708631363 708308029 707774811 707732239 707772522 707700577 707445755 707244568 707297058 706549683
2749.4G06549683q00400n85861j06964J34201j77613k35672o45370l22952j98365j21078
$$ 706549683 705749283 705163422 705056458 705190659 705013046 704777374 704132004 703809052 703610687 703489609
2759.1G03489609N0506m0664R0561m95835r53674p67365k00653l1585q6441K0675l02124
$$ 703489609 703540115 703499451 703590012 703094177 702140503 701373138 701172485 701140900 701054459 701075134 700773010
2769.7G00773010n63202k20031L10516Q2397k55661m62646k99759l96423n85327k67106
$$ 700773010 700209808 699989777 700300293 700382690 700127029 699664383 699364624 698968201 698382874 698115768
2779.3F98115768o15692k32467m86451q53576j01471k25678j75323l11661k54898k15607
$$ 698115768 697500076 697267609 696781158 695927582 695826111 695600433 695425110 695113449 694858551 694642944
2789F94642944n64346m74091n21011m89883p75757j050644j060181n58624l90320n73349
$$ 694642944 694078598 693604507 693083496 692593613 691817856 690767212 689707031 689148407 688758087 688184738
2798.6F88184738k57950o67267p89947l35922p7591m42887j057891j138230q61282
$$ 688184738 687926788 687259521 686469574 686133652 686056061 685613174 684555283 683417053 682555771
2807.3F82555771n66788q85086r19723p46231n92270p83844p87735o14167j163330
$$ 682555771 681988983 681103897 680184174 679437943 678845673 678061829 677274094 676659927 675496597
2816F75496597p36007p27768p98645p63703j359405j228638j340103r75037q62503
$$ 675496597 674760590 674032822 673234177 672470474 671111069 669882431 668542328 667567291 666704788
2824.7F66704788p79495n48477q85163q22830j069031p04498p28454j306305j541214
$$ 666704788 665925293 665376816 664491653 663668823 662599792 661895294 661166840 659860535 658319321
2833.3F58319321j585007j298447j447143j051941r03702r43756j147842j595231j234970
$$ 658319321 656734314 655435867 653988724 652936783 652033081 651089325 649941483 648346252 647111282
2842F47111282j092376p17698r29718j612701j598740j665039j869468j742096j492920
$$ 647111282 646018906 645301208 644371490 642758789 641160049 639495010 637625542 635883446 634390526
2850.7F34390526j577873j178093j025620j247558j173096q82836r78164j505776j324920
$$ 634390526 632812653 631634560 630608940 629361382 628188286 627305450 626327286 624821510 623496590
2859.4F23496590j781121j898689j596947k321205k537613j801719j080628j702575
$$ 623496590 621715469 619816780 618219833 615898628 613361015 611559296 610478668 608776093
2867.1F08776093k265320k150612k296944k661133k587013k169113k785950k769317
$$ 608776093 606510773 604360161 602063217 599402084 596815071 594645958 591860008 589090691
2874.8E89090691k808571l132553k565766k536697k437058k133369j739121j666870
$$ 589090691 586282120 583149567 580583801 578047104 575610046 573476677 571737556 570070686
2882.5E70070686j425819j487808k326241j625709r91516r84078r53255p91549k16751
$$ 570070686 568644867 567157059 564830818 563205109 562213593 561229515 560276260 559484711 559267960
2891.2E59267960k19727j87569j88903J0452J7471l52898o00776o88934j39161j82991
$$ 559267960 559048233 558860664 558671761 558682213 558699684 558346786 557746010 557057076 556917915 556734924
2900.8E56734924n18188n89104n96466m97665n70259o09856o31714n17120n15633o83289
$$ 556734924 556216736 555627632 555031166 554533501 553963242 553353386 552721672 552204552 551688919 551005630
2910.5E51005630j151161j180954j207313j582871j557464k042961j784211j720047
$$ 551005630 549854469 548673515 547466202 545883331 544325867 542282906 540498695 538778648
2918.2E38778648k095680j340790j238594j229782j358528j786880j345177p59659
$$ 538778648 536682968 535342178 534103584 532873802 531515274 529728394 528383217 527623558
2925.9E27623558r95865j240387r71145j022721k51503O20461N04837N40123R71107
$$ 527623558 526627693 525387306 524416161 523393440 523141937 523762398 524267235 524807358 525778465
2934.6E25778465J001663Q98781J554528J339836J162605K077446K435837K350311
$$ 525778465 526780128 527678909 529233437 530573273 531735878 533813324 536249161 538599472
2942.3E38599472K425919K592849K454834K555924K626648K426567K302894K450982
$$ 538599472 541025391 543618240 546073074 548628998 551255646 553682213 555985107 558436089
2950E58436089K849121K754707K729645K494697K321396K798004L063965K742920K288323
$$ 558436089 561285210 564039917 566769562 569264259 571585655 574383659 577447624 580190544 582478867
2958.7E82478867K497367K708664K345658K077675K683830K778129J827927J479950
$$ 582478867 584976234 587684898 590030556 592108231 594792061 597570190 599398117 600878067
2966.4F00878067J841126J947250J643944K015190K006569J744995J748199J419182
$$ 600878067 602719193 604666443 606310387 608325577 610332146 612077141 613825340 615244522
2974.1F15244522J625061J677017J805725J656113J483421J776848J676636J803818
$$ 615244522 616869583 618546600 620352325 622008438 623491859 625268707 626945343 628749161
2981.8F28749161J325302Q17299J021614J258697J144944J026992J222611R89380R13429
$$ 628749161 630074463 630891762 631913376 633172073 634317017 635344009 636566620 637556000 638469429
2990.5F38469429Q75244J199608J293793N91659N05753N56869N66101O11649M34875
$$ 638469429 639344673 640544281 641838074 642429733 642935486 643492355 644058456 644670105 645104980
2999.2F45104980N7679j0300O4774P6599L7231k20718K49862M15955K86102K05078
$$ 645104980 645162659 645152359 645217133 645293732 645330963 645110245 645360107 645776062 646062164 646267242
3008.8F46267242k81295l70636k63138p36847j686935j129914l70025o48880n73197
$$ 646267242 645985947 645615311 645352173 644615326 642928391 641798477 641428452 640779572 640206375
3017.5F40206375k71301k38991r52454j032829m52156m95834j032181j243629j200676
$$ 640206375 639935074 639696083 638743629 637710800 637258644 636762810 635730629 634487000 633286324
3026.2F33286324j103096p06406j371079j234665r34486j383781o72036p61528p02629
$$ 633286324 632183228 631476822 630105743 628871078 627936592 626552811 625880775 625119247 624416618
3034.9F24416618r91439j766434j190262q27103j149635j604881j565361j434174r89265
$$ 624416618 623425179 621658745 620468483 619641380 618491745 616886864 615321503 613887329 612898064
3043.6F12898064p61414j374664j561089j132965o91070j074105j177025j342887j706582
$$ 612898064 612136650 610761986 609200897 608067932 607376862 606302757 605125732 603782845 602076263
3052.2F02076263j291465j371308j590805j652908j421280r33189j022492j209984
$$ 602076263 600784798 599413490 597822685 596169777 594748497 593815308 592792816 591582832
3060E91582832j076545j330681j310921p86438j374092j600075j625023k277717j639862
$$ 591582832 590506287 589175606 587864685 587078247 585704155 584104080 582479057 580201340 578561478
3068.6E78561478o39878j098442j693153j157799j055679p77626j085205j692620j108017
$$ 578561478 577921600 576823158 575130005 573972206 572916527 572138901 571053696 569361076 568253059
3077.3E68253059j575889j814842j615754j516685j452408j580353j166687j232834
$$ 568253059 566677170 564862328 563246574 561729889 560277481 558697128 557530441 556297607
3085E56297607j066436j336975j539536j187668j155586r74922j422386j553193j418342
$$ 556297607 555231171 553894196 552354660 551166992 550011406 549036484 547614098 546060905 544642563
3093.7E44642563j233826j465683j651153j079598j185531j129876j366195j446305
$$ 544642563 543408737 541943054 540291901 539212303 538026772 536896896 535530701 534084396
3101.4E34084396j375160j338463r61189j337204j487808j565437j391793j363945
$$ 534084396 532709236 531370773 530409584 529072380 527584572 526019135 524627342 523263397
3109.1E23263397j530723j476174j266746r02558j305160q78067r37348j287155j127624
$$ 523263397 521732674 520256500 518989754 518087196 516782036 515903969 514966621 513679466 512551842
3117.8E12551842j627846j346397j449013j366654j287155j679649j464501j046257
$$ 512551842 510923996 509577599 508128586 506761932 505474777 503795128 502330627 501284370
3125.5E01284370o54754q75893j097679j691513j272278n56602r98536j315994j536674
$$ 501284370 500629616 499753723 498656044 496964531 495692253 495135651 494137115 492821121 491284447
3134.2D91284447q75664j248207j642761j246605j397744r72518j120720r92241r14688
$$ 491284447 490408783 489160576 487517815 486271210 484873466 483900948 482780228 481787987 480873299
3142.9D80873299j362572j085358q04710p12319j051750j341667j118774j313591j668854
$$ 480873299 479510727 478425369 477620659 476908340 475856590 474514923 473396149 472082558 470413704
3151.6D70413704r86328q42934p91283p83462j625824j037140r65309j098824o42356
$$ 470413704 469427376 468584442 467793159 467009697 465383873 464346733 463381424 462282600 461640244
3160.3D61640244q59681j051483j307869j189384j423531j023903p11136p64923q03527
$$ 461640244 460780563 459729080 458421211 457231827 455808296 454784393 454073257 453308334 452504807
3168.9D52504807j402627m08515n79949j287308p56607q65097j118583j336022j004028
$$ 452504807 451102180 450693665 450113716 448826408 448069801 447204704 446086121 444750099 443746071
3177.6D43746071r27925q25691q54836r22394p51152q73947n97801o99883m85878p21016
$$ 443746071 442818146 441992455 441137619 440215225 439464073 438590126 437992325 437292442 436806564 436085548
3187.3D36085548j081428j177254j291885m01039o33393j032371r10454q77304r87091
$$ 436085548 435004120 433826866 432534981 432133942 431500549 430468178 429557724 428680420 427693329
3195.9D27693329q89168k81181n12696n59082p20329o28395q73032j134491m99076
$$ 427693329 426804161 426522980 426010284 425451202 424730873 424102478 423229446 422094955 421595879
3204.6D21595879p33262p19451r45092n82275m60053j060714l67127k27966m52919
$$ 421595879 420862617 420143166 419198074 418615799 418155746 417095032 416727905 416499939 416047020
3213.3D16047020j121750j054878m16603j57547p7210r42001j159210j098900n00450
$$ 416047020 414925270 413870392 413453789 413296242 413219032 412277031 411117821 410018921 409518471
3222D09518471l49579q20923m50134m50173l48243m41094m70848o79397n53132j74980
$$ 409518471 409168892 408347969 407897835 407447662 407099419 406658325 406187477 405508080 404954948 404779968
3231.6D04779968p69882p15408o90232n26809j39923m23470p78541n83535l31192n85899
$$ 404779968 404010086 403294678 402604446 402077637 401937714 401514244 400735703 400152168 399820976 399235077
3241.3C99235077m81110n45463r117p7q34961o86302q08639l62740n8556l10287m58183
$$ 399235077 398753967 398208504 398199387 398199310 397364349 396678047 395869408 395506668 395448112 395137825 394679642
3251.9C94679642m68674j93214o43654n12467m4670k28462n48477o22444n06821l44620
$$ 394679642 394210968 394017754 393374100 392861633 392816963 392588501 392040024 391417580 390910759 390566139
3261.5C90566139j80168n24979k96058j3848l75099m09508j69525q125l58810o01693
$$ 390566139 390385971 389860992 389564934 389551086 389175987 388766479 388596954 388588829 388230019 387628326
3271.2C87628326k53219O5574k02178l64304p41348j133881l27034O676j1177j70060
$$ 387628326 387375107 387440681 387238503 386874199 386132851 384998970 384671936 384678612 384667435 384497375
3280.8C84497375l31726N0469j75667k66151k69318o41098n89790n59960n21774j06468
$$ 384497375 384165649 384216118 384040451 383774300 383504982 382863884 382274094 381714134 381192360 381085892
3290.4C81085892O332k3346q4686m05159l69568l61824l92990m29993m04548l51143
$$ 381085892 381092224 381068878 380984192 380579033 380209465 379847641 379454651 379024658 378620110 378268967
3300.1C78268967l98369j32561l30162m64287l87840l777o904j034584o15006J70746
$$ 378268967 377870598 377738037 377407875 376943588 376555748 376551971 376545067 375510483 374895477 375066223
3309.7C75066223q7433m10003j85280j15967n00450l6163j38016m57649n38254o77948
$$ 375066223 374978790 374568787 374383507 374267540 373767090 373730927 373592911 373135262 372597008 371919060
3319.4C71919060l02620l16849l07312j33400l9940k35061k64245m90989r54666m80042
$$ 371919060 371616440 371299591 370992279 370858879 370818939 370583878 370319633 369828644 368873978 368393936
3329C68393936l90053l73840m69322n62668j57623l48206k1515J65215n79071q57849
$$ 368393936 368003883 367630043 367160721 366598053 366440430 366092224 366070709 366235924 365656853 364799004
3338.7C64799004o71845m23241k24838k74772m24118m78440j50604J71928n14564n81169
$$ 364799004 364127159 363703918 363479080 363204308 362780190 362301750 362151146 362323074 361808510 361227341
3348.3C61227341k85683p80945q02917m49181N5237l02544r32960n38979K3537j07880
$$ 361227341 360941658 360160713 359357796 358908615 358963852 358661308 357728348 357189369 357212906 357105026
3357.9C57105026o68220o11382o41975m93050k93045l92876m22401o17638n3672M9018
$$ 357105026 356436806 355825424 355183449 354690399 354397354 354004478 353582077 352964439 352910767 352959785
3367.6C52959785l4637r5787r22928r34067m13398k22435n14107n22118k53601r2316
$$ 352959785 352925148 352829361 351906433 350972366 350558968 350336533 349822426 349300308 349046707 348954391
3377.2C48954391J08948k59399m81148m20685l92990k36931k44102p68204n61256M41093
$$ 348954391 349063339 348803940 348322792 347902107 347509117 347272186 347028084 346259880 345698624 346139717
3386.9C46139717J15814m42619m78401m20990r1057j02310l84331k20947L06396n035
$$ 346139717 346255531 345812912 345334511 344913521 344822464 344720154 344335823 344114876 344421272 344416237
3396.5C44416237m55361k0751r9183p54013p07702P9689L77388j91651k94304o6375
$$ 344416237 343960876 343940125 343840942 343086929 342379227 342458916 342836304 342644653 342350349 342283974
3406.2C42283974m44908Q5220N50575j60560l87192m76761m80118l73802l61939l10516
$$ 342283974 341839066 341924286 342474861 342314301 341927109 341450348 340970230 340596428 340234489 339923973
3415.8C39923973K20566M75693j36223o1074l30162o8168O43425o5346n37033n09224
$$ 339923973 340144539 340620232 340484009 340422935 340092773 340024605 340668030 340602684 340065651 339556427
3425.5C39556427M46434P19261n95321n27497L98674Q8043l53050J64070L03612O3667
$$ 339556427 340002861 340722122 340126801 339599304 339997978 340086021 339732971 339897041 340200653 340264320
3435.1C40264320m7531j2932j04675k022L60108K76794L44315p5379j17073J6899J76316
$$ 340264320 340216789 340203857 340099182 340097160 340457268 340734062 341078377 341002998 340885925 340902824 341079140
3445.7C41079140P72094p7400K79999M44565n36308o5117L01437M20723N77507K26364
$$ 341079140 341851234 341773834 342053833 342498398 341962090 341896973 342198410 342619133 343196640 343423004
3455.3C43423004J09825L18299j53962j00860L67431K19727K11182k17591O42853J281166
$$ 343423004 343532829 343851128 343697166 343596306 343963737 344183464 344394646 344177055 344819908 346101074
3465C46101074M70696l07045n32532N63850N23911K43568L22762L74794Q44574P133
$$ 346101074 346571770 346264725 345732193 346296043 346819954 347063522 347386284 347761078 348605652 348612785
3474.6C48612785k19345K59934L49846M44870O18286O83250J21994l49769l81012P47604
$$ 348612785 348393440 348653374 349003220 349448090 350066376 350749626 350871620 350521851 350140839 350888443
3484.3C50888443J120796M69437M40636K12707L0479M25530P80563L41645K92434K78282
$$ 350888443 352009239 352478676 352919312 353132019 353162498 353588028 354368591 354710236 355002670 355280952
3493.9C55280952K08092M75083j57891J22338L90052M84810R46503L55568L63579P37457
$$ 355280952 355489044 355964127 355806236 355928574 356318626 356803436 357749939 358105507 358469086 359206543
3503.6C59206543M23050L57399j0376L53088J498909P5646m85649J246185M25911k3041
$$ 359206543 359629593 359986992 359976616 360329704 361828613 361904259 361418610 362664795 363090706 363067665
3513.2C63067665J51711M00619N33981K44751J125145Q35953q7776N41344J598396
$$ 363067665 363219376 363619995 364153976 364398727 365523872 366359825 366272049 366813393 368411789
3521.9C68411789N70869q13751L78342P13425L34587K99453O59562M46624R19647P78161
$$ 368411789 368982658 368168907 368547249 369260674 369595261 369894714 370554276 371000900 371920547 372698708
3531.5C72698708N455J002616J059990J196747k7199q99772P41615R21402J279907
$$ 372698708 372704163 373706779 374766769 375963516 375936317 375036545 375778160 376699562 377979469
3540.2C77979469M45786O61545J459846P12547l51905p31965J132088M42658Q80699
$$ 377979469 378425255 379086800 380546646 381259193 380907288 380175323 381307411 381750069 382630768
3548.9C82630768J319694J306000J162415j118470P48597N94062R15223J522598J83792
$$ 382630768 383950462 385256462 386418877 385300407 386049004 386643066 387558289 389080887 389264679
3557.6C89264679J661453J400833O22254L63807J571656J036377N88226L936501P89451
$$ 389264679 390926132 392326965 392949219 393313026 394884682 395921059 396509285 400445786 401235237
3566.2D01235237j064834r42879N38215L884812N18188K96212J743354J404152K82402
$$ 401235237 400170403 399227524 399765739 403650551 404168739 404464951 406208305 407612457 407894859
3574.9D07894859P52487K261887M40216J516915J516189O71883J407051J232757J229515
$$ 407894859 408647346 410909233 411349449 412866364 414382553 415054436 416461487 417694244 418923759
3583.6D18923759J281777M163971K081375j488190J015129q98170K319755K811852
$$ 418923759 420205536 424369507 426450882 424962692 425977821 425079651 427399406 430211258
3591.3D30211258K464905Q24508J007576L372879r21402K527466K918892k59018K560425
$$ 430211258 432676163 433500671 434508247 437881126 436959724 439487190 442406082 442147064 444707489
3600D44707489J097679J476555K244568J322517K397766L570557K021751j174125L673820
$$ 444707489 445805168 447281723 449526291 450848808 453246574 456817131 458838882 457664757 461338577
3608.7D61338577o12373k58255P516708J172524j838837L406067r613M392700M160233
$$ 461338577 460726204 460467949 467984657 469157181 467318344 470724411 470714798 475107498 479267731
3617.4D79267731m70772J438408O1073J084252K446212K258225K244072K635727K645836
$$ 479267731 478796959 480235367 480296440 481380692 483826904 486085129 488329201 490964928 493610764
3626D93610764K800407O124306k207756r003525O099663N061416M763146J072082l08838
$$ 493610764 496411171 502535477 500327721 491324196 497423859 502485275 507248421 508320503 508011665
3634.7E08011665K772713K498894K262802P60994J573334K218666K494430K025528
$$ 508011665 510784378 513283272 515546074 516307068 517880402 520099068 522593498 524619026
3642.4E24619026J253357K608528M028473O698723m41208k630348O364326j172752
$$ 524619026 525872383 528480911 532509384 539208107 538766899 536136551 542500877 541328125
3650.1E41328125m969559l29704O666336M844055M189377M317474q373489L025208
$$ 541328125 536358566 536028862 542695198 547539253 551728630 556046104 547672615 550697823
3657.9E50697823N741005J441192J235886Q00133K800064Q92524J662979K566262J755905
$$ 550697823 556438828 557880020 559115906 559916039 562716103 563608627 565271606 567837868 569593773
3666.5E69593773N546913K672997p54242P19375n146332M099808Q883438P927170n774879
$$ 569593773 575140686 577813683 577059441 577778816 572632484 576732292 585615730 593542900 587768021
3675.2E87768021j7011376P032814Q201561M537392j773682J066056L255729J645928
$$ 587768021 570756645 577789459 585991020 590528412 588754730 589820786 593076515 594722443
3682.9E94722443K290077J617470J108398M516373N904236j0292359k581100R127044
$$ 594722443 597012520 598629990 599738388 604254761 610158997 599866638 597285538 606412582
3690.6F06412582n968551P62329O275062J344338K137222P53098N06439J918449J292458
$$ 606412582 600444031 601206360 607481422 608825760 610962982 611716080 612222519 614140968 615433426
3699.3F15433426K962227K307319n503883j642075M957810J586113P99103J138801
$$ 615433426 618395653 620702972 615199089 613557014 618514824 620100937 620900040 622038841
3707F22038841L323937M670143o466942M360695L395767j2345238N499764M310875
$$ 622038841 625362778 630032921 623565979 627926674 631322441 618977203 624476967 628787842
3714.8F28787842J62239P77168K769737J379052l238488J572647N792542m106102l879280
$$ 628787842 628950081 629727249 632496986 633876038 630637550 632210197 638002739 633896637 630017357
3723.4F30017357O396904J476478l8414k328872O72798M375267J450653O595306l346252
$$ 630017357 636414261 637890739 637852325 635523453 636196251 640571518 642022171 648617477 645271225
3732.1F45271225p146149R497147j18103q793678j66359L250274J757279L314132K998963
$$ 645271225 638125076 647622223 647504120 638710442 638544083 641794357 643551636 646865768 649864731
3740.8F49864731l713303M421845J1337738j3870926j3551521J1813774O830139Q309936
$$ 649864731 646151428 650573273 661911011 648040085 634488564 646302338 653132477 661442413
3748.5F61442413j923828j1953964J0674744r595642n739441P735900N146714L575973
$$ 661442413 659518585 647564621 658239365 648643723 642904282 650640182 655786896 659362869
3756.2F59362869n583114L192443N180436r308167J05210N486526J588287N77317L157959
$$ 659362869 653779755 656972198 662152634 652844467 652949677 658436203 660024490 660601807 663759766
3764.9F63759766l462677l881302M170685N523071j86997r155731K358170K833862
$$ 663759766 660297089 656415787 660586472 666109543 665922546 656766815 659124985 661958847
3772.6F61958847M71497J586074Q73642J839829N14603K610626j016159p641754L480606
$$ 661958847 662430344 664016418 664890060 666729889 667244492 669855118 668838959 661197205 664677811
3781.3F64677811L046493J748963K287521l578491j486664J516266J145096P91626
$$ 664677811 667724304 669473267 671760788 668182297 666695633 668211899 669356995 670148621
3789F70148621m2725M92859L78265Q77762k90451J370850M781723l095169m073868
$$ 670148621 670105896 670598755 670977020 671854782 671564331 672935181 677716904 674621735 670547867
3797.7F70547867K890243M972306O072235r904251j1095810M932861M409332O520462
$$ 670547867 673438110 678410416 684482651 674578400 663482590 668415451 672824783 679345245
3805.4F79345245N479126j2320480l871231O410904K761459J104889Q68912K61764
$$ 679345245 684824371 672503891 668632660 675043564 677805023 678909912 679778824 680040588
3813.1F80040588K135468N714874k533111j4677124O119308O918945N183792J091996
$$ 680040588 682176056 687890930 685357819 670680695 676800003 683718948 688902740 689994736
3820.8F89994736k0660935L288422O621551K879868L610687o83212m644013J009903
$$ 689994736 669333801 672622223 679243774 682123642 685734329 685051117 680407104 681417007
3828.6F81417007K328492L346100J293945p982254L978195O953659o606064J581192
$$ 681417007 683745499 687091599 688385544 680403290 684381485 691335144 684729080 686310272
3836.3F86310272Q616867r375152k658081P571716p333527l40805P159348l035126
$$ 686310272 694927139 685551987 682893906 690465622 683132095 682791290 689950638 686915512
3844F86915512m004364L184204J860428J019287K783280k83204K607956N780640n944748
$$ 686915512 682911148 686095352 687955780 688975067 691758347 691475143 694083099 699863739 693918991
3852.7F93918991q41217j9076691M757080J2285538j102066k185440J940231K463913
$$ 693918991 693077774 674001083 678758163 691043701 689941635 687756195 689696426 692160339
3860.4F92160339K732239m599686J589356P572861p189942o080398M987640N734558
$$ 692160339 694892578 690292892 691882248 699455109 692265167 686184769 691172409 696906967
3868.1F96906967N509491r812622q053741N081482O366958K977371j0502395J596832
$$ 696906967 702416458 692603836 684550095 689631577 695998535 698975906 688473511 690070343
3875.8F90070343M563599L37906K757034L759003o757889n794373P241135J567612
$$ 690070343 694633942 694971848 697728882 701487885 694729996 688935623 696176758 697744370
3883.5F97744370J139678L083268j3425827K612915M097900J572647N582199j407699
$$ 697744370 698884048 701967316 688541489 691154404 695252304 696824951 702407150 700999451
3891.2G00999451q563691J807328L196945q42361J276931Q44956K707367R27658r719086
$$ 700999451 692435760 694243088 697440033 696597672 697874603 698719559 701426926 702354584 692635498
3899.9F92635498O538162J883774n424576N381470l432770j688614L26920M53491J709595
$$ 692635498 699173660 701057434 695632858 701014328 697581558 695892944 696219864 696673355 698382950
3908.6F98382950n56717J313019O12869l04718K65732r690K156601K802353l732757
$$ 698382950 697826233 699139252 699752121 699447403 699713135 699703445 701860046 704662399 700929642
3917.3G00929642l021317N038605o92520m911804K900924K615586M78439l185196l024521
$$ 700929642 697908325 702946930 702254410 697342606 700243530 702859116 703337555 700152359 697127838
3926F97127838K059860K089539J800308r19952j73187K518463k725067j188736J428680
$$ 697127838 699187698 701277237 703077545 702157593 701984406 704502869 701777802 700589066 702017746
3934.6G02017746n81665K35519M23355k20108K53449M25262J989823J150360m080734
$$ 702017746 701436081 701671600 702094955 701874847 702128296 702553558 704543381 705693741 701613007
3943.3G01613007j29013J948623Q06580J082916k604065O85577Q07953k722473J644211
$$ 701613007 701483994 703432617 704239197 705322113 702718048 703403625 704211578 701489105 703133316
3952G03133316P95822k29J69220n91354N95474J0452M06495L60107P88650M44184j719818
$$ 703133316 703929138 703928909 704098129 703506775 704102249 704112701 704519196 704879303 705667953 706112137 704392319
3962.6G04392319o08673N77087R46655R02329J22680l51638n84717n87769M64402O57730
$$ 704392319 703783646 704360733 705307388 706209717 706332397 705980759 705396042 704808273 705272675 705930405
3972.2G05930405j85013M71039P30743r1019q72573m36936j60522K67257J293183j21918
$$ 705930405 705745392 706216431 706947174 706856155 705983582 705546646 705386124 705653381 706946564 706824646
3981.9G06824646p96890N39856N92498n64880j12762P76825L69339N01175j44654m40674
$$ 706824646 706027756 706567612 707160110 706595230 706482468 707259293 707628632 708129807 707985153 707544479
3991.5G07544479m64782L8528P30438o67419m05274K36893K20642O15006O37665
$$ 707544479 707079697 707118225 707848663 707181244 706775970 707012863 707233505 707848511 708486176
4000.2G08486176
$$ 708486176
##END=$$ End of the data block
