##TITLE=$$ Begin of the data block
##JCAMP-DX=5.00 $$ ACD/SpecManager v 10.08
##SPECTROMETER/DATA SYSTEM=Varian
##DATE=20 Nov 2012 09:38:40
##DATA TYPE=INFRARED SPECTRUM
##DATA CLASS=XYDATA
##ORIGIN=
##OWNER=
##NPOINTS=3735
##FIRSTX=399.26403809
##LASTX=4000.35498047
##MAXX=4000.35498047
##MINX=399.26403809
##MAXY=80.58460236
##MINY=24.85227203
##XFACTOR=1.0000000000
##YFACTOR=0.000000100000000
##FIRSTY=52.28362656
##DELTAX=0.96440572
##XUNITS=1/CM
##YUNITS=TRANSMITTANCE
##XYDATA=(X++(Y..Y))
399.3E22836266O821250P621384k079277j97067M456634n547752j774406k030220q012772
407.9E22094040m669762J109162J250000N490150Q040695j095276l218116L451805
415.7E32452698M919586l550224j7963066L957252J3846207n413018j1314239K36778
423.4E17171974K140846J015816L685494k843705j913948P146187L850784j1391029
431.1E18862419r598961j470604L550415M237900k070885j303367r194O61393k954903
439.8E09904213n41344P949181O392898k48298l550377K193947L380317o50329R38415
448.4E25768623K421608J366616k084542q77456M948082N740585q17070m127159k082901
457.1E30256386n61257K286415J09520j915321L21350K837410l209839n111198J3695
$$ y = [522836266, 529657516, 537278900, 535199623, 535002556, 539459190, 533911438, 532137032, 530106812, 522094040, 517424278, 518533440, 519783440, 525273590, 533314285, 532219009, 529000893, 532452698, 537372284, 533822060, 515858994, 519816246, 533662453, 528249435, 516935196, 517171974, 519312820, 520328636, 524014130, 521170425, 519256477, 526402664, 530253448, 518862419, 509263458, 507792854, 511343269, 515581169, 513510284, 512206917, 512197723, 512859116, 509904213, 509362869, 517312050, 523704948, 523456650, 519906273, 522100220, 525480537, 524830208, 525768623, 528190231, 529556847, 527472305, 526594849, 531542931, 537283516, 536466446, 532339287, 530256386, 529695129, 531981544, 532091064, 530175743, 530497093, 533334503, 530124664, 525013466, 525027161]
465.8E25027161l038102k581596K401352K508965l921395o477585j456718j164589
473.5E11297493p15179n81818J176262j420822n285759m716645K075196R243583O7826
482.2E11140137m857712k103310j62430Q17872L291053K152024m367333l10020J73568
490.9E05773849l791084r34410K980309J834144l053322k60582M42505k46391k023506
499.6E00721512j435852K735786j189880m013405l525238p49130m92859P95746J909294
508.2D94755974j330452P31735k65045k679138m463082m566307m014816l074722j823616
516.9D73270531l147583Q78029j639824o52390K989693k45819l051148l615455M57725
525.6D65243759L93410j310005k347451j750793J43547Q63800L651314K043419K225570
$$ y = [525027161, 521989059, 519407463, 521808815, 524317780, 520396385, 513918800, 512462082, 511297493, 510582314, 510000496, 511176758, 509755936, 504470177, 499753532, 501828728, 511072311, 511140137, 506282425, 504179115, 504016685, 504834557, 508125610, 510277634, 505910301, 505600281, 505773849, 501982765, 501048355, 504028664, 505862808, 502809486, 502548904, 502991409, 502745018, 500721512, 499285660, 502021446, 500831566, 496818161, 493292923, 492543793, 492050934, 492846680, 494755974, 493425522, 494157257, 493892212, 491213074, 486749992, 482183685, 478168869, 475094147, 473270531, 470122948, 471000977, 469361153, 468708763, 471698456, 471452637, 468401489, 464786034, 465243759, 465637169, 464327164, 461979713, 460228920, 460372467, 461236267, 464887581, 466931000, 469156570]
534.3D69156570J156121J115722M015694K675285L81241N89600L514290J262512J475792
543D85342827K434158Q54149L755569K996216N78690j145325j003036J46980n5847
551.6D93904381p56149l684960l035087j723862j562691j853523j077576Q92792k07672
560.3D80895653j526604k218628k518883l871879l109818m050750n968743l895340
568D53735008m262199k822266k869415o32668n18722j351776J203079m12903R45130
576.7D43013268J26228J344147J503067J127662K933464J698685N142059N170594L365249
585.4D65424423K186966L464089M086151J544609K504539K228508K505036P16781k1248
594.1D84639854J157875K26136j106720k186203j69792Q71543J735268m89082j852265
$$ y = [469156570, 470312691, 471428413, 475444107, 478119392, 478500633, 479090233, 482604523, 483867035, 485342827, 487776985, 488631134, 492386703, 495382919, 495961609, 494816284, 493813248, 493960228, 493904381, 493148232, 489463272, 486428185, 484704323, 483141632, 481288109, 480210533, 481103325, 480895653, 479369049, 477150421, 474631538, 470759659, 467649841, 463599091, 457630348, 453735008, 449472809, 446650543, 443781128, 443148460, 442629738, 441277962, 442481041, 442068138, 443013268, 443139496, 444483643, 445986710, 447114372, 450047836, 451746521, 456888580, 462059174, 465424423, 467611389, 471075478, 475161629, 476706238, 479210777, 481439285, 483944321, 484661102, 484639854, 485797729, 486023865, 484917145, 482730942, 482561150, 483432693, 485167961, 484678879, 482826614]
602.8D82826614J10321r38186J98478J478501K061310q83255j847992J268348M89350
611.4D84763489O45599R77936J535492M27284J138649J700783K59018L117409K075347
620.1D96641006J969986L448601K504120J599083Q88443J462822J587296K087593J024932
628.8E13213882O66848K600059L394013J944046P46879J137810k47955K48336j40953
637.5E23562965j337318K07825N58548J310348R60007N41954J645927K196045J339188
646.2E30985489Q469j247826j321945J142158Q11653k66838r30443j308517J512337
654.8E29384537K338562J752167J500205J464272J405830J423302P60803p16247j159096
663.5E38154335j562309p9041N95169n183754j0569153J1295586O940117K407150Q30231
$$ y = [482826614, 482936935, 481998749, 482197227, 483675728, 485737038, 484853783, 483005791, 484274139, 484763489, 485409088, 486387024, 487922516, 488349800, 489488449, 491189232, 491448250, 494565659, 496641006, 498610992, 502059593, 504563713, 506162796, 507051239, 508514061, 510101357, 512188950, 513213882, 513880730, 516480789, 519874802, 521818848, 522565727, 523703537, 523455582, 523703918, 523562965, 522225647, 522433472, 522992020, 524302368, 525262375, 525804329, 527450256, 529646301, 530985489, 530993958, 529746132, 528424187, 529566345, 530377998, 530111160, 529180717, 527872200, 529384537, 531723099, 533475266, 534975471, 536439743, 537845573, 539268875, 540029678, 539313431, 538154335, 536592026, 536512985, 537108154, 531924400, 521355247, 532650833, 539590950, 541998100, 542828331]
672.2E42828331R73778J290512k2278j424446p68242r27620q96988l45192J600609
680.9E42308464L020363K250061J316872J129493J777306O55060p8545k63710j262245
689.6E50853119j652451j458969J98441K11792j033745m47311J158027J108742L0212
698.2E48967857k99720j495972k068749k877159l188629k057381k303466j579361l80173
706.9E32717247l98979k04849R92202J303711J507302J880264O69327M39377J423530
715.6E40329132J542511P93152J375236J537438K046852N273132N877838M267960K519302
724.3E65562553K104264K930183K396927K097511K322350Q48312L47367J919097K493592
733E83022156K469330K644462K510033K102318J095276q5412l5781P20863K37656r87435
$$ y = [542828331, 543802109, 545092621, 545070343, 543645897, 542877655, 541950035, 541053047, 540707855, 542308464, 545328827, 547578888, 548895760, 550025253, 551802559, 552457619, 552379074, 552115364, 550853119, 549200668, 547741699, 547940140, 548151932, 547118187, 546670876, 547828903, 548937645, 548967857, 548668137, 547172165, 545103416, 542226257, 539037628, 536980247, 534676781, 533097420, 532717247, 532318268, 532113419, 533105621, 534409332, 535916634, 537796898, 538466225, 538905602, 540329132, 541871643, 542664795, 544040031, 545577469, 547624321, 552897453, 558775291, 563043251, 565562553, 567666817, 570597000, 572993927, 575091438, 577413788, 578262100, 578609467, 580528564, 583022156, 585491486, 588135948, 590645981, 592748299, 593843575, 593758163, 593722382, 594443245, 594680901, 593693466]
742.6E93693466j141090r46923j235542o70204j155090j957550j133995j668244k483253
751.3E81301575k305222k308273k369270l111268k941703j824265k042045l123093
759E61276436l381882j544418o20384r94530j196556j148529l4142J66969J095543
767.7E53618507K530022L685875L594856K484055L557434L232040K839241L846093
775.4E79388123L693313M819870N322647L793412L271064L317986L974228L867073
783.1F11447716L133430K675476J267929J583748K298470J589279P25975J251221K615623
791.8F28588867K309799J930504K779579L585587L243103K620621J314850O99920J221237
800.5F48294067J135025J178818O68259K191086K818527K687073K906341O42471J365204
$$ y = [593693466, 592552376, 591605453, 590369911, 589699707, 588544617, 586587067, 585453072, 583784828, 581301575, 578996353, 576688080, 574318810, 571207542, 568265839, 566441574, 564399529, 561276436, 557894554, 556350136, 555729752, 554735222, 553538666, 552390137, 552355995, 552522964, 553618507, 556148529, 559834404, 563429260, 565913315, 569470749, 572702789, 575542030, 579388123, 583081436, 587901306, 593223953, 597017365, 600288429, 603606415, 607580643, 611447716, 614581146, 617256622, 618524551, 620108299, 622406769, 623996048, 624722023, 625973244, 628588867, 630898666, 632829170, 635608749, 639194336, 642437439, 645058060, 646372910, 647072830, 648294067, 649429092, 650607910, 651276169, 653467255, 656285782, 658972855, 661879196, 662521667, 663886871]
809.1F63886871K265702J897964J003494n33981j73874m20532j031494m10385P64160
817.8F67247925M27170J109771J724015J838150K311096m58298k150268k923432l006973
826.5F66119156k899628l767471l056717j776352q75549j140747j387329j710511p93991
835.2F48710861m87289k145386l454361n701523n027122l738518l252258j957436k127800
843.9F20819168j276131j97792k01988m5395J18218n44243j602974k643776l905525
852.5F10519562l213730k913704k866592j423531j331787j014900L48167O01273N88073
861.2E99292831J936531K863007K375412K917709L502274L534050L812790M018021
868.9F24252625M342689O767960Q329963O585312N916825N144577M305496K779388
$$ y = [663886871, 666152573, 668050537, 669054031, 668520050, 668346176, 667925644, 666894150, 666483765, 667247925, 667675095, 668784866, 670508881, 672347031, 674658127, 674199829, 672049561, 669126129, 666119156, 663219528, 659452057, 656395340, 654618988, 653743439, 652602692, 651215363, 649504852, 648710861, 648223572, 646078186, 642623825, 636922302, 631895180, 628156662, 624904404, 622946968, 620819168, 619543037, 619345245, 619143257, 619097862, 619216080, 618671837, 617068863, 614425087, 610519562, 607305832, 604392128, 601525536, 600102005, 598770218, 597755318, 598103485, 598704758, 599292831, 601229362, 604092369, 606467781, 609385490, 612887764, 616421814, 620234604, 624252625, 628595314, 635363274, 643693237, 650278549, 656195374, 661339951, 665645447, 668424835]
876.7F68424835J242142J15051j304626j897507k351074j539307j242752o16455j505661
885.3F59324646l319397k877045k565155k354126l371277l849411l604583m069748
893F33313904l929100k806053j748124k331733k089234j451721j773681j902314k206878
901.7F13075066j872254k424583l892365l890609l134232l353691m060249l949166
909.4E86497917m423065m500046l953895m571724l986473m383240n763130n594597
917.2E49321747m602928l554955m452019l411560k508392k077560n80635j389695j027488
925.8E25716515n63393j26152L49121M76036M92973L44963J453667J646042K092896
934.5E31882668J654701J199722J889954K211876L150024K719727K371025L174743
$$ y = [668424835, 669666977, 669782028, 668477402, 666579895, 664228821, 662689514, 661446762, 660830307, 659324646, 656005249, 653128204, 650563049, 648208923, 644837646, 640988235, 637383652, 633313904, 629384804, 626578751, 624830627, 622498894, 620409660, 618957939, 617184258, 615281944, 613075066, 611202812, 608778229, 604885864, 600995255, 597861023, 594507332, 590447083, 586497917, 582074852, 577574806, 573620911, 569049187, 565062714, 560679474, 554916344, 549321747, 544718819, 541163864, 536711845, 533300285, 530791893, 528714333, 528133698, 526744003, 525716515, 525153122, 525026970, 525376091, 525852127, 526345100, 526690063, 528143730, 529789772, 531882668, 533537369, 534737091, 536627045, 538838921, 541988945, 544708672, 547079697, 550254440]
942.2E50254440L679657L007851J334991K97966j218528l392067m051590l712731m937668
950.9E41262321o341896o232223o362190o203766o572495p125740p418365p374382
958.6D87631264q286476r075318q123054r015465r214554r714508r511375r097023
966.3D15593491r776383r545212j0013542q709907r348984q961716r705276j0916291
974.1C38616180r244461r807396q325023q869896q382588p902660o848927m800510
981.8B74434719n666943m164295m302749k430268k586860k520142j235943j314564
989.5B50212955L28331q22200j63155j033211O15235J327343O31885J980038M20780
998.2B53498001J508427L56827J761226J435833N6935J132926m34589O77414k79446
$$ y = [550254440, 553934097, 556941948, 558276939, 558574905, 557356377, 553964310, 549912720, 546199989, 541262321, 534920425, 528688202, 522326012, 516122246, 509549751, 502424011, 495005646, 487631264, 479344788, 470269470, 462146416, 453130951, 443916397, 434201889, 424690514, 415593491, 405817108, 396271896, 386258354, 377548447, 368199463, 359237747, 349532471, 338616180, 329371719, 319564323, 311239300, 302369404, 293986816, 286084156, 279235229, 274434719, 268767776, 264603481, 260300732, 257870464, 255283604, 252763462, 251527519, 250212955, 250541286, 249719086, 249555931, 248522720, 249137955, 250465298, 251097183, 253077221, 253498001, 255006428, 255363255, 257124481, 258560314, 258617249, 259750175, 259315586, 259993000, 259713554]
1006.8B59713554P43485k8935k96993N29747r78756J61476m74643J513767l605p8182
1016.5B60800915R86595q1673R67961l35064J552715J089401K158604J831341J170940
1025.2B70141735K921696J378689K637233J107102K128734J104737P7190K139874J331844
1033.8B84968834J994495K23408J738567Q19092Q64258J534691o5117J425781k66533
1042.5B93237476R17435n9299O07528J000080K09408J748352O1627K209167J602726
1051.2C01534500K370911L082847L611565L016071Q34599M015770K330360L685150
1058.9C24481773M043274M257622N892258M944267O106873N054054O729774M455490
1066.6C65965385L679543L572235l62968k023468n402336o410943p966041n927277
$$ y = [259713554, 260457039, 260428104, 260131111, 260660858, 259682102, 259843578, 259368935, 260882702, 260879097, 260800915, 261787510, 261705837, 262673798, 262338734, 263891449, 264980850, 267139454, 268970795, 270141735, 273063431, 274442120, 277079353, 278186455, 280315189, 281419926, 281497116, 283636990, 284968834, 286963329, 287186737, 288925304, 289744396, 290608654, 292143345, 292078228, 293504009, 293237476, 294154911, 294095612, 294703140, 295703220, 295912628, 297660980, 297722607, 299931774, 301534500, 303905411, 306988258, 310599823, 313615894, 314450493, 318466263, 320796623, 324481773, 328525047, 332782669, 338674927, 343619194, 349726067, 354780121, 361509895, 365965385, 369644928, 373217163, 372854195, 370830727, 365428391, 359017448, 351051407, 345124130]
1074.4C45124130n084305n601577k884217l324089j547508k337875J64604J138000
1082.1C25647163J09101M69169Q01316L090400J83754J702500K436561L047791L369522
1090.7C40857277J773453K986908K129745L707428K100945K644043K938690J912956
1098.5C61051445K383156O66275K144127K02141J90582o3515k54669N72700k56233
1107.1C66636009J736374J30196J970710K454339K021484K402039J589813K833519
1114.9C81774483P84645J581230J576195J949463J278495L48435J899605j70060R71032
1123.5C91993523J298675J463585J260147J504326J858063R30176L081855J338234
1131.2D04728584J505127J913605J582108J594238O01196J100006r08356j249961l589974
$$ y = [345124130, 340039825, 334438248, 331554031, 328229942, 326682434, 324344559, 324509163, 325647163, 325756264, 326225433, 327026749, 330117149, 330300903, 332003403, 334439964, 337487755, 340857277, 342630730, 345617638, 347747383, 351454811, 353555756, 356199799, 359138489, 361051445, 363434601, 364100876, 366245003, 366447144, 366637726, 366574211, 366319542, 366892242, 366636009, 368372383, 368502579, 370473289, 372927628, 374949112, 377351151, 378940964, 381774483, 382559128, 384140358, 385716553, 387666016, 388944511, 389292946, 391192551, 391022491, 391993523, 393292198, 394755783, 396015930, 397520256, 399378319, 400308495, 403390350, 404728584, 406233711, 408147316, 409729424, 411323662, 411924858, 413024864, 412116508, 410866547, 407276573]
1139.9D07276573m032211l693123n174294l773956n299263m289474m316864l825951
1147.6C72871437k920303l167115k443656l114739r29947k415733j800232j132088
1155.4C54947624j449165r16405j986999O41441K53258J100006Q53691J760254L169746
1164C58373451K015305L414840K524720L782463L682785M467430M575272M018058N866089
1172.7C92720413N222016O602363O521950P253075O987419O916427P805863O551552
1180.4D46581078O705627N549965N952263N562477N084076M876633M636306N968552
1188.1D90916977N039291N381928M981956M046135L192940J953011K081832J220093
1195.9E18814163O18286J29242J47362M56352R53408J265068R90715J812057J948204
$$ y = [407276573, 403244362, 399551239, 394376945, 390602989, 385303726, 381014252, 376697388, 372871437, 369951134, 366784019, 364340363, 361225624, 360295677, 357879944, 356079712, 354947624, 353498459, 352582054, 350595055, 351236496, 351489754, 352589760, 353443451, 355203705, 358373451, 360388756, 363803596, 366328316, 370110779, 373793564, 378260994, 382836266, 386854324, 392720413, 397942429, 404544792, 411066742, 418319817, 425307236, 432223663, 440029526, 446581078, 453286705, 458836670, 464788933, 470351410, 475435486, 480312119, 484948425, 490916977, 495956268, 501338196, 506320152, 510366287, 513559227, 515512238, 517594070, 518814163, 519432449, 519561691, 519709053, 520165405, 521118813, 522383881, 523374596, 525186653, 527134857]
1204.5E27134857K454148J817855Q86536J069145R34563J160583J266747K218132K291870
1213.2E41234436K360191L115349L191529L300628L179245K528725J600838J705284
1220.9E62216225J368484N07889j09634n99671J42288L20626o00510n36194L62969
1229.6E63072472r1439q31108k23694m5967m08363j029511j208763r75647q96034o11610
1239.3E56750336n45998m52881n50804J15776P08847P22351R60922Q67157Q71392P05871
1248.9E60152969Q80776Q56781J034546J405601Q95577P97386J075020J338844J066856
1257.6E69504356M46206M99649Q88862J124344J242294J023751P31697L99933J19361
1266.3E75980453P35016R11827P43943J113281J259689J061936R79461J186829J251526
$$ y = [527134857, 529589005, 531406860, 532293396, 533362541, 534297104, 535457687, 536724434, 538942566, 541234436, 543594627, 546709976, 549901505, 553202133, 556381378, 558910103, 560510941, 562216225, 563584709, 564092598, 563982964, 563383293, 563525581, 563846207, 563245697, 562709503, 563072472, 562981033, 562149925, 561926231, 561880264, 561471901, 560442390, 559233627, 558257980, 557361946, 556750336, 556204338, 555751457, 555200653, 555316429, 556025276, 556747627, 557708549, 558575706, 559447098, 560152969, 561033745, 561890526, 562925072, 564330673, 565226250, 566023636, 567098656, 568437500, 569504356, 569950562, 570450211, 571339073, 572463417, 573705711, 574729462, 575461159, 575861092, 575980453, 576715469, 577627296, 578371239, 579484520, 580744209, 581806145, 582785606, 583972435, 585223961]
1274.9E85223961R80911l3378k29226k39486n52712n15518r52759r15794q29621m19044
1284.6E81517334l93944m41246N40734L14292j77726j88980k64931r02596j575508
1293.3E78427429j317367j336213j521110j740150j485444n12390O523O0234Q9684
1301.9E70671196Q9569o18935q64067n68618q92678j408119j750336j419563j018028
1310.6E62220421o80008k74849K42920Q19855L53660R9488j95885p57866j292839j814881
1320.3E58720016j759567k223701k148094j637536j777763j834259j476784r84840
1328E44877472j362534j551323k260971k818870k587280l340645l016930k475891j773949
1336.7E23689079j094207j070786p51266J46675R78965L95890O32972L35427K28309
$$ y = [585223961, 586204872, 586171494, 585942268, 585702782, 585150070, 584634552, 583681793, 582765999, 581936378, 581517334, 581123390, 580682144, 581222878, 581537170, 581359444, 581170464, 580905533, 580002937, 578427429, 577110062, 575773849, 574252739, 572512589, 571027145, 570514755, 570521278, 570581512, 570671196, 570760765, 570141830, 569277763, 568709145, 567816467, 566408348, 564658012, 563238449, 562220421, 561540413, 561265564, 561508484, 562328339, 562681999, 562781487, 562585602, 561827736, 560534897, 558720016, 556960449, 554736748, 552588654, 550951118, 549173355, 547339096, 545862312, 544877472, 543514938, 541963615, 539702644, 536883774, 534296494, 530955849, 527938919, 525463028, 523689079, 522594872, 521524086, 520772820, 520919495, 521898460, 522294350, 522927322, 523262749, 523491058]
1345.3E23491058k87285q97254p68509j343537n24521l54766j50643K3918K20146O77071
1355E20085678J4038K57683k50244l66211r76105j379280p35397j318054j423874o32630
1364.6E13275604O59714K29721K35367M67033L34664J283607M17481O90612m47998
1373.3E17145805r12780L051J26458J191673N4970N55801J226501J725045J369667
1382E22486191J165962J648293J332168J939964Q95691J747208K202187J748542J550331
1390.7E36716537J016465J338577J161003J821556N66406J098099R64318M42237n98259
1399.3E44526939j852760o3209m46053m42734j022758j765099n13763k29073j90849
1408E38000641q44956k99797o60667l68156o39306r91478m36248j188012l11050n30472
$$ y = [523491058, 523203773, 522306519, 521538010, 520194473, 519669952, 519315186, 519164543, 519188461, 519408607, 520085678, 520099716, 520357399, 520107155, 519740944, 518764839, 517385559, 516650162, 515332108, 513908234, 513275604, 513935318, 514165039, 514400406, 514867439, 515202103, 516485710, 516903191, 517593803, 517145805, 516233025, 516236076, 516362534, 517554207, 517609177, 518164978, 519391479, 521116524, 522486191, 523652153, 525300446, 526632614, 528572578, 529468269, 531215477, 533417664, 535166206, 536716537, 537733002, 539071579, 540232582, 542054138, 542620544, 543718643, 544682961, 545125198, 544526939, 542674179, 542610970, 542164917, 541722183, 540699425, 538934326, 538420563, 538191490, 538000641, 537155685, 536855888, 536195221, 535827065, 535187759, 534196281, 533760033, 532572021, 532260971, 531730499]
1417.7E31730499l8261k124710m78287J263237n6534J399002p8163J9303L98101K78473
1427.3E32312660J208573n23796K31742J20507P88955L51677j47018J377754J011810
1436E36732864N54314j87225K078209J008606Q25958J151733K99187J162186l21541
1444.7E43304291J52130j4076L19442j008987j317825N99899m39224J74904r07937
1453.3E40862617M70353M36248j208839j646805m312782R37157k049446P21206k30141
1462E33979568L66326J922150j44349L273430J198921L435135K859307L113098L707771
1470.7E53711357K312775M952888J417847N174675K495041M227409M310570L474617
1478.4E82077179M705315L373184N686836L124695L687248K948151K249298K897682
$$ y = [531730499, 531692238, 529567528, 529089241, 530352478, 530295944, 531694946, 531616783, 531636086, 532034187, 532312660, 533521233, 532997437, 533229179, 533349686, 534138641, 534490318, 534343300, 535721054, 536732864, 537287178, 537099953, 539178162, 540186768, 541012726, 542164459, 542463646, 543625832, 543304291, 543456421, 543442345, 543761787, 542752800, 541434975, 542034874, 541595650, 541770554, 540862617, 541332970, 541769218, 540560379, 538913574, 534600792, 535537949, 533488503, 534209709, 533979568, 534345894, 536268044, 536123695, 539397125, 540596046, 544031181, 546890488, 550003586, 553711357, 556024132, 560977020, 562394867, 567569542, 570064583, 574291992, 578602562, 582077179, 586782494, 590155678, 595842514, 598967209, 602654457, 605602608, 607851906, 610749588]
1486.1F10749588Q25005L312454J168518L064308J708183L362503L778229K429314
1493.8F30398102M183693J519012K266960K157441K238388M86297M15421J467285P9574
1502.5F45212173K708893K258377L156891o35147j21155O970902R5291K927322J170349
1511.2F63743896J534043q29926Q23441J631012K52838K392197k676392L844299L001175
1519.9F73716583K075196K272567j255417L332520M05426m40063p49131Q66699k79769
1528.6F79944611L128K200927P07398K764511J302872M83932K121430J567459J698456
1537.2F92794724M60052M84161p214431M299392j51748r23157L230820N43289J115875
1545.9F94638977J292343K048187J008301M32205J71738N20477J160813j88599j156845
$$ y = [610749588, 611574593, 614887047, 616055565, 619119873, 620828056, 624190559, 627968788, 630398102, 634581795, 636100807, 638367767, 640525208, 642763596, 643249893, 643665314, 645132599, 645212173, 647921066, 650179443, 653336334, 652701187, 652580032, 659550934, 659646225, 662573547, 663743896, 665277939, 664448013, 665271454, 666902466, 667155304, 669547501, 666871109, 670715408, 673716583, 675791779, 678064346, 676808929, 680141449, 680546875, 680106812, 679357681, 680224380, 679944611, 679947739, 682148666, 682856064, 685620575, 686923447, 687407379, 689528809, 691096268, 692794724, 693254776, 693738937, 686524506, 690823898, 690672150, 689748993, 692979813, 693523102, 694638977, 695931320, 697979507, 698987808, 699420013, 699591751, 700112228, 701273041, 701084442, 699927597]
1554.6F99927597o11114L109359K210770r869080R7428L590774N660630J618194N53284
1563.3G06287842N569j73721O09436L7460J321717J63192l082733N77164J596069P15943
1572.9G08057938O24237J979370O19659k530899k74811J010132L23639m35638k49863
1581.6G09123764k38876R842o32706o26831k88468K03095N9738j14593k15989q84552
1591.2G06394424q79898n95169r3460j390762j664581j332627j398697j184158j366043
1599.9F96489029j159897j140747n56869r23539j241073j162567j975937k172242j451263
1608.6F84704895k408447l505020k112503k349472k296372k415390o37588j013642
1616.3F67966461q021774K55432n05447j664048k269134j148300k498322p179260j264191
$$ y = [699927597, 699316483, 702425842, 704636612, 694767532, 694864960, 698455734, 704116364, 705734558, 706287842, 706293411, 706119690, 706729126, 706766586, 708088303, 708251495, 705168762, 705745926, 707341995, 708057938, 708682175, 710661545, 711281204, 708750305, 708475494, 709485626, 709809265, 709373627, 709123764, 708884888, 708894730, 708262024, 707635193, 707346725, 707549820, 707609558, 707494965, 707278976, 706394424, 705514526, 704919357, 704825897, 703435135, 701770554, 700437927, 699039230, 697855072, 696489029, 695329132, 694188385, 693631516, 692707977, 691466904, 690304337, 688328400, 686156158, 684704895, 682296448, 678791428, 676678925, 674329453, 672033081, 669617691, 668980103, 667966461, 659944687, 660200119, 659694672, 658030624, 655761490, 654613190, 652114868, 644935608, 643671417]
1625F43671417j434021j120910l048554k569275o30913j112175p68547j064720J1788
1633.7F31934090o03867n653191k301635n9548j529464q37517J46293p60307L97034
1642.4F20731888j99013R72061J204682j314392M60853l19176J177636M24690K145195
1651F25284424M294319M229240j0280418Q07877L330307K224006K405510K017327J958885
1659.7F36271477J542396J761055J275444q38241J450805J182328J639175K438736
1667.4F46723175L029861J147690J262131M137878K048340K431488K907868J704330
1675.1F65392761M349J814041J744385J324692J976242J189956L128586L973236J589585
1683.8F82137833j008530L757477L970260K626572J661530J337356N6229O95419J207657
$$ y = [643671417, 642237396, 641116486, 638067932, 635498657, 634867744, 633755569, 632987022, 631922302, 631934090, 631330223, 625677032, 623375397, 623315849, 621786385, 620948868, 621095161, 620334854, 620731888, 620532875, 621504936, 622709618, 621395226, 621856079, 621536903, 622714539, 623139229, 625284424, 629578743, 633807983, 623527565, 624335442, 627665749, 629889755, 632295265, 634312592, 636271477, 637813873, 639574928, 640850372, 640012131, 641462936, 642645264, 644284439, 646723175, 649753036, 650900726, 652162857, 656300735, 658349075, 660780563, 663688431, 665392761, 665397110, 667211151, 668955536, 670280228, 672256470, 673446426, 676575012, 680548248, 682137833, 681129303, 684886780, 688857040, 691483612, 693145142, 694482498, 694538727, 695234146, 696441803]
1692.5F96441803J520996L264542L523483j268005J699752L236237M042129j563949
1700.2G10896988j936874M789047K554703R07897p59506R84268M32282J470261K538299
1708.9G21877365J622696J735001K007293J841889J854095Q77381m18778J696777o48117
1717.6G32445602n063858L221436K684402J913605J465531J282730P25784J268997
1725.3G39944229J474533M60968P89871J103135l23334p98721K213211K721786l465881
1734G44119797m119568M161453L437119J112594J475907M89883p81021K031937P22503
1742.7G52650604r79004l59573J566772Q65174O75125Q19626n59311K608871j35193
1751.3G57153091j572113J420975R00879J170349Q84857q96835j31531J170731R06296
$$ y = [696441803, 697962799, 701227341, 704750824, 703482819, 705182571, 708418808, 712460937, 710896988, 708960114, 713749161, 716303864, 717211761, 716452255, 717436523, 717868805, 719339066, 721877365, 723500061, 725235062, 727242355, 729084244, 730938339, 731815720, 731396942, 733093719, 732445602, 727381744, 730603180, 733287582, 735201187, 736666718, 737949448, 738675232, 739944229, 741418762, 741879730, 742669601, 743772736, 743449402, 742650681, 744863892, 747585678, 744119797, 740000229, 744161682, 747598801, 748711395, 750187302, 750677185, 749896164, 751928101, 752650604, 751671600, 751312027, 752878799, 753743973, 754419098, 755238724, 754679413, 757288284, 757153091, 755580978, 757001953, 757902832, 759073181, 759958038, 759061203, 758929672, 760100403, 761006699]
1760G61006699J443634q21076q81119J282044J9913O67572J220626Q88978j075669
1768.7G63751602M96674K189483K32468j968002r87320K630234R92279j057206R07822
1777.4G67188034M02527N27801k55508l94287Q98819J301346Q12072p36923K71759
1786G70015640P56073K60010o0806P91855O42013N9052q45185j028061J617279P52335
1795.7G72960205K84424J211471J409913N41687j270218M51889p15027p80258N5923
1804.4G74150009l49426N67398Q14285O37360Q73794J539841N17273M74854J53274
1813G79378662m52957Q2855o61774j89285p60956l81393N03082O57959J432114P13348
1822.7G80321655J378937J113586j219940m1122R74426P22275r00498l718261n66330
$$ y = [761006699, 762450333, 761629257, 760748138, 762030182, 762050095, 762717667, 763938293, 764827271, 763751602, 764248276, 766437759, 766670227, 764702225, 763714905, 766345139, 767337418, 766280212, 767188034, 767590561, 768118362, 767862854, 767468567, 768367386, 769668732, 770480804, 769743881, 770015640, 770771713, 771031723, 770970917, 771762772, 772404785, 772463837, 771618652, 770590591, 772207870, 772960205, 773244629, 774456100, 775866013, 776407700, 775137482, 775589371, 774874344, 774094086, 774150009, 773800583, 774367981, 775182266, 775819626, 776693420, 778233261, 778750534, 779225388, 779378662, 778925705, 779008560, 778346786, 778157501, 777396545, 777015152, 777518234, 778176193, 779608307, 780321655, 781700592, 782814178, 781594238, 781553116, 782527542, 783249817, 782349319, 778631058, 778064728]
1831.4G78064728J134033N27725R99298J001969R77783J199264K52762O21872k94571
1840.1G84484863n10254p64923j08566M73709l134384M02756J049347L44009L56064
1848.7G82592621J283493J554642K81219L28980n66025r00727q18710o11496l84750
1857.4G82759247o99616P9499J41906Q25348J075287J151886Q05435L98178N15976
1866.1G87053146o78863l66974j579132j599655J26953K76642L84979J98746R37576
1874.8G84753418P83615R13239O37893N16892M09164p63168p14417r03320k00729m87213
1884.4G84945374o92902J28632P77053K054749P53784o58340M53415R73587J57775
1893.1G88893127l51867m30222r97009k51312m52729Q1864L50570J79291P01065O22940
$$ y = [778064728, 779198761, 779726486, 780725784, 781727753, 782705536, 783904800, 784157562, 784779434, 784484863, 783974609, 783209686, 783101120, 783574829, 780440445, 780843201, 781892548, 782236557, 782592621, 783876114, 785430756, 785711975, 786040955, 785474930, 784574203, 783755493, 783143997, 782759247, 782059631, 782139130, 782281036, 783106384, 784181671, 785333557, 786138992, 786537170, 787053146, 786374283, 786007309, 784428177, 782828522, 782955475, 783232117, 783617096, 783815842, 784753418, 785537033, 786450272, 787088165, 787605057, 788014221, 787251053, 786536636, 785633316, 785432587, 784945374, 784252472, 784381104, 785158157, 787212906, 787966690, 787308350, 787761765, 788735352, 788893127, 788541260, 788111038, 787114029, 786862717, 786409988, 786491852, 786842422, 787021713, 787722778, 788345718]
1902.7G88345718R28269J29776r1171j26420n87158l54461j02005n61905q51136M12751
1912.4G87142258J20315M46930O89545O73294J634140q03757j163559J62735J87912
1921.1G89089813L87802o08673r60388j50757O33469L60107M03824J14594P9345M34800
1930.7G89783936j61133j19095k38648K39182l4790k44751K4033j61057J46484l54004
1940.3G88880157N30701K49634j376114K08740O62155K67334J58158L53927K18506
1949G90153198L5630j25809N4092Q2398j4496J28403j29014P0115k94571q1787J94625
1959.6G90072784K46964O35757J67084L39890l1128K2430k9831p09915m65088j99509
1969.3G90049438K71607k02484P0343K44674K17591O78558L94440O39496J00326q7890
$$ y = [788345718, 789273987, 789403763, 789312592, 789186172, 788599014, 788244553, 788142548, 787580643, 786729507, 787142258, 787262573, 787709503, 788399048, 789072342, 790706482, 789902725, 788739166, 788901901, 789089813, 789477615, 788868942, 787908554, 787757797, 788391266, 788751373, 789155197, 789269791, 789349136, 789783936, 789622803, 789503708, 789265060, 789504242, 789469452, 789224701, 789248734, 789087677, 789234161, 788880157, 789410858, 789660492, 788284378, 788493118, 789155273, 789422607, 789580765, 789934692, 790153198, 790188828, 790063019, 790117111, 790199509, 790185013, 790313416, 790184402, 790254517, 789959946, 789878159, 790072784, 790319748, 790955505, 791122589, 791462479, 791431351, 791453781, 791423950, 790714035, 790248947, 790049438, 790321045, 790118561, 790188904, 790433578, 790651169, 791329727, 791724167, 792363663, 792463989, 792376099]
1978.9G92376099k79313m23049l49350q00705m15497k67639L16543M60129N40390N17349
1988.6G91674957M32968J342240K87018j414032j015549l052k61612q15201o69174
1997.2G89558563l57055M84848N25665P92770P98874N04227L82843o561k16675r87091
2006.9G91480408p75223q59070q58841k82745j74637L69110L90396P01065R26514O07452
2016.5G91524429j92718l04871k34680q85010r41086j212768n60608k58636k41547
2025.2G86692505J54800J24512P37686N95474M13742N4017l42331m12674o30341q41293
2034.9G86546097j232224q00552o52924p400L11584L84140O81229K22931Q32138K58942
2044.5G86543961k29950m27094r87701n52597q70285p42875m20913N1040M69971O33850
$$ y = [792376099, 792096786, 791673737, 791324387, 790523682, 790108185, 789840546, 790157089, 790617218, 791157608, 791674957, 792107925, 793450165, 793737183, 792323151, 791307602, 791304550, 791042938, 790227737, 789558563, 789201508, 789686356, 790212021, 791004791, 791803665, 792307892, 792690735, 792684174, 792467499, 791480408, 790705185, 789846115, 788987274, 788704529, 788529892, 788899002, 789289398, 789990463, 790916977, 791524429, 791331711, 791026840, 790792160, 789907150, 788966064, 787753296, 787192688, 786934052, 786692505, 786847305, 786971817, 787709503, 788304977, 788718719, 788772736, 788430405, 788017731, 787387390, 786546097, 785313873, 784513321, 783860397, 783852997, 784164581, 784548721, 785229950, 785452881, 786285019, 786543961, 786314011, 785886917, 784899216, 784346619, 783476334, 782733459, 782312546, 782363586, 782833557, 783467407]
2054.1G83467407P29676L93371M51889L62702L05252k37809m54406q66089j069107
2062.8G83082886r4147l06778j93863L25623N52826N02472L57894M20456L46985L84369
2072.5G85378723j89514j82190n68848q31070l69186k07748K4185j83029L88565N48629
2082.1G83808517P21894P29828J3427L37754K94037k69928p35932k55966m97131n16510
2091.7G83629990K55966j49689l2959P9651R99832J009140J27793L77655K64282K68554
2101.4G86830215m78134o64367n27878l18680p4463l59039J00632L04565Q05740L76129
2111G85994720K34452P72781L12958O2332m69208l66516o08444n39627n4016l16315
2120.7G85023117l17993m0054P05871O37970O58112N50995K21405K70843j21841l89023
$$ y = [783467407, 784197083, 784590454, 785042343, 785405045, 785710297, 785472488, 785018082, 784151993, 783082886, 782988739, 782681961, 782488098, 782813721, 783366547, 783869019, 784226913, 784647369, 784994354, 785378723, 785189209, 785007019, 784438171, 783607101, 783237915, 783030167, 783054352, 782871323, 783259888, 783808517, 784530411, 785260239, 785273666, 785611420, 785905457, 785635529, 784899597, 784643631, 784146500, 783629990, 783885956, 783736267, 783703308, 783782959, 784782791, 785791931, 785919724, 786297379, 786561661, 786830215, 786352081, 785687714, 785159836, 784841156, 784766693, 784407654, 784508286, 784812851, 785618591, 785994720, 786229172, 787001953, 787314911, 787377243, 786908035, 786541519, 785933075, 785393448, 785339432, 785023117, 784705124, 784665070, 785370941, 786008911, 786667023, 787218018, 787439423, 787710266, 787588425, 787199402]
2130.3G87199402p31506n71518q08869m98047L4943J29089Q00782P09609Q26874O19126
2140G87709885L37600J67771K7771l42179r63440m61349r34219q08182m12903P6752
2149.6G84397507Q57086L30887R43451J081543O93054M73022K48871q0337p66907o89316
2159.3G87488861r97772n89371k04849K13928P21207P37457J073380O70318Q19702
2167.9G89932861P01065L65754j60599o68183p33490j256485l48358O1035K57874N81436
2177.6G88732910O84738J496811J267624Q49991M78363J75018m05883o30341o13403
2186.3G92035828q33435l86582k35748N78079P77283O54907J119995J192627J005631
2194.9G95908585L89862L92532m08554r46655n64347n34210n92499o03561J54648O41174
$$ y = [787199402, 786467896, 785896378, 785087509, 784589462, 784624405, 784753494, 785554276, 786263885, 787090759, 787709885, 788047485, 788215256, 788243027, 787900848, 786937408, 786476059, 785541840, 784733658, 784320755, 784397507, 785254593, 785585480, 786528931, 787610474, 788303528, 788776550, 789025421, 788945084, 788178177, 787488861, 786491089, 785901718, 785696869, 785910797, 786632004, 787369461, 788442841, 789113159, 789932861, 790633926, 790999680, 790839081, 790170898, 789437408, 788180923, 787832565, 787893600, 788151474, 788732910, 789417648, 790914459, 792182083, 793032074, 793510437, 793685455, 793279572, 792649231, 792035828, 791202393, 790815811, 790580063, 791158142, 791935425, 792590332, 793710327, 794902954, 795908585, 796298447, 796690979, 796282425, 795335770, 794771423, 794237213, 793644714, 793041153, 793195801, 793836975]
2204.6G93836975R52377P24106J093140J463776L01055q697q5297k88391q95767r03626
2214.2G96189651l14178k17514J41678M94995J114578J071015R68399N24139J89514
2222.9H00162277M39759N4321j98136r14001o82297m80881k90527N01251M57230P46307
2232.5G99795303Q10013R02634K57950P3089M99039L4943j46180p75451q70056o07453
2242.2G99973831J34888L67050n0354J77612L37754R16061M77982L06320J89743j05896
2251.8H02724991R0942l15475k40708n78003j85775j42136k29645M01306L50495Q42361
2261.5H02718353M66156K48719K38876J31073J67465k24228j90201n63202j61819J17111
2271.1H02948303k06604j76468J24588K59476O95190J495057L96881j44806K08969
$$ y = [793836975, 794789352, 795513458, 796606598, 798070374, 798371429, 798362732, 798277435, 797989044, 797093277, 796189651, 795875473, 795657959, 795799637, 796294632, 797409210, 798480225, 799448624, 799972763, 800162277, 800602036, 800656357, 800458221, 799544220, 798861923, 798381042, 798090515, 798591766, 799048996, 799795303, 800605316, 801507950, 801765900, 801838989, 802338028, 802372971, 802226791, 801451340, 800581284, 799973831, 800108719, 800475769, 800425415, 800603027, 800940781, 801856842, 802334824, 802641144, 802830887, 802724991, 802815933, 802500458, 802259750, 801681747, 801495972, 801353836, 801124191, 801525497, 801875992, 802718353, 803184509, 803433228, 803672104, 803803177, 803970642, 803746414, 803556213, 802993011, 802831192, 802948303, 802741699, 802565231, 802689819, 802949295, 803644485, 805139542, 805536423, 805391617, 805600586]
2279.8H05600586N6610l32794l75900j22681n35965j95465l50418L15552L35540O2485
2289.4H04457550R40704n9204K53601J06202j44577M425o51932l67432o40564r7122
2299.1H03801651p25098p56454j38703K05307Q50907J24664M78592l88946r308j72348
2308.7H03270264j121903l21197j277008m50898j107559m79965K05460o65055O41709
2317.4G98693848J2741Q19320k36435j340484p66831o85730l45077j630707n25131
2326.1G93995514j301880r23004k08206n41916P47223P04193J342621J69525J112747
2334.8G95096817j43509k022018q54721j600876r59702j512146K23313R14230J86768
2343.4G89328156N50079J042251K825852K056427K607574J114960j887741k501678
$$ y = [805600586, 805657196, 805324402, 804948502, 804825821, 804289856, 804094391, 803743973, 804059525, 804395065, 804457550, 805398254, 805339050, 805592651, 805698853, 805554276, 805558701, 804906769, 804539337, 803898773, 803801651, 803076553, 802320099, 802181396, 802386703, 803237610, 803362274, 803840866, 803451920, 803442612, 803270264, 802148361, 801827164, 800550156, 800099258, 798991699, 798511734, 798717194, 798052139, 798693848, 798706589, 799525909, 799289474, 797948990, 797182159, 796496429, 796151352, 794520645, 793995514, 792693634, 791770630, 791562424, 791020508, 791767731, 792471924, 793814545, 793984070, 795096817, 794953308, 792931290, 792076569, 790475693, 789515991, 788003845, 788227158, 789141388, 789328156, 789878235, 790920486, 793746338, 795802765, 798410339, 799525299, 797637558, 795135880]
2351.2G95135880l275757l409577j859207q64105j092453r96552K73590L3493j85241
2359.8G83760071J224975j03836o20041J799622k90680q02460L34549M08554M43650
2368.5G86154404J316757K759781J466980J898422J920624J594848J360932M67148
2376.2G98939896R99298N97000O943n82581J12839P80334L57743P01294Q76312J312484
2385.9H04101562Q94776N19256L30430k95411k26516n57251o74820r68323j052628
2394.6H02071075m68063K44293N03388J64947N32074P15943P99942K94265j86920o1416
2404.2H04609528n73197q52585p21283n23758o43920j88599J82953K40783N67704K25219
2413.8H02322845K46430L8681p7438L5247m49066o30874o01578j071396j156540O1798
$$ y = [795135880, 791860123, 788450546, 786591339, 785727234, 784634781, 783638229, 783911819, 783945312, 783760071, 784985046, 784881210, 784261169, 786060791, 785770111, 784967651, 785302200, 785710754, 786154404, 787471161, 790230942, 791697922, 793596344, 795516968, 797111816, 798472748, 798939896, 799939194, 800536194, 800543137, 799960556, 800073395, 800853729, 801211472, 801912766, 802789078, 804101562, 804996338, 805515594, 805846024, 805550613, 805324097, 804766846, 804092026, 803123703, 802071075, 801603012, 801847305, 802350693, 802515640, 803047714, 803763657, 804563599, 804857864, 804670944, 804609528, 804036331, 803183746, 802462463, 801938705, 801294785, 801106186, 801289139, 801529922, 802097626, 802322845, 802569275, 802607956, 802530518, 802565765, 802116699, 801485825, 800884247, 799812851, 798656311, 798718109]
2423.5G98718109K44522J56174M81796K19650K59247K24915P3547o99386p10450n02777
2433.1G98465347j064529n95093n4932k12326n19943j05743K30331L88489L74832J99356
2442.8G97105789M08554k61993n10025o26145q73260q00400p38220l33633l55683j82953
2452.4G92832031j7013M51812N88379L93372K10495m98734k95868o26907l92532j52512
2462.1G92492523q75702l77731k66418l49503l47061l9902N21927N60226J82877l86429
2471.7G91114807j77460n3863k23084o38580r17206q70514m70428o180j42441L08152
2481.3G87923203L74298L24325M45252K46963N5924m35334o30569q23364m81110l89175
2491G86610413m20685l35617m12979L81317M79965L24478J88980L79105M51355l37525
$$ y = [798718109, 798962631, 799118805, 799600601, 799820251, 800079498, 800304413, 800377960, 799678574, 798968124, 798465347, 797400818, 796805725, 796750793, 796538467, 796018524, 795912781, 796143112, 796531601, 796906433, 797105789, 797514343, 797252350, 796742325, 796116180, 795242920, 794442520, 793704300, 793370667, 793014984, 792832031, 792815018, 793266830, 793855209, 794248581, 794459076, 793960342, 793664474, 793037567, 792645035, 792492523, 791616821, 791239090, 790972672, 790623169, 790276108, 790236206, 790758133, 791318359, 791501236, 791114807, 790937347, 790883484, 790660400, 790021820, 789104614, 788234100, 787763672, 787757492, 787615051, 787923203, 788297501, 788621826, 789067078, 789314041, 789369965, 788934631, 788304062, 787480698, 786999588, 786610413, 786189728, 785854111, 785441132, 785822449, 786302414, 786626892, 786815872, 787194977, 787646332, 787308807]
2500.6G87308807m71954n61981m23203p30438p07016J14594K29339J55411J93863M55246
2510.3G85562668K39029K75879J61361l2196o2179n81742n05828r65729q17795j81198
2519.9G83092270j52359R8953L18985N47867P5455R3383M8523m38537k15683l12042
2529.6G83156815p78580q65479m90722m38690j15967K04925K64664J22909O3706L80783
2539.2G81504364p3776m3946l82690q51593q42056r65348n15213n69610j17264J96915
2548.9G77339783K43759K12555N5084M71268r995j39084n50308q05130n62134q08944
2558.5G75446854n32990m42428l6545J45797K23923J43280R2621J89972m04663l99323
2568.1G74426498n72204l87192l89862m44641k94342r88770m64248J47857K45438M4174
$$ y = [787308807, 786836853, 786274872, 785851669, 785121231, 784414215, 784528809, 784758148, 784913559, 785107422, 785562668, 785801697, 786077576, 786238937, 786206741, 786144562, 785562820, 785056992, 784091263, 783273468, 783092270, 782939911, 783038864, 783357849, 783905716, 783981171, 784074554, 784123077, 783684540, 783468857, 783156815, 782378235, 781512756, 781022034, 780583344, 780467377, 780672302, 780936966, 781059875, 781123581, 781504364, 781430588, 781386642, 781003952, 780152359, 779310303, 778344955, 777829742, 777260132, 777142868, 777339783, 777583542, 777796097, 777851181, 778322449, 778312454, 778173370, 777623062, 776817932, 776255798, 775446854, 774913864, 774471436, 774434891, 774580688, 774804611, 774947891, 775040512, 775230484, 774825821, 774426498, 773854294, 773467102, 773077240, 772632599, 772338257, 771349487, 770885239, 771033096, 771278534, 771322708]
2577.8G71322708R0027L09753J2589P1945l63388m57230n73959m98428l55606n46036
2587.4G69012375p1182k21482j80740J81580N06515K09274k13928j40457l85971r7580
2597.1G68598404l85895m27856k81678l98483n3100j96228j19935R0867K47192l4180
2606.7G67039108k4643j8310l40119j55334k39487l67584j010361n80215l8834m64630
2616.4G63799591n16663n93795J2130j44729r7428M9439k95868l13034m96750k0294
2626G61382599p65305r64203m83322o84662k68020m44489m37469n45426m66385L0671
2635.6G56353989L18527R5672q52661r54742o02264l31421o65818r35897p68281m51354
2645.3G51205750l12043m98581n8975n58395o05164j44119j75858j25579p65763o35528
$$ y = [771322708, 771412735, 771722488, 771735077, 771807022, 771443634, 770986404, 770412445, 769914017, 769558411, 769012375, 768941193, 768719711, 768538971, 768720551, 769227066, 769436340, 769222412, 769081955, 768695984, 768598404, 768212509, 767784653, 767502975, 767104492, 767051392, 766855164, 766735229, 766826096, 767073288, 767039108, 767014465, 766996155, 766656036, 766500702, 766261215, 765893631, 764883270, 764303055, 764264221, 763799591, 763282928, 762689133, 762701263, 762556534, 762459106, 762508545, 762212677, 761899643, 761402893, 761382599, 760617294, 759653091, 759169769, 758485107, 758217087, 757772598, 757335129, 756789703, 756323318, 756353989, 756672516, 756768188, 755915527, 754960785, 754358521, 754027100, 753361282, 752425385, 751657104, 751205750, 750893707, 750395126, 750336151, 749777756, 749172592, 749028473, 748852615, 748727036, 747961273, 747325745]
2654.9G47325745n98603n84106n57099r16900n78308q8959J10245m59442j91422K76718
2664.6G43737869J8769n41993j065597p41043p39517n61448n05218r3002j69907r25751
2674.2G38413162o027K22549j91116l15781j03607J0834n72281o61774p71713n31235
2683.9G35493011m61654n33829n42221n55496K63519N95779J66321m50134n47943l87726
2693.5G33039627l76053o08139j053314p85751l01361l12500r37729n63813N5008k0065
2703.1G28135910L16391k40936o53992k77328k83280p62329p64160m11911r60770r52911
2712.8G23144684n67398l62473J6785j29013l79334j91650l5629k03781j49537o54449
2722.4G20488205j067276n96390m49295o15158q69217l12881M89349K3727m89349j24206
$$ y = [747325745, 746727142, 746143036, 745585937, 744669037, 744090729, 744001770, 744112015, 743652573, 743461151, 743737869, 743756638, 743214645, 742149048, 741408005, 740668488, 740107040, 739601822, 739508820, 739338913, 738413162, 738407135, 738629684, 738438568, 738122787, 738019180, 738030014, 737457733, 736795959, 736024246, 735493011, 735031357, 734497528, 733955307, 733399811, 733663330, 734259109, 734425430, 733975296, 733427353, 733039627, 732663574, 732055435, 731002121, 730216370, 729915009, 729602509, 728664780, 728100967, 728155975, 728135910, 728452301, 728211365, 727557373, 727280045, 726996765, 726234436, 725470276, 725058365, 724097595, 723144684, 722577286, 722214813, 722231598, 722102585, 721723251, 721531601, 721495972, 721292191, 721142654, 720488205, 719420929, 718824539, 718375244, 717760086, 716890869, 716577988, 717067337, 717091064, 716601715, 716477509]
2732.1G16477509J67694j83258r09806q32672j87988m19846l58581m21372o30493j72882
2741.7G12528305l72009j70593J58081k85721k60315J36871k57034n92957k06604m50515
2751.4G10227509m40751l04565l23868O1417k13013p77817m60739M53415K64816k45132
2761G08241272k27966l00598o15006r18884l98636j87225k26593j69068j41296k19345
2770.7G04836655k37732L29208q2703m17480k64511k35367l54309q12683m85764l91235
2780.3G01884079l68576m34647o84356m03138j1367k8992n13763j04599k05536l52402
2789.9F98776703p9498r41697j187667p63016m57840n15824o01043p19681n75714k10343
2799.6F92724380o50100r05762q39233j19095j3733q21076j123428j088409n90058
$$ y = [716477509, 716645203, 716461945, 715552139, 714719467, 714531479, 714111633, 713753052, 713331680, 712701187, 712528305, 712156296, 711985703, 712143784, 711858063, 711597748, 711734619, 711477585, 710884628, 710678024, 710227509, 709786758, 709482193, 709158325, 709219742, 709006729, 708228912, 707768173, 708221588, 708486404, 708241272, 708013306, 707712708, 707097702, 706178818, 705780182, 705592957, 705366364, 705197296, 705056000, 704836655, 704598923, 704928131, 704845428, 704427948, 704163437, 703928070, 703573761, 702761078, 702275314, 701884079, 701515503, 701080856, 700396500, 699993362, 699981995, 699953003, 699439240, 699334641, 699129105, 698776703, 698697205, 697755508, 696567841, 695804825, 695346985, 694831161, 694230118, 693510437, 692934723, 692724380, 692074280, 691168518, 690329285, 690210190, 690196457, 689375381, 688251953, 687163544, 686573486]
2808.3F86573486r33914j106567p75986p73697p16324p70187o37131q44574o92444
2816.9F79322662m79278o54602j108322j260529r64127j516876j368255r19495n40237
2825.6F70510941n88074j145020o09894o60705r64432j048889j056976j310654j798248
2834.3F61328049j383591j267242j153641j254730j156617p32345j186676j310883
2842F51882324j357651j253738j090851j477127j624222j622390j695023j672058j593399
2850.7F38495865j327133j062432j339683j427155j111793q40149r50051j156539j465340
2859.4F27815590k198792j864662j581497j900558j905404j934661j865693k125663
2867.1F12438660k071495k046471k254143k509460k612038k461586l070640l108292
$$ y = [686573486, 685639572, 684533005, 683757019, 682983322, 682266998, 681496811, 680859680, 680015106, 679322662, 678843384, 678188782, 677080460, 675819931, 674855804, 673338928, 671970673, 671051178, 670510941, 669922867, 668777847, 668167953, 667507248, 666542816, 665493927, 664436951, 663126297, 661328049, 659944458, 658677216, 657523575, 656268845, 655112228, 654379883, 653193207, 651882324, 650524673, 649270935, 648180084, 646702957, 645078735, 643456345, 641761322, 640089264, 638495865, 637168732, 636106300, 634766617, 633339462, 632227669, 631387520, 630437469, 629280930, 627815590, 625616798, 623752136, 622170639, 620270081, 618364677, 616430016, 614564323, 612438660, 610367165, 608320694, 606066551, 603557091, 600945053, 598483467, 595412827, 592304535]
2874.8E92304535k967072k589416k158089k647285k344437k096977j806793j550713
2882.5E74143753j946983j932259j855774j424293j257935j588173j184501l96462
2890.2E62557373k78892k49100j40152k52609M7035j59378j45645j28975o03295j22490
2899.9E60523872k57644r89952q05474k11982l42789p35054n42107m39148n72128r35135
2909.5E54692459j192322j213798q15964q06313j430664j654663k140503j983223j564483
2918.2E41890526j860352j714744j318093r56497j452637k306976j597443n05561p88842
2926.9E29389381r70306n93109p54318o59752j81847L54881P51725Q89244J247101
2935.6E29473000J544494J178169J168976J826096J813125K103348K545281K563629
$$ y = [592304535, 589337463, 586748047, 584589958, 581942673, 579598236, 577501259, 575694466, 574143753, 572196770, 570264511, 568408737, 566984444, 565726509, 564138336, 562953835, 562557373, 562278481, 562029381, 561889229, 561636620, 561683655, 561524277, 561378632, 561249657, 560646362, 560523872, 560266228, 559276276, 558470802, 558258820, 557916031, 557180977, 556638870, 556199722, 555627594, 554692459, 553500137, 552286339, 551470375, 550664062, 549233398, 547578735, 545438232, 543455009, 541890526, 540030174, 538315430, 536997337, 536040840, 534588203, 532281227, 530683784, 530178223, 529389381, 528419075, 527825966, 527071648, 526411896, 526230049, 526584930, 527336655, 528225899, 529473000, 531017494, 532195663, 533364639, 535190735, 537003860, 539107208, 541652489, 544216118]
2943.3E44216118K424545J934014K321777L034897K900619K289353K654075K890816
2951E64666214K527161L009948K639923K376748K614555K575073K685471K627067K548027
2959.7E88270187K373314K611351K316552K193107K440567K138329K360763K177391
2967.4F06881561J583329J766738K109185J732559J833343J800652J619148J958275
2975.1F21284790J531067J740150J592179J666107K250824J455421J156502J208458
2982.8F33885498J546021J521873R58786P90024Q54568J245842J237870Q65783O53534
2991.5F43559799J433563J307602O72303R42382P48673R60998M50058j42211R6511
3000.2F50029678J26267N5084n9204J04980j1291K29416N09033L39661L8681r6665
$$ y = [544216118, 546640663, 548574677, 550896454, 553931351, 556831970, 559121323, 561775398, 564666214, 567193375, 570203323, 572843246, 575219994, 577834549, 580409622, 583095093, 585722160, 588270187, 590643501, 593254852, 595571404, 597764511, 600205078, 602343407, 604704170, 606881561, 608464890, 610231628, 612340813, 614073372, 615906715, 617707367, 619326515, 621284790, 622815857, 624556007, 626148186, 627814293, 630065117, 631520538, 632677040, 633885498, 635431519, 636953392, 637912178, 638702202, 639556770, 640802612, 642040482, 642906265, 643559799, 644993362, 646300964, 646973267, 647915649, 648664322, 649625320, 650075378, 649933167, 650029678, 650155945, 650211029, 650151825, 650256805, 650245514, 650474930, 650983963, 651323624, 651362305, 651265640]
3009.8F51265640l90930o61163l06168r42077n88227m49753j407623o94733k26364
3018.5F45598602k87552o24923o21414m76609q73260j268769j469955j150551j162147
3027.2F37663422q07534j303482j364708o56509j358109q91380p16171r02634j044388
3035.9F28618507j552085r64623p13081r61266j509323j696548j335564r99756j195107
3044.5F17691154j695404j266136q54416p87124r55124r41124j157417j678925j607780
3053.2F06747704j616860j413498j431160j664009j281853q45298j136589j360093
3060.9E95998344j076011j062126j137810j505394j346398j929969k556458j457939
3068.6E83926239j175690j162872j057587j069488j261902j122398p84646j365814
$$ y = [651265640, 650874710, 650213547, 649907379, 648965302, 648377075, 647927322, 646519699, 645824966, 645598602, 645311050, 644686127, 644064713, 643588104, 642714844, 641446075, 639976120, 638825569, 637663422, 636855888, 635552406, 634187698, 633531189, 632173080, 631281700, 630565529, 629662895, 628618507, 627066422, 626101799, 625388718, 624427452, 622918129, 621221581, 619886017, 618886261, 617691154, 615995750, 614729614, 613875198, 613088074, 612132950, 611191826, 610034409, 608355484, 606747704, 605130844, 603717346, 602286186, 600622177, 599340324, 598495026, 597358437, 595998344, 594922333, 593860207, 592722397, 591217003, 589870605, 587940636, 585384178, 583926239, 582750549, 581587677, 580530090, 579460602, 578198700, 577076302, 576291656, 574925842]
3076.4E74925842j305465j579972j674690j292267j576538j541557j357041j255912
3084.1E63342400j438904j157379j461831j567955q45756j091118j109238j368637
3091.8E53301582j622314j652985j543274j577758j959000j093254n10597n75905j630020
3100.5E41136475k291909j181526q84552j207466j509857j539498j331253j166572
3108.2E30023842j342430j667671j517678j236572j006355j193009j005325j209107
3115.9E19845695j677284j345672j088257j101341j519700j476554j706047j535607
3123.6E08395233r41353j135864j128120j249123n96046q24089j655808j136551j129646
3132.3D98598633j441307j655922j297836r95408j212387j483154j246529o52923j161080
$$ y = [574925842, 573620377, 572040405, 570365715, 569073448, 567496910, 565955353, 564598312, 563342400, 561903496, 560746117, 559284286, 557716331, 556870575, 555779457, 554670219, 553301582, 551679268, 550026283, 548483009, 546905251, 544946251, 543852997, 543342400, 542766495, 541136475, 538844566, 537663040, 536778488, 535571022, 534061165, 532521667, 531190414, 530023842, 528681412, 527013741, 525496063, 524259491, 523253136, 522060127, 521054802, 519845695, 518168411, 516822739, 515734482, 514633141, 513113441, 511636887, 509930840, 508395233, 507453880, 506318016, 505189896, 503940773, 503344727, 502520638, 500864830, 499728279, 498598633, 497157326, 495501404, 494203568, 493208160, 491995773, 490512619, 489266090, 488613167, 487452087]
3141D87452087j204795r74007j030197j096535j218605p98912j196899j503945j175995
3149.6D77252197j311493j259842p59430r55352j308861j063919j373253j247292o56509
3158.3D67316246m86069r04464j430207j298561j113357q22678j038513j386604j382370
3167D57453423q27942m85268q89702p40356j251717r80911k34680j024285j496391
3175.7D49522171j171913r70993j306687o26258p03545j528053q40531k88582k07290
3184.4D41878319q20008j090698q31527q86536j202507j447258p42302m73328p20749
3193D33663406j047401o40488n07393j261444o96220j57204l00216j064949j155472
3201.7D26832619n40276p67174p42187j089935j206246q78906o94237o09245m83017
$$ y = [487452087, 486247292, 485273285, 484243088, 483146553, 481927948, 481129036, 479932137, 478428192, 477252197, 475940704, 474680862, 473921432, 472966080, 471657219, 470593300, 469220047, 467972755, 467316246, 466830177, 465925713, 464495506, 463196945, 462083588, 461260910, 460222397, 458835793, 457453423, 456625481, 456140213, 455250511, 454510155, 453258438, 452277527, 452042847, 451018562, 449522171, 448350258, 447379265, 446072578, 445446320, 444742775, 443214722, 442374191, 442085609, 441878319, 441058311, 439967613, 439136086, 438249550, 437047043, 435599785, 434857483, 434384155, 433663406, 432616005, 431975517, 431468124, 430206680, 429510460, 429353256, 429053040, 427988091, 426832619, 426292343, 425525169, 424782982, 423693047, 422486801, 421607895, 420913658, 420304413, 419821396]
3210.4D19821396k99873o18668j58005k66189j125985j206550j000328k59819m21334
3219.1D14464645j170578p70301l23639o43883o09474o61469r35936k06680L4790m59366
3228.7D08718109p32269p75223l80783m41933r11255o27174k89574m16336o21147p90787
3238.4D02731628l07731k72675n29480n72777p10449j99165k07939l67050r22585j101685
3248C97540092l03459m24461m15001m62112J68304J77040q15124k71187j99127j19667
3257.7C94875298k44523q79554q68492m85039j57852n09415m30183l48664j01661r54
3267.3C90848961m81033k82441n0201j53046o56166n09643l08838l80402j05705n31044
3276.9C87390442n60417k76909j49002k46239l28560j15661j48087k02866n71060n17959
$$ y = [419821396, 419521523, 418902855, 418744850, 418478661, 417352676, 416146126, 415145798, 414885979, 414464645, 413294067, 412523766, 412200127, 411556244, 410946770, 410285301, 409349365, 409142685, 409177475, 408718109, 407985840, 407210617, 406829834, 406387901, 405476646, 404849472, 404559898, 404143562, 403522415, 402731628, 402423897, 402151222, 401621742, 401048965, 400338516, 400139351, 399931412, 399564362, 398641777, 397540092, 397236633, 396812172, 396397171, 395935059, 396103363, 396280403, 395465279, 395194092, 394994965, 394875298, 394630775, 393751221, 392882729, 392397690, 392239838, 391730423, 391300240, 390951576, 390849915, 390848961, 390367928, 390085487, 390035286, 389882240, 389226074, 388716431, 388407593, 388027191, 387921486, 387390442, 386830025, 386553116, 386404114, 386157875, 385829315, 385713654, 385565567, 385362701, 384791641, 384273682]
3286.6C84273682l67699l14522j58996n18418l88450k78130l50304p7018L9520j48811
3296.2C81710854m53492n44014l24096j72234n47752m69284k16828m24957l07350l38440
3305.9C77912407m24805m19426o87828k59170L29475j53732k47383j39199o25038m15878
3315.5C74869423k23618m50134n04494m97093m43916j87378j89324n08575k40974k18468
3325.2C71405449o07872o04286k76070k96669n38673l17841l51982j7891j60637r09462
3334.8C67324066m18014m57421o46553j64985o14281o88095r0027m95491m26254M1504
3344.4C63364449n04075l60946l46604q91342m52461j28212n80864p34596k43645J0605
3354.1C59132309j43433m69474p34864r47685q54225m16603j23711Q9493n42984m40254
$$ y = [384273682, 383905983, 383591461, 383432465, 382914047, 382525597, 382247467, 381897163, 381820145, 381859665, 381710854, 381257362, 380713348, 380389252, 380217018, 379669266, 379199982, 378983154, 378558197, 378250847, 377912407, 377487602, 377068176, 376380348, 376121178, 376450653, 376296921, 376049538, 375910339, 375285301, 374869423, 374645805, 374195671, 373691177, 373194084, 372750168, 372562790, 372373466, 371864891, 371623917, 371405449, 370797577, 370193291, 369917221, 369620552, 369081879, 368764038, 368412056, 368394165, 368233528, 367324066, 366906052, 366448631, 365802078, 365637093, 365022812, 364334717, 364244690, 363749199, 363322945, 363364449, 362860374, 362499428, 362152824, 361261482, 360809021, 360680809, 360099945, 359365349, 359121704, 359132309, 358988876, 358519402, 357784538, 356836853, 355982628, 355566025, 355442314, 355531807, 354988823, 354548569]
3363.7C54548569M47502l04566r65614n70488m30794l10745l9177o71425p85827k2164
3373.4C50895271m37545p43676l55110n8975j35956l88107l56102j02921k64435p74040
3383C47278404l26042l55949k15264J13030n87921l43438n52864l88145M26712k93427
3392.7C44755096n75828j3809K18620j23482n07049m02184j41983j57738l35273k71111
3402.3C42445259k04925J297m5128k52953l20244k40860Q4534p4120l08799j60714
3412C40923347l49273k64969J02882m72946l35655M89120O21720J41792r48372n44166
3421.6C39363480J85966J71967P6484j6441J56593l30696j44233J08718J13373P6637
3431.2C39761848l25126J46942J65405j15165k82555L86619P70798L4332r9983j07841
$$ y = [354548569, 354996071, 354691505, 353725891, 353155403, 352724609, 352413864, 352374687, 351703262, 350917435, 350895271, 350457726, 349714050, 349358940, 349299965, 349164009, 348775902, 348419800, 348316879, 348052444, 347278404, 346952362, 346596413, 346381149, 346494179, 345906258, 345562820, 345009956, 344621811, 345048523, 344755096, 344179268, 344165459, 344384079, 344260597, 343753548, 343351364, 343209381, 343051643, 342716370, 342445259, 342240334, 342241631, 342196503, 341943550, 341623306, 341382446, 341466980, 341392860, 341084061, 340923347, 340574074, 340309105, 340411987, 339939041, 339603386, 340092506, 340714226, 340856018, 339907646, 339363480, 339549446, 339721413, 339797897, 339781456, 339938049, 339607353, 339463120, 339571838, 339685211, 339761848, 339436722, 339583664, 339749069, 339633904, 339351349, 339737968, 340508766, 340543098, 340443115, 340335274]
3440.9C40335274M57878j48201o27823J40877N31997P1717j142388Q63457J228981
3449.6C41711769J53656M73938j93558J3543K74429K33383J51672k08816r7466M05465
3459.2C42918015R81941K68669J86920L49426J98975M34189J28631J15624J48201J04942
3468.8C45835533K70386P47299N82542L12119K68974l56369j00708N46341Q09250L69263
3478.5C49284630o676M30222J060257L36837n06630J018296J57737j028060K70652
3487.2C51017265M96140O30607Q10280R98345O48498J21269k4909J69258Q84056M16908
3496.8C56167717J01089K36283J69868K16904Q61626J117706M6844K35672O82869J72921
3506.5C60009499M0817J522560R42612q25730O35529L89557N3367M60549O54754O16150
$$ y = [340335274, 340793152, 340644951, 340017128, 340158005, 340690002, 340761719, 339619331, 340482788, 341711769, 341865425, 342339363, 342145805, 342159348, 342433777, 342667160, 342818832, 342610016, 342512550, 342918015, 343899956, 344168625, 344355545, 344704971, 344903946, 345338135, 345466766, 345582390, 345730591, 345835533, 346105919, 346853218, 347435760, 347747879, 348016853, 347660484, 347559776, 348106117, 348915367, 349284630, 349277954, 349708176, 350768433, 351105270, 350598640, 351616936, 351774673, 350746613, 351017265, 351513405, 352144012, 352954292, 353952637, 354601135, 354722404, 354697495, 354866753, 355750809, 356167717, 356268806, 356505089, 356674957, 356891861, 357753487, 358871193, 358918037, 359153709, 359836578, 360009499, 360050316, 361572876, 362515488, 361689758, 362325287, 362714844, 362768211, 363228760, 363883514, 364499664]
3516.1C64499664J38054N19867M10614R97543Q46406M94766L14331n04265O56548N07049
3525.7C68880577N21660J100273R06601P09457M01116L04298M98429J377716N67283
3534.4C75267410L78571L68538N6419J369133N09186l433O61964J062851K82822J81389
3544.1C80134850J330032P78198P60498k82059P70989J286430J055184J222686p98225
3552.7C86258583Q05702O94275J015320J720619O24428J548615O31828K49634L22799
3561.4C93871803J653633J449471P50961L857765L9483j554032L04222M32129L283577
3570.1D04089012J429825R01794J397019J606865P63130M15344J192742Q55789K666282
3578.8D15317802J018181O6071J450233J394501J207428R37347M054528J883201j033897
$$ y = [364499664, 364637718, 365157585, 365568199, 366565742, 367412148, 367906914, 368221245, 367716980, 368373528, 368880577, 369402237, 370502510, 371409111, 372118568, 372519684, 372823982, 373322411, 374700127, 375267410, 375645981, 376014519, 376070938, 377440071, 377949257, 377945824, 378607788, 379670639, 379953461, 380134850, 381464882, 382243080, 383003578, 382721519, 383492508, 384778938, 385834122, 387056808, 386258583, 387064285, 387758560, 388773880, 390494499, 391118927, 392667542, 393299370, 393549004, 393871803, 395525436, 396974907, 397725868, 401583633, 401623116, 400069084, 400373306, 400805435, 404089012, 405518837, 406420631, 407817650, 409424515, 410187645, 410602989, 411795731, 412651520, 415317802, 416335983, 416402054, 417852287, 419246788, 420454216, 421391563, 425446091, 427329292, 426295395]
3587.5D26295395J654587j58692K851639K435265K451210J590080P27310K711868j176719
3596.1D39381943K443313L685532M95567K197380N20897J059189K765846J674195J555099
3604.8D55778961L182869K395897q93631L788643k40288k49939P506714J725617j514817
3613.5D71480026L399353n12619M110756M503479K022J251755j076813J039200L138084
3622.2D87335243K812462K248154J900329K446747L351212O547889k298431r900475
3629.9D94443130N929604M946098N531388K090797j401558K580910L684235K516632
3637.6E20321236n3826J284523K912865L210106J735458L86124K481270M195938N979462
3646.3E42453156j129456j764298O749154q45337m521637q39081O157150N359993M690743
$$ y = [426295395, 427949982, 427791290, 430642929, 433078194, 435529404, 437119484, 437846794, 440558662, 439381943, 441825256, 445510788, 446006355, 448203735, 448724632, 449783821, 452549667, 454223862, 455778961, 458961830, 461357727, 460464096, 464252739, 464012451, 463762512, 471269226, 472994843, 471480026, 474879379, 474366760, 478477516, 482980995, 482983017, 484234772, 483157959, 484197159, 487335243, 490147705, 492395859, 494296188, 496742935, 500094147, 506642036, 504343605, 494443130, 500372734, 505318832, 510850220, 512941017, 511539459, 514120369, 517804604, 520321236, 520267410, 521551933, 524464798, 527674904, 529410362, 529796486, 532277756, 536473694, 542453156, 541323700, 539559402, 546308556, 545463219, 540941582, 540102501, 546259651, 551619644, 556310387]
3655E56310387M014549q284416L181648N871162J456795J086884O05278K679596J146469
3663.6E68068352J731605K765122K063331N170517K470932J30692M00429p194100M176636
3672.3E79783516R729500Q943863m490967j8738327O656265R089432M706268k524109
3680E93155441J085320L864555J795502J415291J176910J770973M648667N495491r283943
3688.7F05124207j428071Q227311p190247J513176O306839R12781K349510P85980M73824
3697.4F17075310K011909J071892L240051K595253o616859j785469N980301K150116
3705.1F25722504L21502J296082M040489M421158p164917M664726L638573j3283196
3712.8F23656921N336686M714050L95126P70760L000564J351700l829880J885949O352844
$$ y = [556310387, 560324936, 552040520, 555222168, 561093330, 562550125, 563637009, 564242287, 566921883, 568068352, 569799957, 572565079, 574628410, 579798927, 582269859, 582400551, 582800980, 575606880, 579783516, 589513016, 598456879, 593965912, 575227585, 581883850, 590973282, 595679550, 593155441, 594240761, 598105316, 599900818, 601316109, 602493019, 604263992, 608912659, 614408150, 605124207, 603696136, 611923447, 604733200, 606246376, 612553215, 613465996, 615815506, 616601486, 617075310, 619087219, 620159111, 623399162, 625994415, 619377556, 617592087, 623572388, 625722504, 626044006, 627340088, 631380577, 635801735, 628636818, 633301544, 636940117, 623656921, 628993607, 633707657, 634102783, 634873543, 637874107, 639225807, 635395927, 637281876, 643634720]
3721.5F43634720l907471l909721O701545J565018j540985k819786J097984M281617
3729.2F45102921J239624O154098k621384o771698R435044Q48770q964920n29862K597504
3737.9F46490097J694183L678055L726425l327636L967361J2171326j2458267j5108338
3745.6F40833206J1466446N894089O400604l682098j0047837J0846253q932572l666915
3753.3F49111176P795486M466400K970047n373840L574371N751038r066696p18079
3761F58509903M526672J040116J099319M044724k992401m184876L735962M978409j17417
3769.7F70640411q695984K729874L714295L53164O56281q4381J671600J373901K885590
3778.4F75244751j384964q034210L680877L332749J216278J617203l262787o20499
$$ y = [643634720, 639727249, 635817528, 642519073, 644084091, 642543106, 639723320, 640821304, 645102921, 646342545, 652496643, 649875259, 643103561, 652538605, 653387375, 644422455, 643892593, 646490097, 648184280, 651862335, 655588760, 652261124, 656228485, 668399811, 655941544, 640833206, 652299652, 658193741, 664594345, 660912247, 650864410, 661710663, 652778091, 649111176, 656906662, 661373062, 664343109, 658969269, 662543640, 668294678, 659227982, 658509903, 663036575, 664076691, 665176010, 669220734, 666228333, 662043457, 665779419, 670757828, 670640411, 661944427, 664674301, 668388596, 668741760, 669398041, 669313660, 670985260, 672359161, 675244751, 673859787, 665825577, 669506454, 672839203, 674055481, 675672684, 672409897, 671789398]
3786.1F71789398J863632J135559Q09937k4796N11857O38656J030731k17971J453933
3794.8F78990936M007340l660202l369446L154221N297088O846466q843078j1427384
3802.5F70995941M208450L591309N902634M968338j1652680l252334N472107K152404
3810.2F82386169J248780J176071K80533K078018N788345l065796j3440246O265182
3817.9F82717056O000977M664230Q43811j9119262L893127O200256J929474K974930
3825.7F90104599q39615m353409J394883K091140L381043J007919q084259M293747
3833.4F88996048O704483o010513J374511Q172760r079818l118744P445526o803894
3841.1F87680359K77405P208862k646561l798141K724075J669998J149445L064880
$$ y = [671789398, 673653030, 674788589, 675598526, 675573730, 676085587, 676724243, 677754974, 677537003, 678990936, 682998276, 679338074, 675968628, 679122849, 684419937, 691266403, 682423325, 670995941, 675204391, 678795700, 684698334, 689666672, 678013992, 674761658, 680233765, 682386169, 683634949, 684811020, 685091553, 687169571, 692957916, 689892120, 676451874, 682717056, 688718033, 693382263, 694226074, 675106812, 678999939, 685200195, 687129669, 690104599, 689264984, 684911575, 686306458, 688397598, 691778641, 692786560, 684702301, 688996048, 695700531, 689690018, 691064529, 699237289, 690157471, 687038727, 694484253, 687680359, 687957764, 695166626, 692520065, 688721924, 691445999, 693115997, 694265442, 697330322]
3848.8F97330322n59997K199554O160584n400162j428757j8219604N085983J1267471
3856.5F96435394j986160k115479K322083L291397L302918n338440R26056P563400
3864.2G04401169p823334n875549N539627O029358N854492j0285645p862548N422439
3871.9F95400009O683426L122330j1805039J692505N300369N44053K819748M533844
3879.7G08291245p208252p989960P211990K088700J955719M106292j4106827K032624
3887.4F96381531M663391K027435N112839j372299q590622J332397L184433j295013
3895.1G01444092J594696J546478K924118J556015r909820N580215J932678m893036
3902.8G01775436M188462l186493p42951m13894P93075K446747k38037N51376J50299
$$ y = [697330322, 696770325, 698969879, 705130463, 699730301, 698301544, 680081940, 685167923, 696435394, 694449234, 692333755, 694655838, 697947235, 701250153, 695911713, 696837769, 704401169, 696577835, 690702286, 696241913, 702271271, 708125763, 697840118, 689977570, 695400009, 702083435, 705205765, 693400726, 695093231, 700393600, 700937653, 703757401, 708291245, 701082993, 693093033, 700305023, 702393723, 704349442, 708455734, 694348907, 696381531, 701044922, 703072357, 708185196, 706812897, 698222275, 699554672, 702739105, 701444092, 703038788, 704585266, 707509384, 709065399, 699155579, 704735794, 706668472, 701775436, 705963898, 702777405, 702034454, 701620560, 702413635, 704860382, 704622345, 705173721, 705324020]
3911.5G05324020O40335R3995n90516K031479K598954l884354k994919N229569o42319
3920.2G07806244m510040K666168K510910J143799l300476l471604J979981K581176
3927.9G07406158J821671j501083R918K945022k895736k100907J630097L94516L12271
3936.6G08021927N112j03379Q0872m07334K223664J676559m061966m19311J524887
3945.2G08541031J095810J351700k136765O73752J84936k482223K108459J137696n59998
3953.9G09914398J04675O82679N70526q91037k38724l03192Q39004k5100j600952J088943
3963.6G10141220P41577L10440L18909n22995l433k46964L27225J044617j55716n49774
3973.2G11405106K55203M40674k19193j057968K38953R38720j98516L61404K65808
$$ y = [705324020, 705964355, 706058350, 705467834, 707499313, 710098267, 706213913, 703218994, 708448563, 707806244, 703296204, 705962372, 708473282, 709617081, 706316605, 702845001, 704824982, 707406158, 709227829, 707726746, 707736664, 710681686, 707785950, 705685043, 707315140, 707709656, 708021927, 708027039, 707923660, 708004532, 707597198, 709820862, 711497421, 707435455, 707016144, 708541031, 709636841, 710988541, 708851776, 709525528, 709710464, 707228241, 709336700, 710474396, 709914398, 710019073, 710701752, 711272278, 710381241, 710142517, 709839325, 710678329, 710653229, 709052277, 710141220, 710882797, 711193237, 711512146, 710989151, 710985718, 710738754, 711065979, 712110596, 711954880, 711405106, 711660309, 712100983, 711881790, 710823822, 711062775, 712001495, 711802979, 712164383, 712430191]
3981.9G12430191n84946K20871Q77457J80206k92740K15607L52402J22223r1324k0218
3991.5G13409729p23419k73438Q04520m67835K80533J303482J13831n01633p77130
4000.2G13168640
$$ y = [712430191, 711845245, 712066116, 712943573, 713123779, 712831039, 713046646, 713399048, 713521271, 713429947, 713409729, 712686310, 712412872, 713217392, 712749557, 713030090, 714333572, 714447403, 713945770, 713168640]
##END=$$ End of the data block
