##TITLE=SAR $$ Begin of the data block
##JCAMP-DX=5.00 $$ ACD/SpecManager v 10.08
##SPECTROMETER/DATA SYSTEM=Alpha
##DATE=12 Mar 2014 10:59:36
##DATA TYPE=INFRARED SPECTRUM
##DATA CLASS=XYDATA
##ORIGIN=
##OWNER=
##NPOINTS=1765
##FIRSTX=399.75695801
##LASTX=3997.56933594
##MAXX=3997.56933594
##MINX=399.75695801
##MAXY=0.80715460
##MINY=0.45193177
##XFACTOR=1.0000000000
##YFACTOR=1.000000000000000e-9
##FIRSTY=0.67724693
##DELTAX=2.03957629
##XUNITS=1/CM
##YUNITS=ARBITRARY UNITS
##XYDATA=(X++(Y..Y))
399.8F77246928j131058P9215O26266m97937q80361L80695O58572p30455j436353J54197
$$ 677246928 676115870 676195085 676821351 676323414 675443053 675823748 676482320 675751865 674315512 674469709
420.2F74469709O73116p92146q88109N53071N35786j080572j089216N98550O56367
$$ 674469709 675142825 674350679 673462570 674015641 674551427 673470855 672381639 672980189 673636556
438.5F73636556p42913o32107O12021K90930r35078n49912Q47459N94496j131057j316250
$$ 673636556 672893643 672261536 672873557 673164487 672229409 671679497 672526956 673121452 671990395 670674145
458.9F70674145J91808K19583j038372q59678M98295J87278j262784p87199O94037
$$ 670674145 670865953 671085536 670047164 669187486 669685781 669873059 668610275 667823076 668517113
477.3F68517113M49896q60036p36177N25594N41627n30481m52042O98209N39184q27849
$$ 668517113 668967009 668106973 667370796 667896390 668438017 667907536 667455494 668153703 668692887 667865038
497.7F67865038r17077M20391O57320o34074q82029M00364N19574j025498j415014
$$ 667865038 666947961 667368352 668025672 667391598 666509569 666909933 667429507 666404009 664988995
516F64988995J53064Q93236l50118r61840K68221P56681o20842j090408L32415Q60393
$$ 664988995 665142059 666035295 665685177 664723337 664991558 665748239 665127397 664036989 664369404 665229797
536.4F65229797n44965j135170K37643Q12114o35803j318932M2677P06256o91474j410126
$$ 665229797 664684832 663549662 663787305 664599419 663963616 662644684 662687361 663393617 662702143 661292017
556.8F61292017L6120R81927j37925q04782M31299R89258m99546j318872o6281O94454
$$ 661292017 661328137 662310064 662172139 661367357 661798656 662787914 662288368 660969496 660903215 661597669
577.2F61597669l75211q20398N05864J100004j56164q10623M38749J224339P9275o97256
$$ 661597669 661222458 660402060 660907924 662007928 661851764 661041141 661479890 662704229 662783504 662086248
597.6F62086248K31386Q54730j34289r00090p7009O17802j57952p68781R6798R78291
$$ 662086248 662317634 663172364 663038075 662137985 662060976 662678778 662520826 661752045 661848843 662827134
618F62827134O12974K13445R23633J700878J193762K96831O25432J510381J287044
$$ 662827134 663440108 663653553 664577186 666278064 667471826 667768657 668394089 669904470 671191514
636.3F71191514M60207O46472J506567J430929M86731K53618R33766R69172N603l50237
$$ 671191514 671651721 672298193 673804760 675235689 675722420 675976038 676909804 677878976 677884579 677534342
656.7F77534342M11570O65843j50203m20809O31988J442909K75731q5950R12190J612425
$$ 677534342 677945912 678611755 678461552 678040743 678672731 680115640 680391371 680305421 681217611 682830036
677.1F82830036Q62002K17080R62019J512885N60105k55227N41031J340807N63502
$$ 682830036 683692038 683909118 684871137 686384022 686944127 686688900 687229931 688570738 689134240
695.5F89134240l25143L73900J330077P61807k11238L21984J349509Q38995j74821
$$ 689134240 688809097 689182997 690513074 691274881 691063643 691385627 692735136 693574131 693399310
713.8F93399310L66867J490175J098812M9591N13613J706779J441241K89738M33206
$$ 693399310 693766177 695256352 696355164 696404755 696918368 698625147 700066388 700356126 700789332
732.2G00789332J462698J280547J41441J17898J123846J192689K52426J67727J147032
$$ 700789332 702252030 703532577 703674018 703791916 704915762 706108451 706360877 706528604 707675636
750.6G07675636J334965L72589J43468J133204J407206L32832j12116Q88705J311004
$$ 707675636 709010601 709383190 709526658 710659862 712067068 712399900 712287784 713176489 714487493
768.9G14487493K03311m62889M39346J115143L52323k20716O13093J338721N44309
$$ 714487493 714690804 714227915 714667261 715782404 716134727 715914011 716527104 717865825 718410134
787.3G18410134l79264K05517J066983M35769n85854j71065O83605J09673j007319
$$ 718410134 718030870 718236387 719303370 719739139 719153285 718982220 719665825 719775498 718768179
805.6G18768179p05123K80798l6001j052797o67751O54936P20203p1645M00007J774967
$$ 718768179 718063056 718343854 718307853 717255056 716587305 717242241 717962444 717890799 718290806 720065773
826G20065773J986861J184225J331091K381921K312421J097322Q75413J833976J866579
$$ 720065773 722052634 723236859 724567950 726949871 729262292 730359614 731235027 733069003 734935582
844.4G34935582P04348M48644J417518J628279P22349M86374J379073J669526O02662
$$ 734935582 735639930 736088574 737506092 739134371 739856720 740343094 741722167 743391693 743994355
862.7G43994355k39014p75k53916j875401k997815k214551q56281j47819O35147J846254
$$ 743994355 743755341 743754566 743500650 741625249 738627434 736412883 735556602 735408783 736043930 737890184
883.1G37890184K266467J200258m4882k4200M96686J13010o35445m93824J87695J94490
$$ 737890184 740156651 741356909 741312027 741287827 741784513 741897523 741262078 740768254 740955949 741150439
903.5G41150439k61486j192O61433L49581p69317j159012o39439o60121j512111j786470
$$ 741150439 740888953 740887761 741549194 741898775 741129458 739970446 739331007 738670886 737158775 735372305
923.9G35372305j090884p80762j353263j512766p03693k16901q08597j330137r43065
$$ 735372305 734281421 733500659 732147396 730634630 729930937 729714036 728905439 727575302 726632237
942.3G26632237p26819j477539k002418j399934q56877j452088k149046j745760j082897
$$ 726632237 725905418 724427879 722425461 721025527 720168650 718716562 716567516 714821756 713738859
960.6G13738859j372099j885116j427651p60853j196027k073645k060831j687765k232373
$$ 713738859 712366760 710481644 709053993 708293140 707097113 705023468 702962637 701274872 699042499
979F99042499l205240l257811k671718k767623l394306l228008k385617k248883k769053
$$ 699042499 695837259 692579448 689907730 687140107 683745801 680517793 678132176 675883293 673114240
997.3F73114240k622545j861333j776815k416909k564072k015412j894117k454638
$$ 673114240 670491695 668630362 666853547 664436638 661872566 659857154 657963037 655508399
1013.7F55508399k632260k187431k114475k633572k753257k117157j626194j753688
$$ 655508399 652876139 650688708 648574233 645940661 643187404 641070247 639444053 637690365
1030F37690365j685023q07106J73985M83156N01811P23481P06077K8014o57141n92470
$$ 637690365 636005342 635198236 635372221 635855377 636357188 637080669 637786746 637814760 637157619 636565149
1050.4F36565149k19286k70307l94344J60396J129687J614630J512945J464307J555741
$$ 636565149 636345863 636075556 635681212 635841608 636971295 638585925 640098870 641563177 643118918
1068.7F43118918J253366O08921L18110N31614O34015L65734K80678O68645R49562
$$ 643118918 644372284 644981205 645299315 645830929 646464944 646830678 647111356 647780001 648729563
1087.1F48729563Q00907P91610J190483J444638J236260J016676J205325J400233J099706
$$ 648729563 649530470 650322080 651512563 652957201 654193461 655210137 656415462 657815695 658915401
1105.4F58915401O85393P46668J100719J211762J125157J199365J276850R98557O44326
$$ 658915401 659600794 660347462 661448181 662659943 663785100 664984465 666261315 667259872 667904198
1123.8F67904198P73370J262129J523733J450837J527488J843571J799524J272917
$$ 667904198 668677568 669939697 671463430 672914267 674441755 676285326 678084850 679357767
1140.1F79357767Q98421Q77261O84321J92344n9306N1379N126l98636o97911m88460
$$ 679357767 680256188 681133449 681817770 682010114 681950808 682002187 682007313 681608677 680910766 680422306
1160.5F80422306k9027L23236Q04901J571536K150357K248227K208829K373278K518475
$$ 680422306 680393279 680716515 681521416 683092952 685243309 687491536 689700365 692073643 694592118
1178.9F94592118K259016J820743J647354J549065J080095M02511N841j80066n34475
$$ 694592118 696851134 698671877 700319231 701868296 702948391 703350902 703356743 703176677 702642202
1197.2G02642202r90390j156986j010657r42349j004398q41319m52876k59877l70204
$$ 702642202 701651812 700494826 699484169 698541820 697537422 696696103 696243227 695983350 695613146
1215.6F95613146l83556j02639Q8572q2195k99453k34068j02281k51055m53591k93792
$$ 695613146 695229590 695126951 695215523 695133328 694833875 694599807 694497526 694246471 693792880 693499088
1236F93499088p689q9705l69608l47138j44243k20418m42564l52383m8816j5915k10344
$$ 693499088 693491399 693401694 693032086 692684948 692540705 692320287 691877723 691525340 691476524 691460609 691250265
1258.4F91250265j12355L04639N04673L75688M09841P35462Q64863O31631N32746P69139
$$ 691250265 691137910 691442549 691947222 692322910 692732751 693468213 694333076 694964707 695497453 696266592
1278.8F96266592Q86797O96898O37889Q90374R38773N52356K66791M34220N84185K89798
$$ 696266592 697153389 697850287 698488176 699378550 700317323 700869679 701136470 701570690 702154875 702444673
1299.2G02444673k2233M3988R8110k42115n89549n25594l41177l91960m00126j3053
$$ 702444673 702422440 702466428 702564538 702322423 701732874 701207280 700866103 700474143 700074017 700060964
1319.6G00060964M14610L57449K8252q3625q2672l27170o56008o04809k34902j0132
$$ 700060964 700475574 700833023 700861275 700777650 700694978 700367808 699711800 699106991 698872089 698861957
1340F98861957k4558J6273J55687Q2850k91407n66602m95016m27783o44266q54492
$$ 698861957 698837399 698853672 699009359 699092209 698800802 698234200 697739184 697311401 696667135 695812643
1360.4F95812643p31230n36084o78659r06765p95305n26667n31196o66321o86705q28147
$$ 695812643 695081413 694545329 693866670 692959905 692164600 691637933 691106737 690440416 689753711 688925564
1380.8F88925564j163661j185477q07524o53028r89318j605570k053082j974345k012550
$$ 688925564 687761903 686576426 685768902 685115874 684126556 682520986 680467904 678493559 676481009
1399.1F76481009k260983k265037k139508k008915k062381k087593j766443j415908
$$ 676481009 674220026 671954989 669815481 667806566 665744185 663656592 661890149 660474241
1415.5F60474241j352668j221299n43893O3777K56241M15742Q55267J200855J148581
$$ 660474241 659121573 657900274 657356381 657420158 657676399 658092141 658947408 660148263 661296844
1433.8F61296844J257837J638830J617074J364946J134634J156748J394391J327157
$$ 661296844 662554681 664193511 665810585 667175531 668310165 669466913 670861304 672188461
1450.1F72188461R60409Q47340J341760J781404J369894J187146J469969J540363J286030
$$ 672188461 673148870 673996210 675337970 677119374 678489268 679676414 681146383 682686746 683972776
1468.5F83972776J429796K024532K029299J440048J098752J006961Q36254M16100L5762
$$ 683972776 685402572 687427104 689456403 690896451 691995203 693002164 693838418 694254518 694290280
1486.8F94290280p9155j30355l97503o99520p87616n61714m63486n39601n33342m23015
$$ 694290280 694211125 694080770 693683267 692983747 692196131 691634417 691170931 690631330 690097988 689674973
1507.2F89674973l14891m23789n46992m62293l70801m09245l49343j33634r3698l52919
$$ 689674973 689360082 688936293 688389301 687927008 687556207 687146962 686797619 686663985 686570287 686217368
1527.6F86217368m66407k95520k97904n45501n89311l70086j64806k10703k62320j25170
$$ 686217368 685750961 685455441 685157537 684612036 684022725 683652639 683487833 683277130 683014810 682889640
1548F82889640n1021k46465n22554n55694n46873r58622j061856j077950j284361j803637
$$ 682889640 682838619 682592154 682069600 681513906 680967033 680008411 678946555 677868605 676584244 674780607
1568.4F74780607k481758k393663k361715l241301l471136l089547l127813l357053
$$ 674780607 672298849 669905186 667543471 664302170 660831034 657741487 654613674 651256621
1584.7F51256621l632069l697574l569245l546715l705859l647506l347993l243983
$$ 651256621 647624552 643926978 640357733 636811018 633105159 629457653 626109660 622865677
1601.1F22865677l339887l246844k980828k867758k858281k678633k558053k537608
$$ 622865677 619525790 616278946 613298118 610430360 607572079 604893446 602335393 599797785
1617.4E99797785j887023j395941j290381r49204o26564m18425n126N34475J059831
$$ 599797785 597910762 596514821 595224440 594275236 593648672 593230247 593225121 593759596 594819427
1635.7E94819427J359403J623332K018631K282262K785682L176511K764821L379345
$$ 594819427 596178830 597802162 599820793 602103055 604888737 608065248 610830069 614209414
1652F14209414M624426L522634L012360L381550L686845L600180L246188L595233L930450
$$ 614209414 618833840 622356474 625368834 628750384 632437229 636037409 639283597 642878830 646809280
1670.4F46809280L354371L522872L919244L232777K660513L135443M434228L866434
$$ 646809280 650163651 653686523 657605767 660838544 663499057 666634500 671068728 674935162
1686.7F74935162K932251L079533L046453L220022L205061L273427M064679L285051
$$ 674935162 677867413 680946946 683993399 687213421 690418482 693691909 697756588 701041639
1703G01041639K574265K734303K600909K266109J841843J762807K355814K347648J615703
$$ 701041639 703615904 706350207 708951116 711217225 713059068 714821875 717177689 719525337 721141040
1721.4G21141040J434803J651883J634360J325786J160979J807451K062679J419723
$$ 721141040 722575843 724227726 725862086 727187872 728348851 730156302 732218981 733638704
1737.7G33638704J427889J814723K026319K032459K107501K674937L066600K585530
$$ 733638704 735066593 736881316 738907635 740940094 743047595 745722532 748789132 751374662
1754G51374662K244890K276957K271771K211869J771450J512945J659214J673997J586258
$$ 751374662 753619552 755896509 758168280 760380149 762151599 763664544 765323758 766997755 768584013
1772.4G68584013J464069J378953J339913J151800J049220J260758J273692Q70347
$$ 768584013 770048082 771427035 772766948 773918748 774967968 776228726 777502418 778372765
1788.7G78372765P84218J255155J296699Q57293P31766J053036J222431R29416O91294
$$ 778372765 779156983 780412138 781708837 782566130 783297896 784350932 785573363 786502779 787194073
1807G87194073Q68976J104057Q73566N71847P05182R26078P09295M11928N18083O88911
$$ 787194073 788063049 789167106 790040672 790612519 791317701 792243779 792953074 793365002 793883085 794571996
1827.4G94571996O24001M56273M83692O72758O16312K75194J85550N36084O56485L61741
$$ 794571996 795195997 795652270 796135962 796808720 797425032 797700226 797885776 798421860 799078345 799440086
1847.8G99440086L35514N42701N04613K36809J72675L89576M51266J92464M0829L11077
$$ 799440086 799775600 800318301 800822914 801059723 801232398 801621974 802073240 802265704 802306533 802617610
1868.2H02617610N53429L29852J06573K04027L40461K13921O6102J68860K96056K22504
$$ 802617610 803171039 803500891 803607464 803811491 804151952 804365873 804431975 804600835 804896891 805119395
1888.6H05119395P8559J10388K44915K06948N8234R5725K49981K07544n067m5538J34469
$$ 805119395 805197954 805308342 805553257 805760205 805818439 805914164 806164145 806371689 806366622 806321084 806455553
1911.1H06455553J71125j8299o9380J25110J95980L5048o4135O7413J69158J7583j30295
$$ 806455553 806626678 806608379 806538999 806664109 806860089 806895137 806831002 806898415 807067573 807085156 806954861
1933.5H06954861J8298J81437j4782k41399r7692J25945K6464j85191j17183P8678
$$ 806954861 806973159 807154596 807139814 806898415 806800723 806926668 806953132 806767941 806650758 806729436
1953.9H06729436R417k11119j57654M9233j9431k37107j72198R4771J08361j58906
$$ 806729436 806738853 806527734 806370080 806419313 806399882 806162775 805990577 806085348 806193709 806034803
1974.3H06034803k37941j0014M8637j72555k51532n5492J1743k03610k74896n9665
$$ 806034803 805796862 805786848 805835485 805662930 805411398 805355906 805367649 805164039 804889143 804829478
1994.7H04829478K4140j68323k66731j09196k98j51336k95758j78695n6505j63913
$$ 804829478 804853618 804685295 804418564 804309368 804309070 804157734 803861976 803683281 803626776 803462863
2015.1H03462863k86400j99199o5982j45734l16679k63751j00672j37091k81632k43902
$$ 803462863 803176463 802977264 802911282 802765548 802448869 802185118 802084446 801947355 801665723 801421821
2035.5H01421821p3969q5414k69830k83003r5248o1810k05696k02953m6313l1591j86383
$$ 801421821 801347852 801262438 800992608 800709605 800614357 800552547 800346851 800143898 800097585 800065994 799879611
2057.9G99879611k39730j12355l0577j25170j93715q6844j252j23262k58446j46747
$$ 799879611 799639881 799527526 799496949 799371779 799178064 799091220 799089968 798966706 798708260 798561513
2078.3G98561513J4723q2255k35021j58369k8551j05262k53081j91689m3332r8705
$$ 798561513 798576236 798493981 798258960 798100591 798072040 797966778 797713697 797522008 797478676 797379971
2098.7G97379971k48075j91867k6524o6936k44618k48849r0838o3658j91569j98483
$$ 797379971 797131896 796940029 796913505 796846569 796601951 796353102 796262264 796198606 796007037 795808554
2119.1G95808554o0737o2943k20120k29359m9114J2398j36375j83046l4273K4855r0659
$$ 795808554 795747817 795684874 795464754 795235395 795186281 795198679 795062304 794879258 794844985 794869840 794779181
2141.5G94779181j39892k4318L8862o2525j39892n7579M1426n067q5354k6106N7757
$$ 794779181 794639289 794614971 794653833 794591308 794451416 794393837 794435263 794430196 794344842 794318736 794376493
2164G94376493n484r8586l5584Q7023N3048n8294l8504N1677M8935j9431k4914N0783
$$ 794376493 794371009 794272423 794236839 794323862 794376910 794318616 794280112 794331789 794380724 794361293 794336379 794387162
2188.4G94387162Q4460L695o4790n961N8234J5199l1292K4736Q9824M0412k9028O140
$$ 794387162 794471622 794475317 794410527 794404566 794462800 794477999 794446707 794471443 794561267 794601679 794572651 794578791
2212.9G94578791M1902l2902r3877l2723L0040O855m4167l7730J9252K742o5267l7074
$$ 794578791 794620693 794587791 794493914 794461191 794491231 794498086 794453919 794416189 794435441 794438183 794372916 794335842
2237.4G94335842L8743O259q6248o9022J8477K384q8155o6102M8161M3452p4447r5963
$$ 794335842 794374585 794380844 794294596 794225574 794244051 794246435 794158280 794092178 794140339 794183791 794109344 794013381
2261.9G94013381j2755M470n5790n6088J9610K3246p4566j17123n4538k8133r1374
$$ 794013381 794000626 794005096 793949306 793893218 793912828 793936074 793861508 793744385 793689847 793661714 793570340
2284.3G93570340j26303n6147M0710K3603p1227p1287j5021k1815m2737j8417K3901
$$ 793570340 793444037 793387890 793428600 793452203 793380976 793309689 793294668 793272853 793230116 793211699 793235600
2306.7G93235600L2008p034n5849p4446m1545L7730J19209J18315L4929k3544k980
$$ 793235600 793267608 793260574 793204725 793130279 793088734 793126464 793245673 793363988 793398917 793375373 793372393
2329.2G93372393n007r3043j22905p2181p093L9637k2232l53158p13110n48839l1472
$$ 793372393 793367386 793274343 793151438 793079257 793072164 793111801 793089569 792736411 792023301 791474462 791442990
2351.6G91442990L16739L73722L41176J19865j78396k77818k51412l29375m72248n00440
$$ 791442990 791759729 792133451 792474627 792594492 792416096 792138278 791886866 791557491 791085243 790584803
2372G90584803m12405m01497m95910n28872m35055l35693l27170k97308j79052j22071
$$ 790584803 790172398 789770901 789274991 788746119 788311064 787975371 787648201 787350893 787171841 787049770
2392.4G87049770j97887k50220k03908j77801k26080k48313j86205j59204k32339k72274
$$ 787049770 786851883 786601663 786397755 786219954 785993874 785745561 785559356 785400152 785167813 784895539
2412.8G84895539k18510k00868k61068k89202k44916k00510k25126k63691k75433l02077
$$ 784895539 784677029 784476161 784215093 783925891 783680975 783480465 783255339 782991648 782716215 782414138
2433.2G82414138l16798k82824k43307k51650k91288k99394k71440k58267k90453l36826
$$ 782414138 782097340 781814516 781571209 781319559 781028271 780728877 780457437 780199170 779908717 779571891
2453.6G79571891l31283k97427k95103l10063l30627l38554l38435l38853l39508l67999
$$ 779571891 779240608 778943181 778648078 778338015 778007388 777668834 777330399 776991546 776652038 776284039
2474G76284039l84867l67940l65972l74019l68178l66509l96133m26650l94523l53157
$$ 776284039 775899172 775531232 775165260 774791241 774423063 774056554 773660421 773233771 772839248 772486091
2494.4G72486091l90232m36723m18961m08173m49598m62234l87013l28064l84092m37498
$$ 772486091 772095859 771659136 771240175 770832002 770382404 769920170 769533157 769205093 768821001 768383503
2514.8G68383503l89576l42488l55542l61085l37422l41177m05490m32968l44336k77698
$$ 768383503 767993927 767651439 767295897 766934812 766597390 766256213 765850723 765417755 765073419 764795721
2535.2G64795721l32952l69668l15130k87652l46005l88860l49045l21329l65913l80635
$$ 764795721 764462769 764093101 763777971 763490319 763144314 762755454 762406409 762085080 761719167 761338532
2555.6G61338532k94685k32995l07441l76701l26157k85744l36111l61383l15189k92301
$$ 761338532 761043847 760810852 760503411 760126710 759800553 759514809 759178698 758817315 758502126 758209825
2576G58209825l40164l86298l61264l27408l53098l85701l48986l01897l35336l74317
$$ 758209825 757869661 757483363 757122099 756794691 756441593 756055892 755706906 755405009 755069673 754695356
2596.4G54695356l63529l67880m02450m14729l89576l56853l62158m01378m08888l79204
$$ 754695356 754331827 753963947 753561497 753146768 752757192 752400339 752038181 751636803 751227915 750848711
2616.8G50848711l75331m01616l93748l56496l60071m11094m37378m29392m27783m13775
$$ 750848711 750473380 750071764 749678016 749321520 748961449 748550355 748112977 747683585 747255802 746842027
2637.1G46842027l93153l97682m09901m17113m39882m47274m08768m15862m74036m43518
$$ 746842027 746448874 746051192 745641291 745224178 744784296 744337022 743928254 743512392 743038356 742594838
2657.5G42594838l52263l56794m29213m43518m15027m14848m26710l83616l03447l20673
$$ 742594838 742242575 741885781 741456568 741013050 740598023 740183175 739756465 739372849 739069402 738748729
2677.9G38748729m36425m88400m30108l90589m24027m07517l20971l02553l73125m08411
$$ 738748729 738312304 737823904 737393796 737003207 736579180 736171663 735850692 735548139 735175014 734766603
2698.3G34766603l77715l59178l75628l72172l20315l01540l53753l84391l32892k78890
$$ 734766603 734388888 734029710 733654082 733281910 732961595 732660055 732306302 731921911 731589019 731310129
2718.7G31310129l09825l53634k92719k14993k62738l44515l42369k87234k58387k77519
$$ 731310129 731000304 730646670 730353951 730138958 729876220 729531705 729189336 728902102 728643715 728366196
2739.1G28366196k74539k23815j74821j79588k47300l07203l09050k92658k71917k48968
$$ 728366196 728091657 727867842 727693021 727513433 727266133 726958930 726649880 726357222 726085305 725836337
2759.5G25836337k65122k97308l18348l17455k95162k81214k82169l21746l73482l88921
$$ 725836337 725571215 725273907 724955559 724638104 724342942 724061728 723779559 723457813 723084331 722695410
2779.9G22695410m00901l80694l08693k95103l84867m64141m49777m10974m52697n15461
$$ 722695410 722294509 721913815 721605122 721310019 720925152 720461011 720011234 719600260 719147563 718632102
2800.3G18632102m96387m90308n34058n14865m98295n72741o48677o33419n61118n63979
$$ 718632102 718135715 717645407 717111349 716596484 716098189 715525448 714876771 714243352 713682234 713118255
2820.7G13118255o55949p17223o98149o87539p65861q47756q64506r30309j185477
$$ 713118255 712462306 711745083 711046934 710359395 709593534 708745778 707881272 706950963 705765486
2839.1G05765486j516104j706660j825392j950085j878858j469016q95500m30226j27435
$$ 705765486 704249382 702542722 700717330 698767245 696888387 695419371 694523871 694093645 693966210
2857.4F93966210K7299l3915k42114m35949n64694o19710n90443n72682o17742o23286
$$ 693966210 693993509 693959594 693717480 693281531 692716837 692097127 691506684 690934002 690316260 689692974
2877.8F89692974n85616n85675o40452p46548q62598q97706q23736p35283p32958p72417
$$ 689692974 689107358 688521683 687881231 687134683 686272085 685374379 684550643 683815360 683082402 682309985
2898.2F82309985p48157p10309p27653p72596q35895r12905j044691j276791j457453
$$ 682309985 681561828 680851519 680123866 679351270 678515375 677602470 676557779 675280988 673823535
2916.6F73823535j414299j176714q22247m19735K7477M22299N23746M66585N30303
$$ 673823535 672409236 671232522 670410275 669990540 670018017 670440316 670964062 671430647 671960950
2934.9F71960950O56247P21693P48992P64549O95884M72605K16544J21832P0035o1154
$$ 671960950 672617197 673338890 674087882 674852431 675548315 676020920 676237464 676359296 676429331 676368177
2955.3F76368177r8109L099J12832J44601R3221L7790K7656Q4281J61350J84894K84433
$$ 676368177 676270068 676273167 676385999 676530600 676623821 676661611 676689267 676773548 676934898 677119792 677404225
2977.8F77404225M64380M77075L54529L10242L16620K86519J77861r239j19210k00808
$$ 677404225 677868605 678345680 678700209 679010451 679327071 679613590 679791451 679782212 679663002 679462194
2998.1F79462194l58641m22537m29571m82142m17828k34127k10524m04894n74172o21915
$$ 679462194 679103553 678681016 678251445 677769303 677351475 677117348 676906824 676501930 675927758 675305843
3018.5F75305843o19173n87463n84900o52075o42121n20706m65095n96762p61807o88136
$$ 675305843 674686670 674099207 673514307 672862232 672220111 671699405 671234310 670637548 669875741 669187605
3038.9F69187605n42879o10947p60138q10385p57814p03990p10547p23004p92027q88824
$$ 669187605 668644726 668033779 667273641 666463256 665705442 665001452 664290905 663567901 662775874 661887050
3059.3F61887050q00193n88476n10872o32584p96854q22544p21574n63026m57108n58018
$$ 661887050 661086857 660498381 659987509 659354925 658558071 657735527 657013953 656450927 655993819 655435801
3079.7F55435801p17342p74503q17955p86781p18236q09789q87453p55847o02603o49035
$$ 655435801 654718459 653943956 653126001 652339220 651620984 650811195 649923742 649167895 648565292 647916257
3100.1F47916257q06033q27015p12216o97672q42273q16286n67555n55396p94888r72509
$$ 647916257 647110224 646283209 645570993 644873321 644031048 643214762 642647207 642091811 641296923 640324414
3120.5F40324414j061738j047790r22441q18968q28683r11534r24707p97570p64966
$$ 640324414 639262676 638214886 637292445 636473477 635644794 634733260 633808553 633010983 632246017
3138.9F32246017r87708j137257j040280r30607q70407q57353r87231j145602j180649
$$ 632246017 631258309 630121052 629080772 628150165 627279758 626422405 625435174 624289572 623108923
3157.2F23108923j155257j098037j021087j020729j087964j127064j112282j106441
$$ 623108923 621953666 620855629 619834542 618813813 617725849 616598785 615486503 614380062
3173.5F14380062j126945j129151j147687j206219j214207j156330j112938j134991
$$ 614380062 613253117 612123966 610976279 609770060 608555853 607399523 606286585 605151594
3189.9F05151594j229465j300395j247644j184285j200736j217067j229226j244128
$$ 605151594 603922129 602621734 601374090 600189805 598989069 597772002 596542776 595298648
3206.2E95298648j254737j258493j218557j193822j215815j217068j217126j248718
$$ 595298648 594043911 592785418 591566861 590373039 589157224 587940156 586723030 585474312
3222.5E85474312j269698j271069j212716j065612r97245j127541j254320j228989
$$ 585474312 584204614 582933545 581720829 580655217 579657972 578530431 577276111 576047122
3238.8E76047122j167476j100421r96530r63747j052618j084924r75549r19521j010954
$$ 576047122 574879646 573779225 572782695 571818948 570766330 569681406 568705857 567786336 566775382
3257.2E66775382j073063j013815r62615r44734q64148p57098p85291r37701j053869
$$ 566775382 565702319 564688504 563725889 562781155 561917007 561159909 560374618 559436917 558383048
3275.5E58383048j081884j031518r80616r80556r95755r80437r02712q97229j049161
$$ 558383048 557301164 556269646 555289030 554308474 553312719 552332282 551429570 550532341 549483180
3293.9E49483180j209199j298726j281142j106203r68873j099110j408100j621008
$$ 549483180 548273981 546975255 545694113 544587910 543619037 542519927 541111827 539490819
3310.2E39490819j635551j576782j550376j560509j600922j628220j641988j760543
$$ 539490819 537855268 536278486 534728110 533167601 531566679 529938459 528296471 526535928
3326.5E26535928j936733j998425j931071j803100j734972j876235k072514k085983
$$ 526535928 524599195 522600770 520669699 518866599 517131627 515255392 513182878 511096895
3342.8E11096895k053559k014160j863301j873851k112508k177149j995563j863837
$$ 511096895 509043336 507029176 505165875 503292024 501179516 499002367 497006804 495142967
3359.1D95142967j908422j930058j725793j553565j743943k069235k100020j887083
$$ 495142967 493234545 491304487 489578694 488025129 486281186 484211951 482111931 480224848
3375.5D80224848j735151j671106j615137j523911j410187j243680j000226j042098
$$ 480224848 478489697 476818591 475203454 473679543 472269356 471025676 470025450 468983352
3391.8D68983352j444101j531333j093328q08984j108318j450331j276552r54181q56042
$$ 468983352 467539251 466007918 464914590 464105606 462997288 461546957 460270405 459316224 458460182
3410.1D58460182q79318r35971r21130p55668o04928n83708n15997l17276j47104j39296
$$ 458460182 457580864 456644893 455723763 454968095 454363167 453779459 453263462 452946186 452799082 452659786
3430.5D52659786j19567J2159n2392k99037k69174K9742K61158L41028L14176L65496
$$ 452659786 452540219 452552378 452499986 452200949 451931775 451961517 452222675 452563703 452877879 453243375
3450.9D53243375N11676N72204O41227P78646P64131P61181J048923J258641J010984
$$ 453243375 453755051 454327255 454968482 455747128 456511259 457272440 458321363 459580004 460590988
3469.3D60590988O14256N91070Q67992J129031J207412J024931R28730J135200J252115
$$ 460590988 461205244 461796314 462664306 463793337 465000749 466025680 466954410 468089610 469341725
3487.6D69341725J181305J192182J296043J380712J336366J321644J464128J373679
$$ 469341725 470523030 471715212 473011255 474391967 475728333 477049977 478514105 479887784
3504D79887784J106828J201272J516253J679837J589030J401484J402081J572936J770407
$$ 479887784 480994612 482195884 483712137 485391974 486981004 488382488 489784569 491357505 493127912
3522.3D93127912J746029J553506J551956J660168J756489J956403K022803J797319
$$ 493127912 494873941 496427447 497979403 499639571 501396060 503352463 505375266 507172585
3538.6E07172585J762032K060115K275229K053201J749873J911402K134502K038777
$$ 507172585 508934617 510994732 513269961 515323162 517073035 518984437 521118939 523157716
3554.9E23157716K045214K247870K172410J885176K195060L003478K925933K326608
$$ 523157716 525202930 527450800 529623210 531508386 533703446 536706924 539632857 541959465
3571.3E41959465K299964K527654K641797K745569K719223K537370K805770L337323
$$ 541959465 544259429 546787083 549428880 552174449 554893672 557431042 560236812 563574135
3587.6E63574135K996147K498686K758324L034413L059388L142058K995313K627611
$$ 563574135 566570282 569068968 571827292 574861705 577921093 581063151 584058464 586686075
3603.9E86686075K709627L247380L356695L159166K925873K753257L554285M097521
$$ 586686075 589395702 592643082 595999777 599158943 602084816 604838073 608392358 612489879
3620.2F12489879K923787J763880K249658M367650M597962K927601K752304K922058
$$ 612489879 615413666 617177546 619427204 623794854 628392816 631320417 634072721 636994779
3636.5F36994779K859891K878904K486646J996458K776622M911840M713357K297640
$$ 636994779 639854670 642733574 645220220 647216678 649993300 654905140 659618497 661916137
3652.8F61916137K359807L647983L225386K470196K214312J779974J914024L108919
$$ 661916137 664275944 667923927 671149313 673619509 675833821 677613795 679527819 682636738
3669.2F82636738K882957K041102L470242L394782J735270J377523J095653J058578
$$ 682636738 685519695 687560797 691031039 694425821 696161091 697538614 698634267 699692845
3685.5F99692845K383888L452420K188325R80199Q67426Q91805J200676J764059J281976
$$ 699692845 702076733 705529153 707717478 708697677 709565103 710456908 711657584 713421643 714703619
3703.8G14703619L06011L09288J395405K178192J060009j9968P7665N12898O88851
$$ 714703619 715009630 715318918 716714323 718892515 719952524 719932556 720010221 720523119 721211970
3722.2G21211970P31230N96463r7751m15743L19302J517594J813829K00689j290977
$$ 721211970 721943200 722539663 722441912 722026169 722345471 723863065 725676894 725877583 724586606
3740.5G24586606k07126J791060O61671k1815J691878J459002k25425k17318P02560
$$ 724586606 724379480 726170540 726832211 726810396 728502274 729961276 729735851 729518533 730221093
3758.9G30221093N42283j43707l4690K90990P21216P66099N3763k88546J63376O57022
$$ 730221093 730763376 730619669 730584979 730875969 731597185 732363284 732417047 732128501 732291877 732948899
3779.3G32948899K84195m1842J98662K16007R6977j09613k57075q3506k35975J31846
$$ 732948899 733233094 733191252 733389914 733605921 733702898 733593285 733336210 733252704 733016729 733148575
3799.7G33148575R56237K47777J94311P72059k26796j091182m58121M72009Q5711M20094
$$ 733148575 734104812 734352589 734546900 735318959 735092163 734000981 733542860 734014869 734100580 734520674
3820.1G34520674J008749m2975m49479l17156k74420j60634j62542L28779P97152L30210
$$ 734520674 735529423 735486448 735036969 734719813 734445393 734284759 734122217 734450996 735248148 735578358
3840.5G35578358M9412k5808p08402j525700j113712J539886K512872k03669j244009
$$ 735578358 735627770 735601962 734893560 733367860 732254148 733794034 736306906 736103237 734859228
3858.8G34859228o94096Q6129J39296l73066J53482O29545J77979k40982o42836k21669
$$ 734859228 734165132 734251261 734390557 734017491 734170973 734800518 734978497 734737515 734094679 733873010
3879.2G33873010J60813J7583M30525l2366m48942K82526J0073r08851p61748j3530
$$ 733873010 734033823 734051406 734481931 734449565 734000623 734283149 734293222 733384371 732622623 732609093
3899.6G32609093N48780P87378L52859l53873m95612m49956m36663l7551L32951O4433
$$ 732609093 733157873 733945251 734298110 733944237 733448625 732998669 732562006 732524455 732857406 732921839
3920G32921839k47836q0824q0049l56257j09852L42548J63198k75016m20034k14159
$$ 732921839 732674003 732593179 732513130 732156873 732047021 732389569 732552767 732277751 731857717 731643558
3940.4G31643558P4982m9174k14338k5451O8903n6744j61707j73390j08361j4127j7762
$$ 731643558 731718540 731669366 731455028 731429577 731498480 731441736 731280029 731106639 730998278 730984151 730966389
3962.9G30966389j17063j60694j26660o3777p034r715q0526q6367J0907K4498p0989
$$ 730966389 730849326 730688632 730561972 730498195 730491161 730481446 730400920 730314553 730325460 730349958 730278969
3985.3G30278969j34826j33932p0273L4988M1842n4657
$$ 730278969 730144143 730010211 729939938 729974926 730016768 729962111
3997.5G29962111
$$ 729962111
##END=$$ End of the data block
