##TITLE=Samsung Recuperado  20 % + LG $$ Begin of the data block
##JCAMP-DX=5.00 $$ ACD/SpecManager v 10.08
##SPECTROMETER/DATA SYSTEM=Alpha
##DATE=02 Dec 2014 10:08:34
##DATA TYPE=INFRARED SPECTRUM
##DATA CLASS=XYDATA
##ORIGIN=
##OWNER=
##NPOINTS=1765
##FIRSTX=399.76428223
##LASTX=3997.64306641
##MAXX=3997.64306641
##MINX=399.76428223
##MAXY=0.84052926
##MINY=0.23508513
##XFACTOR=1.0000000000
##YFACTOR=1.000000000000000e-9
##FIRSTY=0.83818305
##DELTAX=2.03961372
##XUNITS=1/CM
##YUNITS=ARBITRARY UNITS
##XYDATA=(X++(Y..Y))
399.8H38183045j016736p26461l24249N11050R41694N21123K42174P63476R60409K83182
420.2H40338707J90556j96576j066864q05139J07288O34670N78523Q4937l07143k62916
440.6H39296043p7605L338M3034J15395L2723l81589m72188k30134n35071q08358l72529
463H36613059Q3149J18851Q3864p1466l67940l15010m3929K31028M14729L19660J87933
485.4H37253928K04027J09851o7174n0128o9022l32951m82023n51701q15272j168788
505.8H34030747j424074j561999k009034k740324l570437m732311n823970o067216
522.1H06101382n548060n027831m685223m464328m535139m632294m493654m301130
538.5G68413723m008294l404736k413809j101792r0957N94974J399636J898885J780986
$$ y = [838183045, 837166309, 836439848, 836115599, 836626649, 837568343, 838089466, 838331640, 839095116, 840055525, 840338707, 840529263, 840332687, 839265823, 838460684, 838567972, 839202642, 839781165, 839866102, 839558959, 839296043, 839218438, 839221776, 839264810, 839380205, 839412928, 839031339, 838559151, 838329017, 837793946, 836985588, 836613059, 836696208, 836815059, 836898923, 836827457, 836459517, 836144507, 836100578, 836331606, 836746335, 837065995, 837253928, 837457955, 837567806, 837500632, 837450504, 837381482, 837048531, 836566508, 836014807, 835199535, 834030747, 832606673, 831044674, 829035640, 826295316, 822724879, 817992568, 812168598, 806101382, 800553322, 795525491, 790840268, 786375940, 781840801, 777208507, 772714853, 768413723, 764405429, 761000693, 758586884, 757485092, 757394135, 757989109, 759388745, 761287630, 763068616]
556.8G63068616J621247J745820J814663J914442K395153L141761L649830L701509
573.1G83053041L580927L474772L622830L899336L703892L206849K812326K269566
589.4H09623539J446963Q92460Q16465R48011J105845J092852R62913O35862R5725
607.8H17620635l51846o41883q97765j298904j843274j313150P12812K154827J819253
626.2H15960705Q87990M79400L48449Q4996j42514l12209o94156j077294j224161j305043
646.6H13006163j265526j179755j285672j614153k054513k569079l087223l311634
662.9G96638608l213644m234850n514861l917634l378511m035115m269838m276931
679.2G63797224m697502o189287r001374j3956606k4199784m6311677q5133135j24755591
$$ y = [763068616, 764689863, 766435683, 768250346, 770164788, 772559941, 775701702, 779351532, 783053041, 786633968, 790108740, 793731570, 797630906, 801334798, 804541647, 807353973, 809623539, 811070502, 811962962, 812779427, 813727438, 814833283, 815926135, 816889048, 817524910, 817620635, 817268789, 816626906, 815729141, 814430237, 812586963, 811273813, 811986625, 814141452, 815960705, 816848695, 817328095, 817676544, 817761540, 817619026, 817306817, 816612661, 815535367, 814311206, 813006163, 811740637, 810560882, 809275210, 807661057, 805606544, 803037465, 799950242, 796638608, 793424964, 789190114, 783675253, 779757619, 776379108, 772343993, 768074155, 763797224, 759099722, 752910435, 743909061, 729952455, 705752671, 659440994, 574307859, 449552268]
695.5D49552268j26540005p7327118j0600015M1900426P8003377J01959288J09525680
709.8E66473901R6134484O7249298L7393332J7186165O839335J937806m60625j740276
726.1G91013420l058672n110622p951140j1283577j3763070j3923526j2564599j2234390
742.4G11123824j4489233j8485129k2750438k6897192l0700087l2801151l0792535
756.7E34208059k2481620q036375Q866787K3629308L3106625L6358475L4736872L1080604
773F71468735K7537346K4440050K1043062J7040789J3039947R694457P148146N231500
789.3G96644032L722668K577960J896322J512647J177430Q01444M07755J14024K2888
807.7H08877170P3791J25587J09851j967j24395j72376j80424r4533j2994j93476o65367
$$ y = [449552268, 323012263, 245685145, 235085130, 276985556, 354988933, 456948221, 566473901, 662608385, 729857683, 767251015, 784437180, 791276515, 793214321, 792753696, 791013420, 787954748, 782844126, 774892986, 763609409, 749846339, 735922813, 723358214, 711123824, 696634591, 678149462, 655399024, 628501832, 597801745, 565000594, 534208059, 511726439, 503690064, 512556851, 536186159, 569292784, 605651259, 640388131, 671468735, 699006081, 723446131, 744489193, 761529982, 774569929, 784264386, 791412532, 796644032, 800366700, 802944660, 804840982, 806353629, 807531059, 808332503, 808740258, 808854282, 808877170, 808950961, 809076548, 809186399, 809184432, 809060037, 808887661, 808707237, 808612704, 808599710, 808406234, 807740867]
830.1H07740867j345098k219617l135443l724217l742576l053069j745284k45631J067877
848.5G89597809J967848K352833K255142J805782J211167O59346K14220q5533k31922
866.8G99746692m15742o17504o63400o55174o57141p09177q75532j014769j098812
885.2G93039441j224041j425326j761734k225042k961039m431188p056594j1078179
901.5G60876298j6236782k0701170k0882011j4086544j945555J0217845J7672718J9226491
917.8G34141290J6594053J2266635Q104504M858970K555073J060724J32978n78881
934.1G79135346j259684j817167k183378k391815k572596l067136m118502n844295
950.5G55880773q498192j2489795j8051982k4346233k8796077k7524888j8068612k826631
$$ y = [807740867, 806395769, 804176152, 801040709, 797316492, 793573916, 790520847, 788775563, 788529932, 789597809, 791565657, 793918490, 796173632, 797979414, 799190581, 799849927, 800064147, 799978614, 799746692, 799330950, 798713446, 798050046, 797394872, 796737731, 796028554, 795153022, 794138253, 793039441, 791815400, 790390074, 788628340, 786403298, 783442259, 779011071, 771954477, 760876298, 744639516, 723938346, 703056335, 688969791, 687024236, 697242081, 714914799, 734141290, 750735343, 763001978, 771106482, 775965452, 778520525, 779581249, 779714227, 779135346, 777875662, 776058495, 773875117, 771483302, 768910706, 765843570, 761725068, 755880773, 747382581, 734892786, 716840804, 692494571, 663698494, 636173606, 618104994, 615278363]
966.8F15278363J2163759K1972239K5017559K2547543J7239332J1558473O914795L724396
983.1G36416459J568616l60311k154827k790570j213014J862526L643811K146482l98219
1001.4G38720953l60190J344323J830280J081585J39595p51079j652956k736151m270732
1019.8G33345628o503105r388686j1170089p905245J820326J2582183J7123044J4271915
1036.1G44175971Q420944L633499R05156m54664j098931j324058j436293j678645k062619
1054.5G49080360k575755l131688l684521m331350m873872m741251l382147p84099
1070.8G21575677K081812L976226M672587M853785M862785M560173M016816L340066
1087.1G53939927K566874J884222J450598J171589R23812P50125P21395O73413M32193
$$ y = [615278363, 627442122, 649414361, 674431920, 696979463, 714218795, 725777268, 732692063, 736416459, 737985075, 737624764, 735469937, 732679367, 731466353, 733328879, 736972690, 739119172, 738720953, 738360763, 739705086, 741535366, 742616951, 742756546, 742005467, 740352511, 737616360, 733345628, 726842523, 717453837, 706283748, 698378503, 700198829, 712781012, 729904056, 744175971, 752596915, 756230414, 757135570, 756680906, 755581975, 754257917, 752821624, 751142979, 749080360, 746504605, 743372917, 739688396, 735357046, 730483174, 725741923, 722359776, 721575677, 723657489, 727633715, 732306302, 737160087, 742022872, 746583045, 750599861, 753939927, 756506801, 758391023, 759841621, 761013210, 761937022, 762687147, 763408542, 764081955, 764514148]
1105.5G64514148J69814m7863k54810k08318K09153Q30650J409292J646162J467406
1123.8G69735634J077533O90878L61859M8995j75893l33250n78880r23753j318931
1142.2G68584192j912236k976537m829168p348419q774876o727934j517952L537774
1158.5G38034844N566359M684269K876878J443088N11170j51098q51572j969993l640950
1176.9G46502995n107462m831314k159119J363278L441751L256142J609445k13862
1193.2G43861854j364231j686811j427293r41277m63426o3419K92837P20382J202822
1211.5G40131438J503885J509308J305938Q78751K91646k15113n67556q44240r19938
1229.9G43074119p52151o85275p90059o73890k14994K38180M02093L38376L27646M73857
$$ y = [764514148, 764683962, 764636099, 764381289, 764172971, 764382124, 765212774, 766622066, 768268228, 769735634, 770813167, 771504045, 771865904, 771914899, 771739006, 771405756, 770826876, 769903123, 768584192, 766671956, 763695419, 758866251, 751517832, 742742956, 736015022, 734497070, 738034844, 743601203, 748285472, 751162350, 752605438, 753116608, 752965510, 752113938, 750143945, 746502995, 741395533, 736564219, 734405100, 735768378, 739210129, 742466271, 744075716, 743861854, 742497623, 740810812, 739383519, 738442242, 737978816, 737915397, 738208234, 738928616, 740131438, 741635323, 743144631, 744450569, 745329320, 745620966, 745405853, 744838297, 743994057, 743074119, 742321968, 741636693, 740846634, 740172744, 739957750, 740195930, 740598023, 740936399, 741264045, 741737902]
1250.3G41737902N65291M14788J56403L0219O140l9876r3102j22011j51396k68936
1270.7G42235422n67794r04739j106500j186371j256466j355052j418889j523256j696110
1289G31220245j752674j636088j554370j650929j923144k234400k404749k329707k046824
1307.4G13687360j696467j394272j154304p12156j19507K06828J80662r537l56853
1325.8G08631754p12872o96897k13683L66271M34875l17335j640379k524555k622783
1344.1G00704396k394080k037168j631081j250863r95696p17878l11554M5181O0022
1362.5F91471279J12593O22094J251637J766801K477110L505468M472435N305230N596757
1380.8G16581404N095840M323005L725887L062546K611101K535522K142548J130998
$$ y = [741737902, 742303193, 742717981, 742874384, 742904603, 742910743, 742870867, 742777765, 742655754, 742504358, 742235422, 741667628, 740762889, 739656389, 738470018, 737213552, 735858500, 734439611, 732916355, 731220245, 729467571, 727831483, 726277113, 724626184, 722703040, 720468640, 718063891, 715734184, 713687360, 711990893, 710596621, 709442317, 708730161, 708610654, 708817482, 708998144, 708988607, 708631754, 707918882, 707221985, 707008302, 707374573, 707809448, 707492113, 705851734, 703327179, 700704396, 698310316, 696273148, 694642067, 693391204, 692395508, 691677630, 691366076, 691411257, 691471279, 691583872, 692205966, 693457603, 695224404, 697701514, 701206982, 705679417, 710984647, 716581404, 721677244, 726000249, 729726136, 732788682, 735399783, 737935305, 740077853, 741208851]
1397.1G41208851N5194l98993j11103J23083k18868q53598j860321k985358l593087
1415.5G31365800l546536k976179k340198l213346n456328q120418j2200594j5113413
1431.8F78398788j5255034j8019855k0893574j8821955k0325779k5360346l1184376
1446.1E28537869l9243251m2447716k9299229P956892P2554320J07303709N8951795
1460.4F64314389K5734782J6151011R473443M049778K089859L395915N197584L517687
1476.7G33924448P0692l572822p925868j3673008k4884164n1343143p7257812n3241253
1493E02097070J0399342P5672447Q1860066M4045031J9124985J0074973O202519J732230
1509.3G51208663L36289M48525N93543M39585K66075j93894o42777o31511p19428o22332
$$ y = [741208851, 741264045, 740865052, 740753949, 740877032, 740658164, 739804566, 737944245, 734958887, 731365800, 727819264, 724843085, 722502887, 719289541, 713833213, 705712795, 693512201, 678398788, 663143754, 645123899, 624230325, 605408370, 585082591, 559722245, 528537869, 489294618, 446846902, 417547673, 425504565, 498058885, 605362594, 664314389, 690049171, 706200182, 715673625, 719723403, 721813262, 725209177, 730406761, 733924448, 733995140, 730422318, 722496450, 708823442, 683939278, 632596135, 555338323, 502097070, 512496412, 588168859, 670028925, 714073956, 733198941, 743273914, 749476433, 751208663, 751544952, 751993477, 752587020, 753026605, 753292680, 753098786, 752456009, 751824498, 751105070, 750482738]
1529.7G50482738m04358q65877r32872k01702n73993j878500k084553j936018k026380
1548.1G39578485k981007m310488m447699j805365L769338O525934L580212K691210
1564.4G42600620K363920J516640J71721p74681j799941n151391q913398j0466636
1580.7G19546854p313847J892626Q378446O287277J88768n275369j0874033j8069505
1597F94761217k2890687j6938746J640558J9442022K4087250J8163621J0021866M962802
1613.4G33249903K809405J403272M75943L07083j35123r14872k093136l903389n163312
1631.7G26035774p478178j2418031q729935K841770J0349274J1963189J0269999O258965
1648G39092827K548516J286745k59400q63433l78966l23534q02398j126051m90665
$$ y = [750482738, 750078380, 749212503, 748279631, 748077929, 747503936, 745625436, 743540883, 741604865, 739578485, 736597478, 732286990, 727839291, 726033926, 729803264, 736329198, 739909410, 742600620, 744964540, 746481180, 746652901, 745878220, 744078279, 738926888, 730013490, 719546854, 712233007, 714125633, 722504079, 728791356, 728980124, 723704755, 712830722, 694761217, 671870530, 654931784, 656572342, 676014364, 700101614, 718265235, 728287101, 733249903, 736059308, 737462580, 737938523, 738245606, 738110483, 737195611, 735102475, 731199086, 726035774, 718557596, 706139565, 697409630, 700251400, 710600674, 722563863, 732833862, 739092827, 741641343, 742928088, 742668688, 741805255, 741426289, 741102755, 740300357, 739174306, 738683641]
1666.4G38683641J98364M41790P28249J097143J209378J345575J702070J836598J181782
1684.7G48424590M89831N75065N72562N71073O34908N96583O40392N08428M65632M39047
1705.1G53918111Q1003p8142J28150L71814L31581n13256j218915p96795m52578l97861
1725.5G51373112k49326O795J70648l70085r65595m96269k84970l76284k71260j31131
1745.9G48405635o7174l32952n42223j19269L00050M40240O14285O82593O49809P85590
1766.3G50816584Q75055O99997J86503j19865J76609N49614O75381M86850J26303j22250
1786.7G54350781j02341l38912j138925j539827j409411j441240j633943j632928j276136
1805.1G43837118p63833l64185k10941n1319K57730M60565N23031P20561R91523J078129
$$ y = [738683641, 738882005, 739323795, 740052044, 741149187, 742358565, 743704140, 745406210, 747242808, 748424590, 748914421, 749489486, 750062048, 750633121, 751268029, 751864612, 752505004, 753013432, 753479064, 753918111, 753999114, 753920972, 754049122, 754420936, 754752517, 754239261, 753020346, 752223551, 751770973, 751373112, 751123786, 751130581, 751301229, 750931144, 749965549, 749469280, 749184310, 748808026, 748536766, 748405635, 748338461, 748005509, 747463286, 747344017, 747644067, 748084307, 748698592, 749381185, 750030994, 750816584, 751691639, 752391636, 752578139, 752458274, 752634883, 753184497, 753859878, 754346728, 754473031, 754350781, 754248440, 753909528, 752770603, 751230776, 749821365, 748380125, 746746182, 745113254, 743837118, 743073285, 742709100, 742498159, 742446840, 742704570, 743165135, 743688166, 744408727, 745400250, 746478379]
1825.5G46478379J071989J008332Q36551Q55029R33051Q27014P65205Q17001O28710
1843.8G54221261K16007M1604m6730j64867k94029m58360o56188r36687j204729j271665
1864.2G49445617j298129j687348j983106j603067j081288o79910l12806k9802J88470
1882.6G40958631M07457O19173P14183O74904P05897P95246Q39054R11832R80020R82880
1903G48589277R92000R72748P97332N38051M42683M91321L49641M3512j19746k90454
1923.4G52806365m54366m99248n90682p68781j011372j281857j474619j542091j682461
1941.7G43500888j831829j646161j246810p78318k86579J09434M14431O88970Q60870
1960.1G39784896Q95203R27031R59098R04858Q69989Q99494R10699Q95262Q24154O79016
$$ y = [746478379, 747550368, 748558700, 749395251, 750250280, 751183331, 752010345, 752775550, 753592551, 754221261, 754437268, 754478872, 754432142, 754267275, 753973246, 753514886, 752858698, 751922011, 750717282, 749445617, 748147488, 746460140, 744477034, 742873967, 741792679, 741112769, 740799963, 740770161, 740958631, 741366088, 741985261, 742699444, 743374348, 744080245, 744875491, 745714545, 746626377, 747606397, 748589277, 749581277, 750554025, 751351357, 751889408, 752332091, 752823412, 753173053, 753216565, 753096819, 752806365, 752351999, 751852751, 751262069, 750493288, 749481916, 748200059, 746725440, 745183349, 743500888, 741669059, 740022898, 738776088, 737997770, 737711191, 737820625, 738235056, 738924026, 739784896, 740680099, 741607130, 742566228, 743471086, 744341075, 745240569, 746151268, 747046530, 747870684, 748549700]
1980.5G48549700N30660M43757N08606P04467Q31008P64787O38307N65171M69625L60131
2000.9G54366219K69711K05994J60336J10448R9003J07109P1824L3259K9266L6359
2021.3G55489528M4167L3677J7404J5676L6538P0274O3717K4081K8848M7565J7225
2043.7G55888700K802J8358L1114M1425K0921O080J5795l576k1339L934J9372k3186
2068.2G56000400q0645p7367o914N1975M7684K7835L099k4795o616K0027j609k8492
2092.7G55924582j4126r656k7060j8657O617K2053l516l2962r179K3306O914l1054
2117.1G55837262m8936l9935J8597O0499K1874k0265K38M1783L2067k3424n3942m7923
2141.6G55777895o8306o9380j5676k683j5139r54J6749K1339o736o5028r5666p3790
$$ y = [748549700, 749080360, 749524117, 750032723, 750737190, 751568198, 752332985, 752971292, 753536463, 754006088, 754366219, 754635930, 754841924, 755002260, 755112708, 755211711, 755318820, 755390644, 755423903, 755453169, 755489528, 755533695, 755567372, 755584776, 755600452, 755636990, 755707264, 755770981, 755795062, 755823910, 755871475, 755888700, 755891502, 755909860, 755940974, 755982399, 756003320, 756009400, 756025195, 756021619, 756000280, 756004214, 756023586, 756000400, 755919755, 755842388, 755835474, 755887449, 755935133, 755962968, 755966067, 755941272, 755934656, 755954683, 755953074, 755924582, 755910456, 755900800, 755873740, 755855083, 755861700, 755883753, 755880237, 755847275, 755838096, 755861402, 755868316, 755837262, 755788326, 755748391, 755766988, 755827487, 755849361, 755829096, 755829334, 755871117, 755903184, 755879760, 755825818, 755777895, 755709589, 755640209, 755624533, 755621850, 755606711, 755605757, 755622506, 755643845, 755637109, 755572081, 755476415, 755402625]
2166.1G55402625n2512o6042j04070j52170k19703l19064m12941m50253l41773q0228
2186.5G53203869J50263K37644K20716J60098J07825O0797l2187j57893k40683k71082
2206.9G53439367k91825l02791l08335l76582n51343q62360j398146k416849m498601
2225.2G42432535q470655j4773071k1754384k4843692j9727529p089257P271111J7268121
2241.6F70313179K0576954J8683136J4470994J0088027O520390M050613K506316J591086
2257.9G48800695J146555R00030O43313M72188M12643L67105K93553K22921K04802
2276.2G53463805J87337J14799N3763M0770q405q6128j04308q7202q6725q5592o6280
2298.7G53335834o2228j21236k36153l40581m01735m44889m01021k18212m7147K6404
$$ y = [755402625, 755350113, 755284071, 755180001, 755027831, 754808128, 754489064, 754076123, 753625870, 753284097, 753203869, 753354132, 753591776, 753812492, 753972590, 754080415, 754141212, 754109025, 753951132, 753710449, 753439367, 753147542, 752844751, 752536416, 752159834, 751608491, 750746131, 749347985, 746931136, 742432535, 733961880, 719188809, 697434425, 672590733, 652863204, 645773947, 653045058, 670313179, 690890133, 709573269, 724044263, 734132290, 740652680, 744703293, 747209609, 748800695, 749947250, 750847280, 751490593, 751962781, 752375424, 752742529, 753036082, 753259003, 753463805, 753651142, 753765941, 753819704, 753860474, 753852069, 753765941, 753661633, 753574431, 753487706, 753402114, 753335834, 753273606, 753152370, 752916217, 752575636, 752173901, 751729012, 751327991, 751109779, 751062632, 751089036]
2319.1G51089036N8890P5400K6941j86384m54366n75662o37173p20799o30498k25306
2339.5G47820079J95444L68476O48975R70423Q01921K41042k72096m70876m96626l63469
2359.9G49443293j08362J72794M42922N86927O17683N89967N28097M98772M79638L90172
2380.2G53641903K68042K26439K40027J96457J05203K1517l2366l3974K3126O7175
2400.6G54723549L5763K6345P8440Q6546K5034k3842K682M8637N9784O3240N2274J6987
2425.1G55195439n484p748l0637m9770j2636J8000R716O139K206k1756n6744m7803
2449.6G54998922n96Q107J3768M9114N8949L6240M530j1563j9431l5048m5001m6015
2474.1G55011976o9618j14322r7990m6611n2869r9600j13845r4056r1672j01983j00553
$$ y = [751089036, 751147926, 751223326, 751250267, 751063883, 750609517, 750033855, 749396682, 748675883, 748045385, 747820079, 748015523, 748383999, 749032974, 750003397, 750805318, 751046360, 750774264, 750303388, 749806762, 749443293, 749334931, 749507725, 749950647, 750537574, 751155257, 751745224, 752273321, 752772093, 753251731, 753641903, 753909945, 754136384, 754376411, 754572868, 754678071, 754699588, 754667222, 754633248, 754656374, 754723549, 754759312, 754785657, 754864097, 754950643, 754975677, 754951835, 754954517, 755003154, 755062938, 755126178, 755178452, 755195439, 755189955, 755182207, 755151570, 755101800, 755089164, 755107164, 755116880, 755123019, 755125225, 755103469, 755046725, 754998922, 754998326, 755006433, 755020201, 755069315, 755128264, 755164504, 755169034, 755157471, 755138040, 755102992, 755057991, 755011976, 754942358, 754828036, 754730046, 754683435, 754630566, 754530966, 754417121, 754323065, 754231393, 754129410, 754028857]
2496.5G54028857q4579n9486l6060p1764j54198j69635j31785j03057o0379j6749k7538
2518.9G53113627n7756n007J15454J69635J08480M7505N5194N9545L6478L040m2558
2541.4G53603637p7128q7321q6665n9247J6928P8439Q3089O1333J2756j5080K8729
2563.8G53559470N6565J7345k8253n6147r4235j53542j96993j73867n0843J15633J76490
2586.2G53171623J26838L7969q4699j76966k28584l12388l63767k85506j15752M9114
2606.6G51817882J30773J46329J54555J40488P8738j4603r8646j47224k14099l48568
2627G51645625m33267l64065k51233j40310J7882J68085K27630J77264R7871N7101
2647.4G51202583L7670K5034J7524p093l6239n6863j01626j03951q0883j31250j35362
$$ y = [754028857, 753944278, 753884792, 753848732, 753776968, 753622770, 753453135, 753321350, 753218293, 753157914, 753141165, 753113627, 753055871, 753050864, 753166318, 753335953, 753444433, 753491938, 753547132, 753606677, 753643155, 753646195, 753603637, 753526509, 753439188, 753352523, 753293276, 753310204, 753388643, 753471732, 753533065, 753545821, 753530741, 753559470, 753616035, 753633380, 753605127, 753548980, 753454745, 753301203, 753104210, 752930343, 752879500, 752995133, 753171623, 753298461, 753336430, 753251731, 753074765, 752846181, 752533793, 752170026, 751884520, 751768768, 751817882, 751948655, 752094984, 752249539, 752390027, 752468765, 752454162, 752355516, 752208292, 751994193, 751645625, 751212358, 750848293, 750597060, 750456750, 750474632, 750642717, 750870347, 751047611, 751145482, 751202583, 751240253, 751265287, 751282811, 751275718, 751239479, 751182616, 751080990, 750977039, 750896156, 750764906, 750629544]
2669.9G50629544m6909N365K9981P4506J00374Q3208M0710K4259M3333L4213j729K027
2694.3G51018882L6597M8697L3319K444m9174q4877l3200M7744L0040n3048o3002L338
2718.8G50937760K5332n007l4928m5121j6689J7047J6033K5571P7188Q6784L6836J1742
2743.3G51132548J6332k6703j00434j15395q9109j16288j92702k13921j84596k01404
2763.7G49908328k53081k80857l07858l72589m58837n22375n45144n44727m89175m01914
2784.1G45731771l84748m20034m47571n04077n61714n53429n48542o02901o70671p35283
2804.5G40302801q10027q58903r26137j149833j487553j805186k178729k777338l679514
2822.8G24629581m899800o398201q138120r939492j1465251j2593568j3492584j4325738
$$ y = [750629544, 750582635, 750588000, 750617981, 750692487, 750792861, 750876069, 750916779, 750941038, 750984371, 751018584, 751016855, 751018882, 751055479, 751104176, 751137495, 751139939, 751090765, 751005888, 750972688, 751020432, 751050472, 750997424, 750934422, 750937760, 750963092, 750958085, 750923157, 750878036, 750861347, 750878394, 750894427, 750919998, 750997186, 751083970, 751120806, 751132548, 751148880, 751122177, 751021743, 750906348, 750817239, 750700951, 750508249, 750294328, 750109732, 749908328, 749655247, 749374390, 749066532, 748693943, 748235106, 747712731, 747167587, 746622860, 746133685, 745731771, 745347023, 744926989, 744479418, 743975341, 743413627, 742860198, 742311656, 741708755, 741038084, 740302801, 739492774, 738633871, 737707734, 736557901, 735070348, 733265162, 731086433, 728309095, 724629581, 719729781, 713331580, 705193460, 695253968, 683788717, 671195149, 657702565, 643376827]
2839.1F43376827j5070021j5657842j5748859j3635814p293999J287401O956518Q299708
2855.5E92513919Q066893Q037269Q052647P692575O803155N451441L819346K113521
2871.8F42550766M16458j390517l220856m838824o233811p369400q146405q631706
2888.1F03135705q930862r123921r328962r605944j0058403j0822296j1891544j3163090
2904.4E20210683j4642298j6614884j9316077k1585375k0200879j4020621o895632
2918.7D06934917k194583O79045K935946M762769O161422P199943Q101433R116114
2935D43697006J0299354J1619926J2980103J4135033J4834732J5010834J4850437J4618040
2951.3E52045465J4489769J4541686J4635444J4447212J3693273J2257338J0332524
$$ y = [643376827, 628306806, 612648964, 596900105, 583264291, 575970292, 577257693, 584214211, 592513919, 600580812, 608618081, 616670728, 624363303, 631166458, 636617899, 640437245, 642550766, 642967224, 641576707, 638355851, 633517027, 627283216, 619913816, 611767411, 603135705, 594204843, 585080922, 575751960, 566146016, 556087613, 545265317, 533373773, 520210683, 505568385, 488953501, 469637424, 448052049, 427851170, 413830549, 406934917, 404740334, 405419379, 408355325, 413118094, 419279516, 426479459, 434580892, 443697006, 453996360, 465616286, 478596389, 492731422, 507566154, 522576988, 537427425, 552045465, 566535234, 581076920, 595712364, 610159576, 623852849, 636110187, 646442711]
2965.6F46442711Q342803O516993M851341L431916K432108K049208K253354K502918
2981.9F78823352K332151J830458J195312L54409r43422l082156o122053q926868r471298
3000.3F55989885o556570j332104L401577N574107M857779J827955k929211r180486
3016.6F51652932j6516864k3153007k5698126k1194934r836078M660964J7182648K3958027
3032.9F01055562K4437309K1012008J6507208J2322307Q600295N075991J446843k240658
3049.2F88216865n588174q317470j0233283j0610342q270204k978027L606319Q754671
3065.5F54580355J0550022R304941O749391M059255J370371j481295l838480l712236
3081.9F77582324K30670O287574J0978699J2205601J0406852P231593L997981J381755
$$ y = [646442711, 654785514, 661302507, 666153848, 669585764, 672017872, 674067080, 676320434, 678823352, 681155503, 682985961, 684181273, 684535682, 683592260, 680510104, 674388051, 665461183, 655989885, 649433315, 648101211, 651502788, 657076895, 661934674, 663762629, 660833418, 651652932, 635136068, 611983061, 586284935, 565090001, 555253923, 559914887, 577097535, 601055562, 625492871, 646504879, 663012087, 675334394, 683934689, 689010680, 690457523, 688216865, 682628691, 674311221, 664077938, 653467596, 645197392, 642219365, 645825684, 654580355, 665130377, 674435318, 681184709, 685243964, 686614335, 685133040, 681294560, 677582324, 677812994, 684100568, 695079267, 707284868, 717691720, 724923313, 728921294, 730303049]
3098.2G30303049l55422r37760q7440J713514L375173M158020M068255L473759K643943
3116.5G48355091J822412J195967P75575N70238M80354L67284K71618K22623J79708
3134.9G54240870J76609J78814Q4639J072J7465K4616L9876J15573M9412j74224k79724
3157.3G54474998k66850k15829n007K81811M02331L48449K04802N1200m053J669m8220
3179.8G55225301q5831k2411K3901Q404n1498j11997n1975M3571M6014l635k1756k146
3204.2G54995942L3796N6267M9829M0174m17k1399N9844J39296J21772R3222O1035
3226.7G55629361r656L397J00315R8228j6868n0247J0133K0027j6510p4685j34945
3249.1G55558550j20937l4154j0014j50859k67088k17438k28643l53933l81589l31700
$$ y = [730303049, 729947627, 729009867, 728922427, 730635941, 734011114, 738169134, 742237389, 745711148, 748355091, 750177503, 751373470, 752149045, 752719283, 753199637, 753566921, 753838539, 754061162, 754240870, 754417479, 754596293, 754680932, 754682004, 754699469, 754724085, 754763961, 754879534, 754928946, 754754722, 754474998, 754208148, 753992319, 753987312, 754269123, 754671454, 755019903, 755224705, 755275905, 755271852, 755273521, 755225301, 755139470, 755117059, 755140960, 755149364, 755097866, 754985869, 754933894, 754977465, 755023479, 755019844, 754998088, 754995942, 755029738, 755086005, 755135834, 755176008, 755175591, 755154192, 755214036, 755353332, 755475104, 755568326, 755629361, 755619705, 755623102, 755723417, 755821645, 755804777, 755754530, 755764663, 755784690, 755768180, 755693495, 755558550, 755437613, 755403459, 755393445, 755242586, 754975498, 754758060, 754529417, 754175484, 753793895, 753462195]
3269.5G53462195l86953n60880p19070q71241j102030j305342j434982j603067j830757
3287.8G43647873k181291k766311l354907l301978k027989L97682K973616M504502
3304.2G37891197M641533L783226K648652J837015J364350R81808O31034M20451L30925
3322.5G54530191K94030K58804J59323P8439L9936M4643J03474M8697o7055n6207J5020
3345G55449295P1466R7394K6047q6605j03534m1127K7359J5378q2791p8380K503p0631
3369.4G55226374k21670k14756q4281j9073o1035j29640j36316r8825m1842O7770R1613
3391.9G54378319j2458n2630M5716J14262Q703o5267k1339p272O855n96l7015L4869
3416.3G54392147J40429P7366n2094o3121k3902J0789M4942O6280J08600N0902j44661
$$ y = [753462195, 753075242, 752514362, 751795292, 750924051, 749822021, 748516679, 747081697, 745478630, 743647873, 741466582, 738700271, 735345364, 732043386, 730015397, 730413079, 733386695, 737891197, 742532730, 746315956, 748964608, 750801623, 752165973, 753147781, 753778815, 754199266, 754530191, 754824221, 755083025, 755242348, 755320787, 755360723, 755405366, 755508840, 755557537, 755490482, 755434275, 755449295, 755520761, 755618155, 755644202, 755557597, 755454063, 755412936, 755440295, 755455673, 755372882, 755294502, 755297005, 755226374, 755004704, 754789948, 754705667, 754686594, 754625559, 754495919, 754359603, 754260778, 754218936, 754286706, 754378319, 754365861, 754313231, 754358947, 754473209, 754481912, 754416645, 754395306, 754388034, 754394889, 754394293, 754357278, 754392147, 754532576, 754609942, 754557848, 754494727, 754470825, 754481614, 754526556, 754592836, 754701436, 754752338, 754607677]
3438.8G54607677k00867p1943N8413P1108j8180p3015q6665o5208j6630M352m4406
3461.2G54164636j37806p3850P5400p391k22206k53380j03473O5028R6143j20223k96414
3483.6G53186464k06530j69396k39611j82152j23202j71721j58132q4757j51933l27110
3504G51371920l78013l35335l02255k20418j86325k66790k63393j61528j38700j67311
3524.4G48951852k44915m27306m84228k99811j24157r3758o8545R5844K84910K16127
3544.8G47806013m0889r358J50680J03355J08957K29299L32535M64081O73533O46293
3565.2G50464499M2975l25322n3466J88649K77758K41935J59621K88964N90384N80072
3585.6G52456069r4771m63188n3763J06632o1452j27733j85847k55943r4473N7280
$$ y = [754607677, 754406810, 754334867, 754393280, 754464388, 754446208, 754373193, 754286528, 754221320, 754204690, 754209042, 754164636, 754026830, 753952980, 754028380, 754020989, 753798783, 753545403, 753441930, 753506958, 753603101, 753482878, 753186464, 752979934, 752810538, 752570927, 752388775, 752265573, 752093852, 751935720, 751850963, 751699030, 751371920, 750993907, 750658572, 750356317, 750135899, 749949574, 749682784, 749419391, 749257863, 749119163, 748951852, 748706937, 748279631, 747795403, 747495592, 747371435, 747277677, 747209132, 747304976, 747589886, 747806013, 747765124, 747755766, 747906446, 748009801, 748118758, 748348057, 748680592, 749144673, 749818206, 750464499, 750507474, 750182152, 750128686, 750317335, 750595093, 750837028, 750996649, 751285613, 751875997, 752456069, 752361298, 751898110, 751844347, 751950979, 751889527, 751761794, 751575947, 751320004, 751225531, 751282811]
3606G51282811k06411m35173l97980m45188m21047o94513j058877n62369K28941N41091
3626.4G47831285k23100j034260o20782l92557n02049n60761n78165l85821J48237
3644.8G43682027N07772j26124q56161k05159L81351K94923L59774N12004N48482Q65161
3665.2G45964050J242101R94862O34849R85562Q16942K07543L24726N79238Q23558
3683.5G52573431J129984J069963L06487k75492j23143J55806L39508L30091k027j27911
3703.9G55376697K85387O16014L76105k79605l36051K4020J35660J20938Q7857J1087
3724.3G56418109o5744J17719M73082N93424J74046m74215l06427L55541L88027k83361
3744.7G57390201k04503J76847l89040o43253m5240J52826j82867l42369j00732Q5175
$$ y = [751282811, 751076400, 750641227, 750243247, 749798059, 749377012, 748682499, 747623622, 747061253, 747290194, 747831285, 747608185, 746573925, 745953143, 745560586, 745058537, 744497776, 743919611, 743533790, 743682027, 744189799, 744063675, 743207514, 743002355, 743383706, 743678629, 744038403, 744550407, 745098889, 745964050, 747206151, 748201013, 748835862, 749821424, 750638366, 750845909, 751170635, 751749873, 752573431, 753703415, 754773378, 755079865, 754804373, 754681230, 754837036, 755176544, 755506635, 755504608, 755376697, 755662084, 756278098, 756654203, 756374598, 756038547, 756062567, 756198227, 756319165, 756407022, 756418109, 756352365, 756470084, 756943166, 757536590, 757710636, 757236421, 756929994, 757285535, 757673562, 757390201, 757185698, 757362545, 756973505, 756330252, 756285012, 756437838, 756254971, 755912602, 755811870, 755897045]
3765.1G55897045J78099J6391l10957k74837k1220J88947J06931j36793j59144j45555
3785.5G55338907j37567r9540j4782J52767J13129M4167k3245l78967j44720K8134
3805.9G54878283l87967j96695L13520K88010p8023J35184M8577n99384k41697J14918
3826.3G54274726L2008R4533J52647K32995K19464j9968j89960l98218m41373N8592
3846.7G54015446P31170R23157j79291j296878l98219L65854N19037J99377j44481
3865G54735172J10268L7372l22043l36111k84255N2035J08362r7990J19268r8109l93867
3887.5G53630102r1672j9372J0848K83659L37958J31905k96950p44522o40690j91808
3907.9G52409458P3254K31684K79665P4505j70767j76489n4598j35422k62022p4804
$$ y = [755897045, 756075144, 756091535, 755780578, 755505741, 755484521, 755673468, 755780399, 755643606, 755484462, 755338907, 755201340, 755101800, 755087018, 755239785, 755352914, 755397081, 755373836, 754994869, 754850149, 754878283, 754490316, 754293621, 754607141, 754895151, 754817128, 754952312, 755000889, 754401505, 754159808, 754274726, 754306734, 754401267, 754553914, 754786909, 755006373, 754986405, 754796445, 754398227, 753956854, 754015446, 754746616, 755669773, 755490482, 754193604, 753795385, 754161239, 754680276, 754879653, 754735172, 754845440, 754882812, 754560769, 754224658, 753940403, 753992438, 754100800, 754002810, 754122078, 754023969, 753630102, 753538430, 753519058, 753529906, 753813565, 754151523, 754283428, 753986478, 753241956, 752601266, 752409458, 752482712, 752714396, 752994061, 753068566, 752897799, 752721310, 752666712, 752531290, 752269268, 752194464]
3928.3G52194464N8234j09911j85847r0242O5744K15233L9041r1792J54376O3360k96294
3950.7G52016366k73049k7359L5286r5904j45912q9765j39772k92540k08616L7431
3971.1G50816166P4864o199j35303j11401J25707P9095j72496r4056P7546p1526l02970
3993.5G50279427m05372l46064
3997.6G49527991
$$ y = [752194464, 752252698, 752142787, 751956940, 751866698, 751932442, 752147675, 752186716, 752094924, 752249300, 752312660, 752016366, 751743317, 751715958, 751751244, 751655340, 751509428, 751419663, 751279891, 750987351, 750778735, 750816166, 750891030, 750884831, 750749528, 750638127, 750763834, 750842929, 750670433, 750576377, 750653923, 750582397, 750279427, 749874055, 749527991]
##END=$$ End of the data block
