##TITLE=$$ Begin of the data block
##JCAMP-DX=5.00 $$ ACD/SpecManager v 10.08
##SPECTROMETER/DATA SYSTEM=Varian
##DATE=20 Nov 2012 15:00:30
##DATA TYPE=INFRARED SPECTRUM
##DATA CLASS=XYDATA
##ORIGIN=
##OWNER=
##NPOINTS=3735
##FIRSTX=399.26403809
##LASTX=4000.35498047
##MAXX=4000.35498047
##MINX=399.26403809
##MAXY=82.66402435
##MINY=42.57699585
##XFACTOR=1.0000000000
##YFACTOR=0.000000100000000
##FIRSTY=66.15193176
##DELTAX=0.96440572
##XUNITS=1/CM
##YUNITS=TRANSMITTANCE
##XYDATA=(X++(Y..Y))
399.3F61519318K3344268J704102j8035202r157028m799576j731415J773911j531144
407F53087234J769562L019257R734115L408814r413223K32162J938858K185974Q4839
415.7F66047592q895569R35135N779724k6239013K550277J4603577M201736p69119
423.4F58214340Q621826J9837m865875J807022n99976n291367p829818k418213K981109
432.1F50638885L495255R09576j645355J335755M49829J967544K574692k776260o213913
440.7F50736008K23236Q604278j070251m065247k55050P08847L075943J036224P27387
449.4F59721375K370452J929932J48010M691315L768845l871842l817367l412323j693802
458.1F59834595M306640k782974p608719R76563Q50677l923111K374649K556458l62320
$$ y = [661519318, 684863586, 686567688, 668532486, 659375458, 654575882, 652844467, 654618378, 653087234, 654856796, 657876053, 667610168, 671018982, 661605759, 661837921, 663776779, 665962753, 666047592, 657152023, 658087158, 663866882, 637627869, 640178146, 654781723, 658983459, 658214340, 666836166, 666856003, 661990128, 663797150, 663197174, 657905807, 650075989, 647657776, 650638885, 654134140, 655043716, 653398361, 654734116, 655183945, 657151489, 659726181, 656949921, 650736008, 650959244, 659563522, 658493271, 654428024, 654172974, 654881821, 657957764, 658993988, 659721375, 662091827, 664021759, 664169769, 668861084, 672629929, 668758087, 664940720, 661528397, 659834595, 664141235, 661358261, 653749542, 654726105, 655576782, 651653671, 654028320, 656584778, 656222458]
466.8F56222458J596298K504120P91473l080291k890931o680450m853668J842956J048355
475.5F46500320K1515m594726l332863J353035j771736P73163O818428N313568J100998
484.1F52181702N19333J108322m323654q738022m130936J600761N98641k623787j457520
492.8F34734840K380143J521415J209793K312928K59475N49393J233521n48401j526108
501.5F42126999k95029k828178n173073j517143j530075k657624K091065R07821m314765
510.2F26809998k324563L552247L01208k202873L23448n71594m336701m841537j661682
518.9F15047951k928124l133430j006088M12101O45943J419983J817856o89774K109833
527.5F13696251J718788k19116p59125l924942l125458j623497L66478K236328J676941
$$ y = [656222458, 657818756, 660322876, 661114349, 658034058, 655143127, 648462677, 643609009, 645451965, 646500320, 646521835, 641927109, 638594246, 639947281, 638175545, 638948708, 645767136, 651080704, 652181702, 652701035, 653809357, 649485703, 640747681, 636616745, 638217506, 638816147, 636192360, 634734840, 637114983, 638636398, 639846191, 642159119, 642418594, 642967987, 644201508, 643653107, 642126999, 641831970, 639003792, 633830719, 632313576, 630783501, 628125877, 630216942, 631124763, 626809998, 624485435, 628037682, 628338890, 626136017, 626459465, 625887871, 621551170, 616709633, 615047951, 612119827, 608986397, 607980309, 608392410, 609038353, 610458336, 612276192, 611586418, 613696251, 615415039, 615195923, 614436798, 610511856, 607386398, 605762901, 606129379, 608365707, 610042648]
536.2F10042648J621247K302513L241043L830299M607125L809166J648292J229057
543.9F32331390J196709j717148m122772k151260J139183L3493k130280k87514J023331
552.6F25315132J271629P64122P6333L84674j99471j238632k877884l014717l375321
561.3F17105865m143676j349907j278000k741890k659340j784286o72379n51262J69640
570F02094765j222878j520195k740326k706146p84607j401100n23720l68843O25687
578.6E91452637l57437J272583N246887M860000M804421K282677K840766L164444K486344
587.3F18053322K885246N12924j712188j606560M21791l30048k72369P33375P55349
596F19440842J779861J188240O96297J48659P77397Q55827O86493M80270k300872j754265
$$ y = [610042648, 611663895, 613966408, 617207451, 621037750, 625644875, 629454041, 631102333, 632331390, 633528099, 631810951, 627688179, 625536919, 626676102, 626709595, 624579315, 624291801, 625315132, 626586761, 627350883, 627427216, 627811890, 627612419, 626373787, 623495903, 620481186, 617105865, 612962189, 611612282, 610334282, 607592392, 604933052, 603148766, 602476387, 601925125, 602094765, 600871887, 599351692, 596611366, 593905220, 593120613, 591719513, 591195793, 590826950, 591452637, 591095200, 592367783, 597614670, 602474670, 607279091, 609561768, 612402534, 615566978, 618053322, 620938568, 621451492, 619739304, 618132744, 618554535, 618224487, 617952118, 618685493, 619440842, 621220703, 622408943, 623105240, 623253899, 624031296, 624887123, 625573616, 626053886, 623753014, 621998749]
605.6F21998749q0681m95186k298126j760483O51093K26669K109070K925987J176529
614.3F24453621R79996K125587K199059l37334j138687J85737Q83255o17523k22053
623F28511658K056884J616021J646309K625694K609215J554718K015838K833329Q62503
631.7F46332169j077881p91779j25656j449203k00577J329727n54886J99966J576233
640.4F45238113K374955K065048P68890K404480K379379J425171J570282q08258k570114
649F54847946j599502n77393l71551J94473o23551L3341K132873K493897K071991J535187
658.7F60137711K749786J959915M044l50418j914521j479797l39584J463546J174775
667.4F63405457o062546Q87909J055603K180938K915650J965408J831360P21130P98264
$$ y = [621998749, 621918068, 621422882, 619124756, 617364273, 618015366, 618242035, 620351105, 623277092, 624453621, 625433617, 627559204, 629758263, 629420929, 628282242, 628467979, 629351234, 628733711, 628511658, 630568542, 632184563, 633830872, 636456566, 639065781, 640620499, 642636337, 645469666, 646332169, 645254288, 644462509, 644336853, 642887650, 642687073, 644016800, 643461914, 643661880, 645238113, 647613068, 649678116, 650447006, 652851486, 655230865, 656656036, 658226318, 657418060, 654847946, 653248444, 652671051, 652299500, 652493973, 651870422, 651903763, 654036636, 656530533, 658602524, 660137711, 662887497, 664847412, 664851456, 664501038, 662586517, 661106720, 660767136, 662230682, 663405457, 657342911, 658230820, 659286423, 661467361, 664383011, 666348419, 668179779, 668900909, 669699173]
676.1F69699173N20554k44141r34525n55343p00150j597824N3864P66601P35932M47387
685.7F68191528J134186K544251J935958R40781J12228N24216l59344j369705j830063
694.4F71824036l198777k740936k179718j115875r766R3765P44019Q15277O18897j98059
704F64652863J69525M30526j535186k352372j800384j564026j748123o95114L01208
712.7F55858917Q43277J954575J856003L127060L705596K363511L170623K958146J039962
721.4F76877670P29981J80893L92608Q22144L81317N81436P53708J416473K525025
730.1F84661255L544159L878937L091201K477265K396316K120896p4158j560745j013413
738.7F99521713q42361j664887j579666J49460P34711O0730P27234J802749J131592
$$ y = [669699173, 670219727, 669975586, 669041061, 668485718, 667785568, 666187744, 666241608, 667008209, 667744141, 668191528, 669325714, 671869965, 673805923, 674746704, 674858932, 675383148, 675023804, 673654099, 671824036, 668625259, 665884323, 663704605, 662588730, 662578964, 662672729, 663416748, 664232025, 664850922, 664652863, 664822388, 665252914, 663717728, 661365356, 659564972, 658000946, 656252823, 655557709, 655858917, 656702194, 658656769, 660512772, 663639832, 667345428, 669708939, 672879562, 675837708, 676877670, 677607651, 677788544, 678181152, 679003296, 679384613, 679966049, 680719757, 682136230, 684661255, 688205414, 692084351, 695175552, 697652817, 700049133, 702170029, 702095871, 700535126, 699521713, 698679352, 697014465, 695434799, 695584259, 696318970, 696379700, 697106934, 698909683, 700041275]
747.4G00041275J226349L63541k186280j240844q21839l082580m598160m027024k278442
756.1F83395996j926803k433930j006164N81970R02023J773834P75452L4943O02340
764.8F82699661p50961o60400m98581p85981J47248O71005R46960R39255J808396L318634
774.4F87835236M437179M998093N659561M870453K525558L000336K857132J425018
782.1G17608566j58615n47333L41034n04226K3422J582413L527832L387298J810990
790.8G27071381J771469J938858K947082J965409J407470R83582k73972k55432m97818
799.5G37058029j23596j80435l18985K42615J971206L074188K392045K548980L626633
808.2G50290680K977981N78080M80804j86767j188736k011719k257233j267166j540451
$$ y = [700041275, 701267624, 701631165, 699444885, 698204041, 697382202, 694299622, 689701462, 685674438, 683395996, 681469193, 679035263, 678029099, 678611069, 679513092, 681286926, 682062378, 682097321, 682699661, 681948700, 681288300, 680789719, 680003738, 680150986, 680821991, 681768951, 682708206, 684516602, 687835236, 692272415, 697270508, 702930069, 707800522, 710326080, 713326416, 716183548, 717608566, 717449951, 716902618, 717243652, 716739426, 716762848, 718345261, 721873093, 725260391, 727071381, 728842850, 730781708, 733728790, 735694199, 737101669, 738085251, 737811279, 737555847, 737058029, 736934433, 736753998, 736435013, 736677628, 738648834, 741723022, 744115067, 746664047, 750290680, 753268661, 753846741, 754327545, 754140778, 752952042, 750940323, 748683090, 747415924, 745875473]
816.9G45875473k3880O39038J794510J839294Q76236K532502J641082J172104n13763
825.5G55832596k000199k353973k706375j970291l769226l075485j726456j350632
833.3G36879959p40890j68763J719208J068878q01086j198197m10537j774903k768325
841.9G31805344j954575k874298k495499j755600k068786j733246o21796q98437k94495
850.6G17108612J533127P19299N08652p53403k420349j853561j904984k854614l756561
859.3G06326218k955246j550980n04913Q01315K722473L379898L382721N019455N327301
868G21948242N881500M288331J484756J968613J507034J619186J413575J45568O3935
876.7G40320740P59735J232681J472092J211548R83886J583405r0866p31430r9030
$$ y = [745875473, 745851593, 746490631, 748285141, 750124435, 751000671, 753533173, 755174255, 756346359, 755832596, 753832397, 751478424, 748772049, 746801758, 743032532, 739957047, 738230591, 736879959, 736139069, 735970306, 737689514, 738758392, 737957306, 736759109, 736348572, 734573669, 731805344, 729850769, 726976471, 724480972, 722725372, 720656586, 718923340, 718301544, 717403107, 717108612, 718641739, 719361038, 719869690, 719116287, 716695938, 714842377, 712937393, 710082779, 706326218, 703370972, 701819992, 701315079, 702116394, 704838867, 708218765, 711601486, 716620941, 721948242, 727829742, 732118073, 733602829, 735571442, 737078476, 738697662, 740111237, 740256805, 740320740, 741080475, 742313156, 743785248, 744996796, 745980682, 747564087, 747473221, 746741791, 746642761]
885.3G46642761q20923k699127m811325l796234k872849k860870k274551j450424o33011
894G24423447l73307M71650Q41369J80741k60010p71332j849670k580109l108368k736740
903.7G14237671k206879l348236l723678l128281k009049j297531j365127j149216
911.4F96009674j038742j177444j503525k565689m765625n008087m242630m746476
919.1F70961456m326629l200226k378388j616821q21915k96478J69373K14996K95105
927.8F59000473K49329Q44879J685638L38059o69556o22711l94516K60544J92260K93580
937.4F61177979P31124K146378L663025L303757K495651K376327K230378K47802j396866
946.1F76975555j745910l172455l683853l725434m252777m195480l488007l354263
$$ y = [746642761, 745821838, 743122711, 738311386, 734515152, 731642303, 728781433, 726506882, 725056458, 724423447, 724050140, 724521790, 725363159, 725543900, 725283890, 724512558, 722662888, 720082779, 716974411, 714237671, 712030792, 708682556, 704958878, 701830597, 699821548, 698524017, 697158890, 696009674, 694970932, 693793488, 692289963, 689724274, 684958649, 679950562, 675707932, 670961456, 666634827, 663434601, 661056213, 659439392, 658617477, 658320999, 658490372, 658705368, 659000473, 659249802, 660094681, 661780319, 662118378, 661448822, 660826111, 660431595, 660692139, 660884399, 661177979, 661909103, 664055481, 667718506, 671022263, 673517914, 675894241, 678124619, 678372421, 676975555, 675229645, 672057190, 668373337, 664647903, 660395126, 656199646, 652711639, 649357376]
953.8F49357376l789673l475418l160591m016724m266548m540596n685119o278534
961.5F14144173p605629p198067o319504p061538p315102o838837o174850o866684
969.2E58763962o652756p095756o925087o349411p161828p620811q434486p534028
976.9E00989799p766036p609559p466812o837768n513954n922432m706574m832687
984.7D50333977k957917k068634k360305j996613k538071r51004j300048j747590k219810
993.3D32193985p81822J72348l60222K9182p75489L22685J37367O83975Q70896J376953
1003D33869858J330757k96326N75104j125488p97615q90694j191444o94580j935540
1011.7D28844032j208038j236954J28136l14789r2811k14119j35499J618538n6152
$$ y = [649357376, 645567703, 642092285, 638931694, 634914970, 630648422, 626107826, 620422707, 614144173, 606538544, 599340477, 593020973, 585959435, 578644333, 571805496, 565630646, 558763962, 552111206, 545015450, 538090363, 531740952, 524579124, 516958313, 508523827, 500989799, 493223763, 485614204, 478147392, 471309624, 465795670, 459873238, 455166664, 450333977, 447376060, 445307426, 442947121, 440950508, 438412437, 437461433, 436161385, 434413795, 432193985, 431412163, 431584511, 431224289, 431253471, 430477982, 430800667, 430938034, 431622009, 432492905, 433869858, 435200615, 434904289, 435479393, 434353905, 433556290, 432665596, 431474152, 430779572, 428844032, 427635994, 426399040, 426527176, 426212387, 426119576, 425905457, 425769958, 427388496, 427332344]
1020.3D27332344N69992k07291P67518J772041J255455J236610J97068K179756J274070
1029D36377563K008782K502594J895523J864014J121711K382355J406288J897393N73921
1037.7D52030144K27890J27907j294861j77193q26759Q51059P24411J014557N84106
1046.4D53261261M16069J970177R17930K640496R64660R65653J796379J901512K607307
1055.1D67441444J251488K674446K840882M485015L722191L700562N253219M212456
1062.8D95581703M715729M455032N288773K996979J890525J308747j270752k611199
1070.5E12355537n907211o524887p040558n492096l843879l478241k418404l005371
1078.2D74644890p04498o61507R08508Q18939N31617J489105n3330J841088J510162
$$ y = [427332344, 427902336, 427695045, 428462563, 430234604, 431490059, 432726669, 432923737, 435103493, 436377563, 438386345, 440888939, 442784462, 444648476, 445770187, 448152542, 449558830, 451456223, 452030144, 452258034, 452385941, 451091080, 450913887, 450087128, 450938187, 451662598, 452677155, 453261261, 453677330, 455647507, 456565437, 459205933, 460170593, 461136246, 462932625, 464834137, 467441444, 468692932, 471367378, 474208260, 478693275, 482415466, 486116028, 491369247, 495581703, 500297432, 504752464, 510041237, 513038216, 514928741, 516237488, 514966736, 512355537, 506448326, 499923439, 492882881, 487390785, 483546906, 480068665, 477650261, 474644890, 473940392, 473278885, 474187393, 475006332, 475537949, 477027054, 476973724, 478814812, 480324974]
1086.9D80324974K002525K517968K643013K618560K603722M137268L394089L836632
1094.6E04078751K367401J874847K398796K043076P27501r52568J95388r8686J160393
1103.3E13794899J60599o76193O59980P47147K404594J679001K671166K555885J528625
1112E25525703J819611K036858K457542P56531J129417R09844J266975J653900O01502
1120.6E38157883R24987J401368K196502J548005K284011J845856K15569M68559J946258
1129.3E50988998K722779J217880J318207J206779J719322J285363R43336O91414p59277
1138E61334801K56271j636619j833725j933327l861199l274803l721771m002228n631370
1146.7E35696030l634034k342720k776260j094055k378159j389236r94263n55801k98577
$$ y = [480324974, 482327499, 484845467, 487488480, 490107040, 492710762, 496848030, 500242119, 504078751, 506446152, 508320999, 510719795, 512762871, 513490372, 512537804, 512733192, 512634506, 513794899, 513955498, 513279305, 513939285, 514686432, 517091026, 518770027, 521441193, 523997078, 525525703, 527345314, 529382172, 531839714, 532596245, 533725662, 534635506, 535902481, 537556381, 538157883, 539082870, 540484238, 542680740, 544228745, 546512756, 548358612, 548574181, 549042740, 550988998, 553711777, 554929657, 556247864, 557454643, 559173965, 560459328, 561402664, 562094078, 561334801, 561591072, 559954453, 558120728, 556187401, 552326202, 549051399, 545329628, 541327400, 535696030, 532061996, 529719276, 526943016, 525848961, 523470802, 522081566, 521087303, 520531502, 520232925]
1155.4E20232925J00327M69017l89709N52177l93257R22546J114617J191940K022591
1164E25823174K169494L787384L300629M575310M294662M496765N253754N029411N296669
1172.7E64027252M400177N219994M292488L627663M410553N490264N409165M344177
1180.4F01221733M777985M214019N231247O046792M755897K995300K562409L459892
1188.1F35265274K811699J968498J395874J177979Q55865N64423R02862R67865J076355
1196.8F46986694P64618R47190J168289R01565L17078j3809N67322J48696k43988m35257
1206.5F51108398n1117Q45337N97535J459198K291336K024231J988372K144623K359009
1215.1F64766922K278595J867371J145553L48282K59857K17667Q0108l4027k98309
$$ y = [520232925, 520333252, 520802269, 520412560, 520964737, 520571480, 521494026, 522608643, 523800583, 525823174, 527992668, 531780052, 535080681, 539655991, 543950653, 548447418, 553701172, 558730583, 564027252, 568427429, 573647423, 577939911, 581567574, 585978127, 591468391, 596877556, 601221733, 605999718, 610213737, 615444984, 621491776, 626247673, 629242973, 631805382, 635265274, 638076973, 640045471, 641441345, 642619324, 643475189, 644039612, 644942474, 645910339, 646986694, 647751312, 648698502, 649866791, 650768356, 651085434, 651071625, 651638947, 651787643, 651543655, 651108398, 651057281, 651902618, 652500153, 653959351, 656250687, 658274918, 660263290, 662407913, 664766922, 667045517, 668912888, 670058441, 670406723, 670666580, 670884247, 670964355, 670930328, 670632019]
1223.8F70632019k51999P0038K45209L44696L39050j12534L68119M70428j253586j564102
1233.5F69287338o80923p16782j367187j347657p82623n84488k51846j66702n0278
1242.2F63338852N03921N09491P29676P64770K72064J48545K83508K45285l49426l62625
1251.8F66084061J77765K88314K98539O16531J126785Q69675R41467J383896O35376
1260.5F72422409J35422N13382M7073o13022l94897K6779K24838M80576P19223J112747
1270.1F74674530J354370J124878J359329J420517R19266J107483R02100k25373j087875
1278.8F81549225o54373m91944r97848p22656l95203k31857l10898j00861M57077R39942
1288.4F79040604Q89129K44065j60981p50961r27734q50144r90371j483536j729355
$$ y = [670632019, 670380020, 670450058, 670695267, 671039963, 671379013, 671266479, 671634598, 672105026, 670851440, 669287338, 668606415, 667889633, 666522446, 665174789, 664392166, 663807678, 663555832, 663389130, 663338852, 663842773, 664352264, 665081940, 665846710, 666118774, 666267319, 666550827, 666796112, 666446686, 666084061, 666261826, 666550140, 666848679, 667465210, 668591995, 669461670, 670403137, 671787033, 672422409, 672557831, 673071213, 673118286, 672505264, 672110367, 672137146, 672361984, 672842560, 673561783, 674674530, 676028900, 677153778, 678513107, 679933624, 680852890, 681960373, 682862473, 682637100, 681549225, 680894852, 680402908, 679405060, 678682404, 678287201, 678055344, 677744446, 677643585, 678100662, 679040604, 679929733, 680173798, 680012817, 679261856, 678334122, 677483978, 676493607, 675010071, 673280716]
1297.1F73280716r70535p33948p37305n16662j90354K86560K17209n96924o92367k32544
1306.8F69113846j112518j541825j362381j372528p31277p16248j244049p23495l7995
1315.4F60271530k61154l18832m3717k37274K51923Q68377l19442j114731q35038j625671
1325.1F56635971j929550j897659k077408j817703j272736j067276j355896q58231
1332.8F44359512r58481r27810p94373j323700q12454r58671k029114r52988R27773
1341.5F36529694M23393l82004l51334L69111N83038L25394N97190L02277J96953K71721
1351.1F38865433J13220j1101n51033j168670q28972k12021r52835q93936j29395n34286
1360.8F33696404m15497j200409j457672J554985J571159j26724m6158r28078j588363
$$ y = [673280716, 672310181, 671576233, 670838928, 670322266, 670131912, 670418472, 670635681, 670038757, 669346390, 669113846, 668001328, 666459503, 665097122, 663724594, 662993317, 662277069, 661033020, 660309525, 660271530, 660010376, 659691544, 659647827, 659410553, 659662476, 660530853, 660211411, 659096680, 658261642, 656635971, 654706421, 652808762, 650731354, 648913651, 647640915, 646573639, 645217743, 644359512, 643401031, 642473221, 641678848, 640355148, 639542694, 638584023, 636554909, 635601921, 636529694, 636953087, 636571083, 636219749, 636588860, 637171898, 637497292, 638094482, 638396759, 638593712, 638865433, 638978653, 638967552, 638416519, 637247849, 636418877, 636206856, 635254021, 634360085, 634230690, 633696404, 633280907, 632080498, 630622826, 632177811, 633748970, 633622246, 633576088, 632648010, 631059647]
1369.4F31059647l49961o07834K12403k96707j858864l18222J816215K045479L26996
1378.1F32029152M03213Q36716J179505J038093K04010O50482L94326K97431j91307
1386.8F36841621l00521K229995K323876J363144J705398K189713J259765j015396
1394.5F46597595j783676J758347J049041o45446j738663m72336R69467l63846o56280
1403.2F44714203j002655k392731J00479J119919M11911k59552m06952p39364o74134
1411.9F40871124j34124r1095r25293j172944j132354j113739p70798n135193J283074
1420.6F31678658L105888J271858N68657j292458J558686K203407M32129O11725m12293
1429.2F39726257j471405l4561J184235j91651l94973J253128j73684l693809K470894
$$ y = [631059647, 630709686, 630101852, 630314255, 630017548, 628158684, 627840462, 629656677, 631702156, 632029152, 632432365, 633269081, 634448586, 635486679, 635690689, 636341171, 636735497, 637032928, 636841621, 636541100, 638771095, 641094971, 642458115, 644163513, 646353226, 647612991, 646597595, 644813919, 646572266, 647621307, 646975861, 645237198, 644764862, 645734329, 645370483, 644714203, 643711548, 641318817, 641419296, 642539215, 642951126, 642691574, 642284622, 641545258, 640871124, 640737000, 640645905, 639720612, 638547668, 637415314, 636301575, 635530777, 630395584, 631678658, 634784546, 636056404, 636625061, 635332603, 636891289, 639094696, 639526825, 640138550, 639726257, 638254852, 638220291, 639404526, 639212875, 638817902, 640071030, 639897346, 636203537, 638674431]
1437.9F38674431M621925J912537Q22143J153641M07639Q42895l64227l07160m74090
1446.6F47289734j691055k379456L36304J224899r22089m55246N57175P97348p82394
1455.3F43975220j584015n591011m295883N004234J971474K660408K98309j6861J208801
1464F43630676l000869J858978K559433L554458K472840K905121L773498K77023J088562
1472.6F59119720K283478O629868L694839M32129L543930L871460K876129J402436
1480.3F83853989K068634K711944L989487L078537K647705K958221J37635J781234
1488.1G03227386J498490l444672j748276N133057L935013R28421J589661n44815l492585
1496.7G07081680L500595J377182J337433M042588J841049K37579J547012J246338
$$ y = [638674431, 643296356, 645208893, 646031036, 647184677, 647592316, 648435211, 648070984, 647763824, 647289734, 645598679, 643219223, 643555527, 644780426, 643858337, 643403091, 643960266, 644757614, 643975220, 642391205, 636800194, 632504311, 637508545, 639480019, 642140427, 642438736, 642421875, 643630676, 640629807, 642488785, 645048218, 648602676, 651075516, 653980637, 657754135, 658031158, 659119720, 661403198, 668033066, 671727905, 672160034, 675703964, 679575424, 682451553, 683853989, 685922623, 688634567, 692624054, 695702591, 698350296, 701308517, 701446152, 703227386, 704725876, 701281204, 699532928, 704665985, 708600998, 709529419, 711119080, 710574265, 707081680, 710582275, 711959457, 713296890, 717339478, 719180527, 719418106, 720965118, 722211456]
1504.5G22211456N28336r192352r349747M172211M003067L166809K981338Q78830m97284
1513.1G18902664L374329J326980q22448j955948j947479O355743K929687n337600
1520.8G22825928p125092Q75931N629959J782150k098159P42569K003936k40020K830352
1529.5G27227554L607254M95072Q62427l049622m067688K780533J396255J267395P59201
1538.2G31278381n149383j4984284O209488L057328Q58535N567551O17371L78570M053879
1546.9G31887436K444153J031418l094559l843765K721099J878891o58493n294494
1554.6G27071686N83038N244827L208313r561157j3450088P053680R408035M745102
1562.3G34303436L011170M64477l621826J9074J269912J53885j955108p708283K835693
$$ y = [722211456, 722739792, 713547440, 704197693, 708369904, 712372971, 715539780, 718521118, 719399948, 718902664, 722276993, 723603973, 722781525, 720825577, 718878098, 725233841, 728163528, 722825928, 715700836, 716576767, 722206726, 723988876, 721890717, 722633286, 724637222, 724397202, 727227554, 730834808, 731329880, 732192307, 729142685, 725074997, 727855530, 729251785, 730519180, 731278381, 726128998, 711144714, 717354202, 720411530, 721270065, 726837616, 727454987, 727833557, 731887436, 734331589, 735363007, 732268448, 728424683, 731145782, 733024673, 732366180, 727071686, 727654724, 732899551, 736107864, 726546707, 713096619, 720150299, 729558334, 734303436, 737314606, 737779083, 734157257, 734176331, 735446243, 735600128, 733645020, 725936737, 728772430]
1571G28772430L269730J139374J045990J490783j576004r097061L881073L187790M65164
1579.7G32579269m07180j276322j269913j849060r91287q48312r77097l0212o3858
1588.4G24866028j48773q40912k23389m65088o62994j391297k080688j182709k453689
1597G15416489j790696j870651j503982j539078j404114l04413j179962m4784m59366
1605.7G05319443j129761j381531o17752k276230l436355n65567k233506j827774j976242
1614.4F89874725o66046j953811j0809174K893982J646500N01937o94198O5918k234497
1623.1F78625336o719666J700669Q21762k81525m843826l303299M50744p14035m41742
1631.7F65294418j267090Q84934J160431q247757k382126L370056K345276J230393
$$ y = [728772430, 732042160, 733181534, 734227524, 735718307, 734142303, 725045242, 728926315, 732114105, 732579269, 732172089, 730895767, 729625854, 727776794, 726785507, 725937195, 724960098, 724929886, 724866028, 724717255, 723876343, 723652954, 723187866, 722524872, 721133575, 719052887, 717870178, 715416489, 713625793, 711755142, 710251160, 708712082, 707307968, 707003555, 705823593, 705778809, 705319443, 704189682, 702808151, 702190399, 699914169, 696477814, 695912247, 693678741, 691850967, 689874725, 689208679, 687254868, 676445694, 679339676, 680986176, 681488113, 680793915, 680859833, 678625336, 671905670, 673606339, 674428101, 674146576, 669302750, 665999451, 666450195, 665736160, 665294418, 664027328, 664912262, 666072693, 657824936, 655442810, 658812866, 661158142, 662388535]
1639.5F62388535N36346q96606Q0261j316681P64541J044007m451676j383133j956939
1648.1F54808655L763199M265213L935699L960114j584320j4599381N502091O452407
1655.9F66503677K887116J611786J133346P01371J193847J955643m80957q16651M960785
1664.5F79649963L650055K604523K799988J083221k863617K051697L090286J80436
1672.3F92246552L553771M203492j566315l144684M789047M250336K295685J422272
1680G08050156Q00552M878616M845734l032990j0480880P522659Q160782L162155l35007
1688.6G23571777J422425J040725K696228K572022J968613L475647J512603p969970
1696.4G30290070L901062O964035O916885j122437j0697174O687165M427490L71780
$$ y = [662388535, 662924881, 662028275, 662108536, 660791855, 661556396, 662600403, 658148727, 656765594, 654808655, 658571854, 662837067, 666772766, 670732880, 669148560, 654549179, 660051270, 666503677, 669390793, 671002579, 672135925, 672837296, 674031143, 675986786, 675505829, 674689178, 679649963, 683300018, 685904541, 688704529, 689787750, 686924133, 688975830, 692066116, 692246552, 695800323, 700003815, 698437500, 695292816, 700081863, 704332199, 706627884, 708050156, 708850708, 713729324, 718575058, 715542068, 705061188, 712583847, 720744629, 723906784, 723571777, 724994202, 726034927, 728731155, 731303177, 733271790, 736747437, 738260040, 730290070, 734191132, 741155167, 748072052, 746949615, 736252441, 742939606, 747367096, 747738876]
1704.1G47738876j729049k4948j025238K937927L912964Q68988O50024K266083K143249
1712.8G57738876J339112j934662j561508K570190j578674q053513O299286M911728
1720.5G59730835J827698R92508l5248N18799K473144J705857J091079J855774J245270
1729.1G71405716k768021n74569L768386J554718q081893p807618P461853M998856
1736.9G69957428J723862K476730k452927j597671N859451K512360k119293N84945
1744.6G76944885K722245N19638o32477j069031n19867L298416k447281q61511N542984
1753.3G83498001K926636K103348J386337k361374J750717K769470J776429J733398
1761G95582962m587707p54853L387223P61566J27639J060715l45077l193817L544464
$$ y = [747738876, 746009827, 745984879, 744959641, 747897568, 751810532, 752679520, 753329544, 755595627, 757738876, 759077988, 757143326, 755581818, 758152008, 756573334, 748519821, 754819107, 759730835, 761558533, 762551041, 762515793, 763034592, 765507736, 767213593, 768304672, 770160446, 771405716, 768637695, 768063126, 771831512, 773386230, 765304337, 757496719, 764958572, 769957428, 771681290, 774158020, 771705093, 770107422, 775966873, 778479233, 776359940, 776944885, 779667130, 780186768, 779554291, 778485260, 777965393, 781263809, 778816528, 777955017, 783498001, 786424637, 788527985, 789914322, 787552948, 789303665, 792073135, 793849564, 795582962, 790995255, 790240402, 793627625, 794389191, 794516830, 795577545, 795232468, 792038651, 795583115]
1769.7G95583115L732147k361145m378205J312180N643311J485900j477661J713257
1777.4H01252899J64108q5296j773682k047195J909179K090073R14688j291962O46058
1786H01778870K657165J311035J104889J412964j204071j618881l880463p93762L323822
1794.7H04091568l30734q53882K170792J685714j225891p92084K885971J48850Q89969
1803.4H08670273J835785j22986K79007l87421r06143Q0795k67257j986390O4545J121979
1813H08382187P80563J506806J201400R83811m20380M83628J136245l83758l41263
1821.7H13329239j412964L32184l18070m371719J388245K975921J493683j397095l752212
1830.4H08267212L049469L440323M04587K51770L89175m48990j379776q12301M06646
$$ y = [795583115, 799315262, 796954117, 792575912, 793888092, 799531403, 801017303, 799539642, 801252899, 801417007, 801331711, 799558029, 797510834, 799420013, 801510086, 802424774, 801132812, 801778870, 804436035, 805747070, 806851959, 808264923, 807060852, 805441971, 801561508, 800767746, 804091568, 803760834, 802906952, 805077744, 806763458, 805537567, 804745483, 807631454, 807780304, 808670273, 810506058, 810383072, 810662079, 810274658, 809368515, 809449310, 809182053, 807195663, 807260208, 808382187, 809162750, 810669556, 811870956, 812854767, 812434387, 812918015, 814054260, 813670502, 813329239, 811916275, 812248459, 811930389, 807558670, 808946915, 811922836, 813416519, 812019424, 808267212, 811316681, 814757004, 815161591, 815413361, 815802536, 815353546, 813973770, 813161469, 813568115]
1839.1H13568115n17349M22745N75638R90524j685486o107330M632721L919143k73666
1847.8H15525055n23911P93000N27572n41687k38647p02973l65829k16522L2196M31900
1857.4H14720154j57700M99649N23072N74722K26517M42581M12750N112N1727j585541
1867.1H15713043j281814k874680j358032K517471J651688J027374O82678N55649M5166
1875.7H16678543K29721N80597L45688R2850l62397j6098m59976k74200p22504q41904
1885.4H15250320L29285L13568J207428m66537j972809J773529J785355L76968O24237
1894.1H19221344r41086j739273O04096O15921j90888p58057k77786J87683p8354N02015
1903.7H17145615j9303M08249M80805k90375q3771l03879l45688K78702N68238m52195
$$ y = [813568115, 813050766, 813473511, 814049149, 815039673, 813354187, 807246857, 811879578, 815798721, 815525055, 815001144, 815794144, 816321716, 815780029, 815541382, 814838409, 814472580, 814256058, 814288254, 814720154, 814562454, 815062103, 815585175, 816159897, 816386414, 816828995, 817241745, 817246857, 817298584, 815713043, 814431229, 811556549, 810198517, 812715988, 814367676, 815395050, 816077728, 816633377, 816678543, 816908264, 817488861, 817834549, 817927399, 817565002, 817548904, 817088928, 816814728, 816092224, 815250320, 815579605, 815893173, 817100601, 816634064, 814661255, 816434784, 818220139, 818597107, 819221344, 818280258, 816540985, 817145081, 817761002, 817570114, 816812057, 816534271, 816721954, 816643600, 817145615, 817126312, 817534561, 818015366, 817724991, 817641220, 817337341, 816991653, 817270355, 817838593, 817386398]
1913.3H17386398k15912k39257N18341J212005l031006p75680K355881J490783P5989
1922H18777542k405701Q2322J925277L35694n37491m79202m99497l58810k14157Q2244
1931.7H16708221M25263J14136L27224J55564N07431O51397j81274l06854M577R45664
1941.3H19351349j809311k560196J863937M63410r63898K6245O53076O97251L45917
1950H18067780K97927J92948l4104j03530k18506n10865j3961p477k97928j22147k08435
1960.6H17041702j297j57776K25754O53534M92783P0190m67377N19333Q49915Q5296
1970.2H19312057m90722o01502n30471l61634j78833l37066r4223M54025O52542K05460
1979.9H18029633L16009N64804p8964j99738j72348j26648m7302m21676q71888l14483
$$ y = [817386398, 817170486, 816931229, 817449570, 818661575, 815630569, 814854889, 817210770, 818701553, 818777542, 816371841, 816454163, 818379440, 818715134, 818177643, 817698441, 817198944, 816840134, 816625977, 816708221, 817133484, 817247620, 817574844, 817730408, 818237839, 818889236, 818707962, 818401108, 818405685, 819351349, 817542038, 814981842, 816845779, 817309189, 816345291, 816371536, 817024612, 817721863, 818067780, 818365707, 818558655, 818524551, 818421021, 818202515, 817691650, 817677689, 817670212, 817372284, 817250137, 817041702, 817040405, 816882629, 817108383, 817761917, 818254700, 818324890, 817857513, 818376846, 819226761, 819312057, 818821335, 818219833, 817689362, 817327728, 817148895, 816811829, 816717606, 817171631, 817824173, 818029633, 818345642, 818910446, 818831482, 818631744, 818459396, 818332748, 818285446, 817863770, 816991882, 816677399]
1989.5H16677399N04837n25360j430436P18079J793747N04684k01416J36033N13763
1998.2H18691330K64740p71408n53589k30865l8376j6175m79965l54080l49732K52839
2007.8H16414719M87213O2103K42920J97525R5139Q4533L7842k86865j111679j222534
2017.5H15000916j16044K6093r0866J94626k0752p0725J00785N21850L18756N4398
2027.1H15919037J71203j831k0904p52869o49338r9334l31955n99137o52847J36109
2036.8H13118134M24423J16882K28348L40652l27377m0207M53110k88773n4702l89100
2046.4H13581390m63943k86179n28946J38321j86844j77154J24664J66626M20685N62286
2056.1H13350906L92075o6986K28271j80740l87421j94397k38571k18277p71942o61087
$$ y = [816677399, 817182236, 816656876, 815226440, 815944519, 817738266, 818242950, 818041534, 818177567, 818691330, 818956070, 818184662, 817631073, 817400208, 817361832, 817345657, 816865692, 816511612, 816161880, 816414719, 816901932, 816964035, 817206955, 817404480, 817499619, 817584152, 817621994, 817335129, 816223450, 815000916, 814884872, 814910965, 814820099, 815014725, 814993973, 814923248, 815024033, 815545883, 815864639, 815919037, 816090240, 816088409, 816067505, 815314636, 814665298, 814565964, 814234009, 813634872, 812982025, 813118134, 813542557, 813659439, 813887787, 814228439, 813901062, 813860855, 814313965, 814025192, 813970490, 813581390, 813117447, 812831268, 812302322, 812440643, 812253799, 812076645, 812201309, 812367935, 812788620, 813350906, 813742981, 813675995, 813904266, 813723526, 813336105, 813141708, 812903137, 812684860, 811912918, 811251831]
2065.7H11251831k47345L96347N15137M86984N60455J27030J95999j49078J03454J97907
2075.4H13438721k33689l64227m10004Q5907j13449m45175n75943l4561N09491N41611
2085H12398682O12411O0806J76087K91977K05917k49634o67190k77024k75878q7967
2094.6H12188187k15149j32599J10397J18637N27573M37927j297q1558L40729J85699
2104.3H13478546k3041j65023m10004k9755J0605j99509l42788l41568k28272L87879
2113.9H12137070L89328k3117N29937N87464L33404j61514p4234k3727m82254l47519
2123.6H12864838m01078p8582j49460L0136J50909J5793L75366Q1177J73187K59247
2133.2H13321533N53513K77099j74484L8834l15628k82440m69742l82080p07322o03485
$$ y = [811251831, 811004486, 811400833, 811915970, 812402954, 812963409, 813090439, 813286438, 813137360, 813240814, 813438721, 813205032, 812840805, 812430801, 812516708, 812403259, 811958084, 811382141, 811347580, 811857071, 812398682, 813011093, 813071899, 813247986, 813539963, 813745880, 813496246, 812829056, 812552032, 812276154, 812188187, 811973038, 811840439, 811950836, 812069473, 812597046, 813034973, 813033676, 812952118, 813292847, 813478546, 813455505, 813290482, 812880478, 812850723, 812861328, 812661819, 812319031, 811977463, 811749191, 812137070, 812526398, 812503281, 813033218, 813620682, 813954086, 813792572, 813718338, 813694611, 813212357, 812864838, 812463760, 812385178, 812235718, 812265854, 812416763, 812432556, 812807922, 812889099, 813062286, 813321533, 813875046, 814152145, 813977661, 814016495, 813700867, 813418427, 812948685, 812566605, 811859283, 811255798]
2142.9H11255798L32337L56216M32205K56424O92139M38766P6294L05787l48511m11682
2152.5H13385773k78321k14309o95267k93045J28479j62125K31247J77384O65512N23147
2162.1H13468475N28794M40139k34527J16119j21765n0506k88849o38352n20935n7449
2171.8H12641144Q8959l44086M91867O22177P79266P46003L01742L45307l7461J85318
2181.4H15820236k71454k97165j45034o20423l65371R2392R1705l69034Q6670N29633
2191.1H14552155J250610R32770k06833K94037J77993N5924j97373n21850o02341n97839
2200.7H15137253n2948o8360O7215K1210N18875Q39539L98636L82538K25601M03213
2210.4H17872772J93405r8724k71454k74887l59192p27463m50668m9591N85403M76990
$$ y = [811255798, 811588135, 811944351, 812376556, 812632980, 813325119, 813763885, 813840179, 814145966, 813797455, 813385773, 813107452, 812893143, 812197876, 811904831, 812033310, 811871185, 812102432, 812279816, 812945328, 813468475, 813997269, 814437408, 814202881, 814319000, 814197235, 814146729, 813857880, 813219528, 812698593, 812641144, 812730103, 812386017, 812877884, 813500061, 814279327, 815025330, 815327072, 815672379, 815634918, 815820236, 815548782, 815251617, 815106583, 814486160, 814120789, 814213181, 814304886, 813935852, 814022522, 814552155, 815802765, 816735535, 816528702, 816822739, 817000732, 817056656, 816859283, 816337433, 815735092, 815137253, 815084305, 815015945, 815083160, 815104370, 815623245, 816462784, 816861420, 817243958, 817469559, 817872772, 818066177, 817967453, 817695999, 817421112, 817061920, 816334457, 815883789, 815834198, 816419601, 816896591]
2220H16896591J51596J97602L43399N03769K41851M17099l2882m33503k85110j50223
2229.7H17850189k53525p00683m77524l509O12792L67814J49383N20706N77545N77622
2239.3H19220810J92337Q0109k37961k13471j86615l78494m57687o74668j76239m4098
2248.9H17124023K28272K03400N32226O79169J37329Q39996J85776l39279k05002k45285
2258.6H19140625r3460n08041m55628r23843m43268M39834N27268N37262L27606L15552
2268.2H18863907K71149P87429M77677k02256n39169n14908l87039o24161j51596m68750
2277.9H17512283o5841N51147P10831M47311j03531Q27866P0801j77079N25361K12402
2287.5H20511551k48718j043930j89133P9880j91574l82004k09732M22287N5237L17764
$$ y = [816896591, 817048187, 817245789, 817589188, 818092957, 818334808, 818751907, 818719025, 818285522, 818000412, 817850189, 817596664, 816895981, 816418457, 816414948, 817027740, 817395554, 817544937, 818065643, 818643188, 819220810, 819413147, 819493256, 819255295, 819041824, 818855209, 818476715, 818019028, 817344360, 817168121, 817124023, 817352295, 817555695, 818087921, 818767090, 818904419, 819744415, 819930191, 819590912, 819385910, 819140625, 819047165, 818539124, 818083496, 817159653, 816716385, 817156219, 817683487, 818220749, 818548355, 818863907, 819135056, 819922485, 820400162, 820197906, 819658737, 819143829, 818756790, 818132629, 817981033, 817512283, 817446442, 817997589, 818708420, 819155731, 819052200, 819880066, 819950867, 819773788, 820299149, 820511551, 820262833, 819218903, 819029770, 819109650, 818918076, 818536072, 818326340, 818748627, 818803864, 819121628]
2297.2H19121628M86831P23649L55835J51824M15268J08948P9422j014709m70658J26343
2306.8H20084381n49087j77231K84500N06515j22604m3030J95465J101990R81598j43356
2316.4H22119141L01437l38516K23541K46887p79571l36228q85544m91561P12204Q59603
2326.1H21631393Q0643L90854M43115N27497N71212o16150j89437k4414P28912Q87146
2335.7H24430771q16193k014312r16443J022415J3656k99835p72934l56521J073379
2344.4H21363983L9749q9874j103363n98984J900025J520462r12094o11725m6692L32489
2354.1H21793976O70166n23529J508407J109314r17358j338196P8736L318252R40476
2362.7H26640244j462632k259979k147751r27734j59607L13492r54361p00379l73840
$$ y = [819121628, 819608459, 820332108, 820687943, 820839767, 821255035, 821363983, 821443405, 820428696, 819958038, 820084381, 819535294, 819358063, 819642563, 820149078, 820026474, 819983444, 820178909, 821280899, 822262497, 822119141, 822420578, 822082062, 822305603, 822552490, 821772919, 821436691, 820551147, 820059586, 820771790, 821631393, 821712036, 822102890, 822546005, 823073502, 823644714, 823028564, 822839127, 822814713, 823543625, 824430771, 823614578, 821600266, 820683823, 821706238, 821719894, 821420059, 820647125, 820290604, 821363983, 821403732, 821313858, 820210495, 819611511, 821511536, 823031998, 822119904, 821508179, 821461487, 821793976, 822464142, 821940613, 823449020, 824558334, 823640976, 822302780, 822381516, 825699768, 826640244, 825177612, 822917633, 820769882, 819842148, 819682541, 819996033, 819041672, 818341293, 817967453]
2371.4H17967453k65808j29242o88629L5171M61808M8904n71594o31485k05918m34799
2381.1H15585861q99124p67670l31726k70919k28577o8970P6370L04566M36477K96021
2390.7H14132309K29950O3629k21786k01569m71497m76303k57187j65634j44348k03476
2400.3H12284088J03836n2872O6834K14386P2479O27289J32980p54318k61535j18332
2410H12314835p12510m40673k45743k87323k24228l66669J9379J15814K51694L14026
2419.6H10738602L891l62244l21121M77600J7090l64990o47507j100998l33328j7548
2429.3H08089447k0447m60739n20935L29742N78690P6141k27890J74790j27869l43475
2438.9H07547455j96991k47574k55585o84585n86930j16500l70255n75638R2850J22986
$$ y = [817967453, 817701645, 817572403, 816883774, 816918945, 817380753, 817429657, 816858063, 816226578, 816020660, 815585861, 814686737, 813919067, 813587341, 813316422, 813087845, 813018875, 813095245, 813399811, 813836288, 814132309, 814362259, 814425888, 814204102, 814002533, 813531036, 813054733, 812797546, 812631912, 812487564, 812284088, 812387924, 812335052, 812401886, 812616272, 812688751, 813316040, 813449020, 812694702, 812433167, 812314835, 811602325, 811161652, 810915909, 810628586, 810404358, 810037689, 810057068, 810172882, 810424576, 810738602, 810742493, 810380249, 810059128, 810536728, 810553818, 810188828, 809541321, 808440323, 808106995, 808089447, 808069000, 807608261, 807087326, 807417068, 807995758, 808071899, 807844009, 808018799, 807890930, 807547455, 807350464, 807102890, 806847305, 806162720, 805575790, 805459290, 805089035, 804513397, 804606247, 804729233]
2448.6H04729233P2632K79083p4616J36719J01013m7836o00586o65283j9226n87235
2458.2H03323898n03540k06833l14254j54038K64511L25012j60141J24054O638j13602
2467.8H02591705J29547J01929k79083p22504o23550p14874k72904k32468k43301L72925
2477.5H00107422o10k81983j6937M43802M49905j11771l86123j89896k51236n98297
2487.1G99164276m13284k60163k93502n85938k60315J30768N9204L02506L16391O28204
2496.8G98788147j86539q03528k41165k83889J02157n6381m20761m52576n80444l37067
2506.4G95527954K7390K69928J11312L78037M62723j24054n36957j68457J92413k70004
2516.1G95870285m97971o05773l92762j40457j55640j8997N0812n1041l7384M01230
$$ y = [804729233, 804801865, 805080948, 805006332, 805143051, 805244064, 805196228, 804595642, 803930359, 803911133, 803323898, 802820358, 802613525, 802299271, 802145233, 802409744, 802734756, 802574615, 802698669, 802705307, 802591705, 802721252, 802823181, 802544098, 801821594, 801198044, 800483170, 800210266, 799977798, 799734497, 800107422, 800106812, 799824829, 799807892, 800251694, 800701599, 800589828, 800203705, 800013809, 799762573, 799164276, 798750992, 798490829, 798197327, 797611389, 797351074, 797481842, 797541046, 797843552, 798159943, 798788147, 798601608, 797798080, 797556915, 797273026, 797375183, 797318802, 796898041, 796445465, 795865021, 795527954, 795555344, 795825272, 795936584, 796314621, 796777344, 796653290, 796116333, 795947876, 796140289, 795870285, 795372314, 794766541, 794373779, 794233322, 794077682, 794058685, 794109497, 794058456, 794021072, 794422302]
2525.7G94422302L38288K45361l13416q77914k63824k86026o30570n58548q2397R0637
2535.4G92083893l09143l66287Q1253K90680J02386L51181k68326n08194j46103n90362
2545G90720978o37818l29361O0425n70297o28662k9602J62811M40216J7243K54898
2554.6G89460831o867j95923j02157n47867m08478q09479n30700k23618p3547j38855
2564.3G86423340n59998N036j3810P1564j983j6709J87378j09711j46713o55060p28454
2574.9G84454880j94092K07443l32870n06821Q6746p553L32413j29776n51453p7514
2584.5G83281403Q6822J04294k34451m85154n86853k59780j39771N341j13144m76761
2594.2G81181946O5689J44577J46789j17569m15802k07366L2424J76774n08042m69971
$$ y = [794422302, 794760590, 795005951, 794692535, 793814621, 793550797, 793264771, 792634201, 792075653, 791993256, 792083893, 791774750, 791408463, 791489716, 791780396, 791882782, 792233963, 791965637, 791457443, 791311340, 790720978, 790083160, 789753799, 789814224, 789243927, 788615265, 788585663, 788748474, 789188690, 789205933, 789460831, 789453964, 789258041, 789155884, 788608017, 788199539, 787390060, 786859360, 786635742, 786562195, 786423340, 785863342, 785868378, 785854568, 785926132, 785924149, 785907440, 786094818, 785985107, 785838394, 785183334, 784454880, 784260788, 784468231, 784135361, 783628540, 783715286, 783707733, 784040146, 783910370, 783358917, 783281403, 783368225, 783472519, 783238068, 782752914, 782166061, 781906281, 781766510, 781771851, 781658707, 781181946, 781247635, 781392212, 781539001, 781421432, 781005630, 780798264, 780830688, 781007462, 780499420, 780029449]
2603.8G80029449k13241m04511l16238k90375j10931M2267J70898o6833j63651J3733
2613.5G78690567K823k19498n65185n73120m23508j65558l13797l19595k41471m60205
2623.1G75411453k40478q2474j24512k98767r7732r2850m43573n24216m74624k60468
2632.8G72771759p07245m54483L00827o6147n35431n81588n94101n68619J31378K69928
2642.4G69966278j64413m15268p35245m85306m49219m13284j4191k42309r38339o53611
2652G65455093K14692P1640m67606o20956j50376k43454o25076j49918M6006j41449
2661.7G63388596l06855k64053m14810m53034k37198k31399j42517l23868m08173k84194
2671.3G60322495l4943k37274n68695l0365K36740j21994o40030l24326J01548k36359
$$ y = [780029449, 779816208, 779411697, 779095459, 778805084, 778694153, 778736420, 778907318, 778840485, 778676834, 778690567, 778693390, 778473892, 777908707, 777335587, 776912079, 776746521, 776432724, 776113129, 775871658, 775411453, 775170975, 775088501, 774963989, 774665222, 774567490, 774474640, 774031067, 773506851, 773032227, 772771759, 772064514, 771610031, 771910858, 771844711, 771309280, 770727692, 770133591, 769564972, 769696350, 769966278, 769801865, 769386597, 768651352, 768166046, 767716827, 767303543, 767289352, 767047043, 766108704, 765455093, 765669785, 765741425, 765273819, 764652863, 764502487, 764259033, 763633957, 763484039, 763530045, 763388596, 763081741, 762817688, 762402878, 761949844, 761712646, 761481247, 761338730, 761014862, 760606689, 760322495, 760287552, 760050278, 759481583, 759451218, 759687958, 759565964, 758925934, 758601608, 758703156, 758466797]
2681G58466797l86200m44260m10461n32990m91256k90680o9428R2011l25547k72369
2690.6G55335617n0735l07618l20282j22985m40903o35986l79410m84009k71454J29089
2700.3G52451324K1897m72489m85458j92795k93579k975K8686k38876m47998p67822
2709.9G49599915p19452k93656r15k85492l18680j22528j63345o11344n28335K96707
2719.5G46852875M7836j07117m7454m25187m18548m19464n73120p58667k22245Q0567
2729.2G44009476m64783l32489O3553L0517l65142m28315J83182n7449o18363l11737
2738.8G41708450l64303n06668n44587m74624j00556k15606j1063L6850l2730K09656
2748.5G39704819J52j56707k27128m7225k83967m73861k92893n32531m67453l88947
$$ y = [758466797, 758080597, 757636337, 757225876, 756692886, 756201630, 755910950, 755841522, 755933533, 755607986, 755335617, 755284882, 754977264, 754656982, 754533997, 754093094, 753457108, 753077698, 752593689, 752322235, 752451324, 752473221, 752000732, 751515274, 751322479, 751028900, 751025925, 751054611, 750815735, 750367737, 749599915, 748880463, 748586807, 748585892, 748300400, 747981720, 747859192, 747695847, 747084503, 746556168, 746852875, 746900711, 746793594, 746746140, 746320953, 745902405, 745482941, 744909821, 744151154, 743928909, 744009476, 743544693, 743212204, 743275757, 743306274, 742941132, 742512817, 742695999, 742638550, 742020187, 741708450, 741344147, 740837479, 740292892, 739818268, 739717712, 739502106, 739491043, 739527893, 739495163, 739704819, 739704971, 739548264, 739321136, 739273911, 738989944, 738516083, 738223190, 737690659, 737223206, 736834259]
2758.1G36834259j50452l1967j31225r3537l9367Q7661p9117J6633O6452j84021o05698
2768.7G35689621n50079j44730j96991l90167p04880k09885l88412m20151M37470j89667
2778.4G32932129k95487J23215J01013l02505l87573k16828o80389l44849o17218q92181
2788G29419327m65775k92053k99149o46820p0953M3182j05972l7689l60260m03519
2797.7G26780319p03583o68029q13217j133194r08127k43302o6528o05240o15997p30896
2807.3G20292206l11508J59759L9063j41754p21055q89816j027603r20944q31604j024628
2816.9G14622116p10907m45785o08368r20105o90918n81360m00772k93503p84836p57065
2826.6G08428497o86111n44129o82373j275787j407928j183548p88575p56073j072921
$$ y = [736834259, 736683807, 736651840, 736520615, 736427078, 736387711, 736475372, 736396255, 736412888, 736479340, 736295319, 735689621, 735139542, 734994812, 734797821, 734407654, 733702774, 733492889, 733104477, 732684326, 733121796, 732932129, 732636642, 732759857, 732860870, 732558365, 732170792, 731953964, 731273575, 730928726, 730311508, 729419327, 728953552, 728661499, 728362350, 727715530, 727644577, 727687759, 727581787, 727544098, 727183838, 726780319, 726076736, 725408707, 724595490, 723462296, 722554169, 722310867, 722244339, 721639099, 721023102, 720292206, 719980698, 720140457, 720179520, 720037766, 719316711, 718426895, 717399292, 716478348, 715646744, 714622116, 713911209, 713465424, 712857056, 711936951, 711246033, 710664673, 710263901, 709970398, 709185562, 708428497, 707742386, 707198257, 706515884, 705240097, 703832169, 702648621, 701860046, 701103973, 700031052]
2835.3G00031052j390381p21665J18409o99616j175079q20847j336441k025757j966858
2843.9F90012817j565094j621856j931534k142639k394333j955033j616363j444168
2851.7F75341797l00141p1716n64041p38754o32782K4948l21274n70068m84391r17587
2861.3F70765991o81915q41446j239853j229706j090011o18820q29773j238480j170273
2870F61825714j393433j683578j632462j260223j239700j576462j755600k210541j983490
2878.7F47090225j340408j362381j185303r90753p67746o40793n76324k20108n89104
2887.3F39417305r79004p25861m03671m43153q05473o12565l05557o81000p75718j33705
2897F33551598M7645j07994j75552l03994j79595j41907l57132o13365q44460j312981
$$ y = [700031052, 698640671, 697919006, 698037415, 697337799, 696162720, 695341873, 694005432, 691979675, 690012817, 688447723, 686825867, 684894333, 682751694, 680357361, 678402328, 676785965, 675341797, 675041656, 674969940, 674405899, 673667145, 673034363, 673059311, 672738037, 672167969, 671683578, 670765991, 670084076, 669242630, 668002777, 666773071, 665683060, 665064240, 664234467, 662995987, 661825714, 660432281, 658748703, 657116241, 655856018, 654616318, 653039856, 651284256, 649073715, 647090225, 645749817, 644387436, 643202133, 642211380, 641443634, 640802841, 640226517, 640006409, 639417305, 638438301, 637712440, 637308769, 636865616, 636060143, 635447578, 635142021, 634461021, 633685303, 633551598, 633599243, 633491249, 633315697, 633011703, 632832108, 632690201, 632333069, 631719704, 630875244, 629562263]
2906.6F29562263j242675j030617j089554n47523j162186k056198j984329j712571
2914.3F18736610j529159j967545j588020j205444j561241j690445j313248r10416
2922.1F06971092j809616j708832m64210l36762q42552l17039Q72650O15692M54979
2930.7F03435402N12848L65982P65533N12963L16696P96089J108856J145020J514473
2939.4F10473862J891479J981011K064056K231979K432862K161636K083168K004929
2947.1F27324982J859283K222176K053299J285171R80034J197243J412315J384010
2954.8F39718513J181756J648559K215500K373047K064438J404266J631928J818924
2962.6F54056931J814651J582260J040268Q83331J279374J810607J294480J087036
$$ y = [629562263, 628319588, 627288971, 626199417, 625651894, 624489708, 622433510, 620449181, 618736610, 617207451, 615239906, 613651886, 612446442, 610885201, 609194756, 607881508, 606971092, 605161476, 603452644, 602988434, 602651672, 601809120, 601492081, 602364731, 602980423, 603435402, 603948250, 604314232, 605079765, 605592728, 605909424, 606705513, 607814369, 608959389, 610473862, 612365341, 614346352, 616410408, 618642387, 621075249, 623236885, 625320053, 627324982, 629184265, 631406441, 633459740, 634744911, 635724945, 636922188, 638334503, 639718513, 640900269, 642548828, 644764328, 647137375, 649201813, 650606079, 652238007, 654056931, 655871582, 657453842, 658494110, 659377441, 660656815, 662467422, 663761902, 664848938]
2970.3F64848938Q57773R35592J560212J334610J523742J444245J430282J384659J435700
2979F76755753J554031P22275R29718Q18100K95410M01764M60052P13806Q88977R58405
2988.6F84498291R00955J304932J046676M06189K99683K27890K38037m6463J83716
2997.3F89059906J16425j50605j77612j97144M9820J4878M37774K42157j05590J39846
3006.9F89429855J13602O9504m65851n93109l22952o00892p28912j6174k28195j062928
3016.6F85593948n78079l04489m3259o6986m86984l89328l50952l18070n03234r18427
3026.2F81634140j332397o07911l19366j147995j067047j036301p27691l50342l15094
3034.9F74729996l5935l1433n55343j048813r39408j146392j208268j126861r72290
$$ y = [664848938, 665706711, 666642303, 668202515, 669537125, 671060867, 672505112, 673935394, 675320053, 676755753, 678309784, 679032059, 679961777, 680779877, 681075287, 681477051, 681937103, 682650909, 683539886, 684498291, 685399246, 686704178, 687750854, 688157043, 688456726, 688684616, 688922653, 688876190, 689059906, 689176331, 689025726, 688848114, 688650970, 688700790, 688715668, 689153442, 689395599, 689290009, 689429855, 689543457, 689612961, 689147110, 688554001, 688231049, 687630157, 686901245, 686885071, 686656876, 685593948, 685015869, 684711380, 684668121, 684601135, 684114151, 683724823, 683373871, 683055801, 682552567, 681634140, 680301743, 679693832, 679374466, 678226471, 677159424, 676123123, 675395432, 675045090, 674729996, 674694061, 674662628, 674107285, 673058472, 672119064, 670972672, 669764404, 668637543, 667665253]
3043.6F67665253q07572j074981o07758n44052q57086p90711o55670l01895l83530
3052.2F61641998p04269r10874p88269j123886j501083j007690r03931r77402j111832
3060.9F52612762j321792p58820l31650n33752j17340k22473j217194j009826o44455
3069.6F46455460j146317j223373r01032j184006q81500m70047j297149j374054p15523
3078.3F37262459n37186n62286l17765o65626j194496n11551n73158j468773j531410
3087F29900208q09098o57158p58857n56679j028595j143913r14193l52401l80555j111145
3096.6F22187614q51059n18302m42200j218758j334419q62198j036873q33282r84993
3105.3F14105530q96683q55598o93398q51097j251030o54259o01730n22080o36940
$$ y = [667665253, 666857681, 665782700, 665174942, 664630890, 663773804, 662983093, 662327423, 662025528, 661641998, 660937729, 660026855, 659238586, 658114700, 656613617, 655605927, 654701996, 653724594, 652612762, 651290970, 650532150, 650200500, 649666748, 649549408, 649326935, 648109741, 647099915, 646455460, 645309143, 644085770, 643184738, 642000732, 641119232, 640649185, 639352036, 637977982, 637262459, 636725273, 636162987, 635845222, 635179596, 633985100, 633473549, 632900391, 631431618, 629900208, 629091110, 628433952, 627675095, 627118416, 626089821, 624945908, 624031715, 623679314, 623298759, 622187614, 621336555, 620818253, 620376053, 619157295, 617822876, 616960678, 615923805, 615090523, 614105530, 613208847, 612353249, 611659851, 610808754, 609557724, 608903465, 608301735, 607779655, 607142715]
3114F07142715p78045r20067j381378j028824r81331q51211n80407q32252j092949
3122.6E98696251o71158n45578j062775j140747r25178k99492l71513m17443o35948
3131.3E92626419j307182j306648j347542o21453n75180o90231p40852j123848o04248
3140E84309235p49398p90062j173400q98095n47218j224289q87833r71489o10160r37195
3149.6E75520096j473808j079178r76296p2975l59535p96700q18939p57637k73971
3158.3E68911057q46177r83657p51725q60405r57298o19469r34791j354447n69267
3167E61033821q00094q62618m89540p08656n94025o80809q06732o32553m87938m35295
3176.6E54535561p56836j520577j154747o04820r83048r62944o59370l18413n55267
$$ y = [607142715, 606364670, 605444603, 604063225, 603034401, 602053070, 601201859, 600621452, 599789200, 598696251, 598025093, 597479515, 596416740, 595275993, 594350815, 594051323, 593679810, 593262367, 592626419, 591319237, 590012589, 588665047, 588043594, 587468414, 586778183, 586037331, 584913483, 584309235, 583559837, 582769775, 581596375, 580698280, 580151062, 578926773, 578038940, 577067451, 576457291, 575520096, 574046288, 572967110, 571990814, 571917839, 571558304, 570761604, 569942665, 569185028, 568911057, 568064880, 567081223, 566329498, 565469093, 564511795, 563892326, 562957535, 561603088, 561033821, 560233727, 559371109, 558881569, 558172913, 557578888, 556898079, 556091347, 555458794, 554970856, 554535561, 553778725, 552258148, 551103401, 550498581, 549515533, 548552589, 547893219, 547574806, 547019539]
3185.3E47019539r41849o08024m21753q11539q95004n65834o31791o20918p44705q28819
3195E39949303p95250p41005p57256r24377o22597n83115n8975j35116r67446r24034
3204.6E33440132o81496m63676j078377r36279n86624o50444m02260q87184n48439
3213.3E27205353m90608p27692p85904o31828K09732k11487q79936j199684r13086
3222E21574860o21300p26204m21715l31955k53906q83102j043511q21152p56874j51977
3231.6E15563164j56632L4447R7122l63579p75222j023331o92787m82483q43964p12967
3241.3E10643768k62985n17349n90706r61227o32897M03023k480n82275p17773m36974
3250.9E06342125k57568o35033j099434o17523k3575p86171q44994m56237j71471l37410
$$ y = [547019539, 546077690, 545469666, 545047913, 544236374, 543341370, 542775536, 542143745, 541522827, 540778122, 539949303, 539154053, 538413048, 537655792, 536731415, 536108818, 535525703, 535466728, 535331612, 534364166, 533440132, 532758636, 532294960, 531216583, 530280304, 529693680, 529043236, 528640976, 527753792, 527205353, 526714745, 525987053, 525201149, 524569321, 524779053, 524567566, 523687630, 522487946, 521574860, 520953560, 520227356, 519805641, 519473686, 519219780, 518336678, 517293167, 516472015, 515715141, 515563164, 515406532, 515440979, 515538101, 515174522, 514399300, 513375969, 512683182, 512200699, 511356735, 510643768, 510380783, 509863434, 509272728, 508311501, 507678604, 508081627, 508079147, 507496872, 506779099, 506342125, 506084557, 505449524, 504350090, 503732567, 503708992, 502922821, 502077827, 501621590, 501450119, 501112709]
3260.5E01112709o11191k98309m62113j88293k84004l27454n52215j077385n75104
3269.2D96736641l84369l78494o84700m59061k98271j42861L4981q35914k39601k08207
3278.9D93140144l05633L4370o94885m49257l41492k92282j90429k17286l84445r60274
3288.5D89338531n13343L0212K7771l41263l38554k45819n86891k39525j71890m72565
3298.2D86486664j96152l47557q07877n10063l05137l66478k98615j69144J57166q125
3307.8D83634682m74205n55344j82953k9602k7580m13399j088409p66449l09868k62642
3317.4D79524231o08482k51389P9918m71077k01378j65367o3133m84963j029014j90468
3327.1D76138878J06125j01509q60482j025734m30717k95715n51300n61791L58696
$$ y = [501112709, 500501518, 500203209, 499741096, 499552803, 499268799, 498941345, 498389130, 497311745, 496736641, 496352272, 495973778, 495289078, 494830017, 494531746, 494388885, 494423866, 493587952, 493348351, 493140144, 492834511, 492868881, 492173996, 491724739, 491383247, 491090965, 490900536, 490683250, 490298805, 489338531, 488825188, 488855400, 488883171, 488541908, 488203354, 487957535, 487370644, 487131119, 486959229, 486486664, 486290512, 485942955, 485135078, 484625015, 484319878, 483953400, 483654785, 483485641, 483642807, 483634682, 483160477, 482605133, 482422180, 482392578, 482364998, 481951599, 480863190, 480096741, 479786873, 479524231, 478915749, 478664360, 478744278, 478273201, 478071823, 477906456, 477843323, 477358360, 476329346, 476138878, 476245003, 476143494, 475283012, 474257278, 473826561, 473530846, 472979546, 472417755, 472776451]
3335.8D72776451m07791r89876J47057j89133o14395j49727k63939n17464k95219k36893
3345.4D69259071l38668o24810q32596o30455j43394l8109n90324k27623J5831l26462
3355.1D65522461m58565k73475k10915j025238p58324m87823p39556n67817m37737
3363.7D60563011J05972k24838p04307p24450k03247L88375L547m01115q32100p09724
3373.4D57261124l48893j91154o33431p60383l395k91138o24580n37796K67181N25208
3383D54662743n17159p57027k31285M24881l01933q51021p42149n99785K55508o12335
3392.7D50730438j081276O6452P31087O50177n66826n51185L70178K5711j53237K90986
3402.3D50512505l26119r91173n18913j50223O9618j65596m73747J5640J80855L47023
$$ y = [472776451, 472368660, 471378784, 471525841, 471336708, 470722313, 470572586, 470308647, 469791183, 469495964, 469259071, 468920403, 468295593, 467462997, 466832542, 466689148, 466651039, 466060715, 465833092, 465848923, 465522461, 465063896, 464790421, 464579506, 463554268, 462795944, 462308121, 461568565, 461000748, 460563011, 460668983, 460444145, 459739838, 459015388, 458812141, 459200516, 459204063, 458802948, 457970848, 457261124, 456912231, 456721077, 456087646, 455327263, 455323868, 455032730, 454408150, 453870354, 454137535, 454662743, 454145584, 453388557, 453157272, 453582153, 453280220, 452429199, 451687050, 451087265, 451342773, 450730438, 449649162, 449715614, 450446701, 451096878, 450530052, 449978867, 450349045, 450374756, 450221519, 450512505, 450186386, 449195213, 448676300, 448526077, 448595695, 448430099, 447956352, 447971992, 448152847, 448499870]
3412D48499870L66097q8120O3820k7923j44921m58259n76020L32718l07808m78973
3421.6D47180481J31798m16870J07460N09872O07948M46358m20685J52474Q06160K02560
3431.2D49307556j5488m19960p18994J74599L54080P1068j18942L03421M58374r9068
3440.9D49296646N85289L49350N45693O45141K42310Q40912q05436l9749R85375j88370
3450.5D52457161k4185N2528r4490j82304P57866J288185Q14171L65867%N88761N28869
3461.1D56552429k5902m24652L63427O21414L85360P63932j98899M57344R35975L43208
3470.8D59773636N92232Q71086R64241N2757J95160L52898J12495O76193M38957n7411
3480.4D63972244N99861O86837k03629R33533N80520Q4572J188126K95029J94587O30875
$$ y = [448499870, 448865967, 448777847, 448841667, 448813744, 448668823, 448210564, 447634544, 447967262, 447659454, 447180481, 447312279, 446895409, 447002869, 447512741, 448120689, 448567047, 448146362, 448298836, 449104996, 449307556, 449292068, 448872108, 448153114, 448327713, 448681793, 448752861, 448633919, 448937340, 449395714, 449296646, 449881935, 450231285, 450776978, 451422119, 451664429, 452505341, 451699905, 451660156, 452645531, 452457161, 452432976, 452485504, 452391014, 452208710, 452966576, 454254761, 455068932, 455434799, 455434799, 456023560, 456552429, 456526527, 456101875, 456465302, 457086716, 457472076, 458236008, 458037109, 458494453, 459430428, 459773636, 460365868, 461236954, 462201195, 462253952, 462449112, 462802010, 462914505, 463590698, 464029655, 463972244, 464572105, 465258942, 465055313, 465988846, 466569366, 466653938, 467842064, 468137093, 468331680, 468962555]
3490.1D68962555P67250J110306J017532K70310j29662N65147L5134J10130Q20122
3498.7D73528824J079025J071129P58591L48358n00832N8251Q30993J145363R51157
3507.4D79270859J658706P92199j712914L33634P75795M09355Q24737P60384J278381
3516.1D84391136P02782O69327O60362O81381Q97560J215096M71344r24912Q18520
3524.8D89582596J066398M65203P5073J80550O65054O02837J389045J510659J050415
3533.5D96587830K72865R04388J4344k25716K197075R08584L92685N92614Q22982O64826
3543.1E03132477j24779J57242k60277J274643M43802J147957K314529K227097J817245
3551.8E12129936j539955P33910J082000Q76732J498604m10118J470871J754303o599
$$ y = [468962555, 469729805, 470840111, 471857643, 472127953, 471998291, 472563438, 472598572, 472708702, 473528824, 474607849, 475678978, 476437569, 476785927, 476285095, 476343346, 477174339, 478319702, 479270859, 480929565, 481721764, 480008850, 480342484, 481118279, 481527634, 482352371, 483112755, 484391136, 485093918, 485763245, 486423607, 487104988, 488002548, 489217644, 489688988, 488764076, 489582596, 490648994, 491114197, 491189270, 491369820, 492034874, 492637711, 494026756, 495537415, 496587830, 496860695, 497765083, 497779427, 497553711, 499750786, 500659370, 501052055, 501644669, 502467651, 503132477, 503007698, 503164940, 502904663, 504179306, 504623108, 505771065, 508085594, 510312691, 512129936, 510589981, 511323891, 512405891, 513282623, 514781227, 514371109, 515841980, 517596283, 517589684]
3560.5E17589684l27073K524949J363906M51165N253753j63460k155151n56106k67106
3569.1E23714561M565125J512375O13327J593017J367569J61744P67822K520141O88439
3577.8E37504120K274132J106834l6240K458230K737655Q92944k30522M310265P71179
3586.5E51788597l490944J771164j281967K402916L689880M006310J150131K63634
3594.2E60299721L111572k716637K410241M042129P26585L237343k47154k44789K261276
3602.9E72880287J783104J975517L763276K162437k968597L969345j249466q74176
3610.6E81441727R060020p93915l828315M454498j537476N105744N483665j281128
3618.3E98104820J363983k140045J08185M020996K868157K003936K847367K417450
$$ y = [517589684, 517262611, 519787560, 521151466, 521602631, 526856384, 526692924, 524537773, 523981667, 523714561, 528279686, 529792061, 530405388, 531998405, 533365974, 533527718, 534295540, 536815681, 537504120, 539778252, 540885086, 540848846, 543307076, 546044731, 546937675, 546707153, 551017418, 551788597, 548297653, 550068817, 548786850, 551189766, 554879646, 558885956, 560036087, 560299721, 563411293, 560694656, 563104897, 567147026, 567873611, 571110954, 570863800, 570619011, 572880287, 574663391, 576638908, 580402184, 582564621, 579596024, 583565369, 582315903, 581441727, 590501747, 589707832, 585879517, 590334015, 588796539, 593902283, 599385948, 598104820, 599468803, 597328758, 597436943, 601457939, 604326096, 606330032, 609177399, 611594849]
3626F11594849J864547P240868j520233j5458412N143280O472931O580696K16560l293991
3634.7F18841095K972412L655624J649209o79894J333771K832527K915802O27823m71687
3643.4F33676682K293548L779793N912132m526367o609764M908829k552109l227005
3651.1F33655739R37958P240257N641098N089722M337158j1448822K701187O396789
3658.8F54551086O51627J271973O46515J738128J102982R80911Q40073N14373M759598
3667.5F67057266K360153k226944j861190q294373M101868J0721130J0537110k495041
3675.2F79899979k4471665M244690J0024491N663833l207855k23389L832703K384186
3682.9F78146973J501770O80313J200943M673080O069412j2439651n340500R329071
$$ y = [611594849, 613459396, 620700264, 619180031, 603721619, 608864899, 615337830, 621918526, 622135086, 618841095, 621813507, 625469131, 627118340, 626438446, 627772217, 630604744, 633520546, 634148369, 633676682, 635970230, 639750023, 645662155, 641135788, 634526024, 639434853, 636882744, 633655739, 634593697, 641833954, 647475052, 652564774, 656901932, 645453110, 648154297, 654551086, 655202713, 656474686, 657121201, 658859329, 659962311, 660943222, 661783295, 662297668, 667057266, 669417419, 667190475, 665329285, 657034912, 661136780, 671857910, 682395020, 679899979, 655428314, 659673004, 669697495, 675361328, 672153473, 671930084, 675762787, 678146973, 679648743, 680329056, 681529999, 686203079, 692272491, 679832840, 674492340, 683821411]
3690.6F83821411m784241J368790N836334J60599J616669j3962j73416J736221J121292
3699.3F90689697L953476L078156p830506k354736O299896J542435l04108K86560K882309
3708F98243179M297562j0615387L587952N924530j4792099N401458N725632R11789
3715.7F98684616O11801K273560J194916l802262K170716O225509o239776m363175
3723.4F96755905P110901O10657j078797l140564K81220N176010J230392N599289m502716
3732.1G08042297q933410J0175247j885529j3409500J079636M085769K675858M763184
3739.8G06593552L548355n119095M429855J3656845j5353012j7143554J3471679P027359
3747.5G11111984N388260o630707j1002197J4374466p564774r423065Q411408O812286
$$ y = [683821411, 679037170, 680405960, 686242294, 686402893, 688019562, 688005600, 687832184, 689568405, 690689697, 694643173, 697721329, 689890823, 687536087, 693835983, 695378418, 695074310, 695360870, 698243179, 702540741, 691925354, 695513306, 701437836, 686645737, 692047195, 697772827, 698684616, 699296417, 701569977, 702764893, 698962631, 701133347, 707358856, 701119080, 696755905, 703866806, 704477463, 703398666, 700258102, 700539322, 705715332, 706945724, 712545013, 708042297, 699108887, 709284134, 707398605, 693989105, 695068741, 699154510, 701830368, 706593552, 710141907, 705022812, 709452667, 723109512, 707756500, 690612946, 704084625, 711111984, 716500244, 709869537, 698867340, 713241806, 705677032, 696253967, 704665375, 711477661]
3755.3G11477661M007721n875397K772141N954132j0384750q63724O274872J821670
3763G15184326M00543L256760l796463m362030M059067M717102j294251j0630798L189697
3771.7G10723953M945832Q47015J512299J06201Q23898N30090K573090j216278q888855
3780.3G11957245L747024L264237J195831J775971m301987p93686K040787J634598
3788G20520020P17620o89239R04388N3635M95148N85022J648712K576446o904754m580078
3797.7G15326920L886108N443802O053161j0728912j2375641O679306N145035O126556
3805.4G25556335O284562j3062439m163666O897354K808838Q06427N72128J05210J180038
3814.1G26984787N238876n305023j5806503Q284530P345734N695877N5390k2301255
$$ y = [711477661, 715485382, 709609985, 712382126, 718336258, 707951508, 707087784, 713362656, 715184326, 715584869, 718841629, 715045166, 710683136, 714742203, 719459305, 718165054, 707534256, 710723953, 715669785, 716516800, 718029099, 718135300, 718959198, 719489288, 722062378, 720846100, 711957245, 715704269, 718968506, 720164337, 721940308, 717638321, 716844635, 718885422, 720520020, 721237640, 720548401, 721452789, 721506424, 722001572, 722586594, 724235306, 726811752, 719906998, 715326920, 719213028, 724656830, 730709991, 719981079, 707605438, 714284744, 719429779, 725556335, 731840897, 718778458, 714614792, 721512146, 724320984, 725127411, 725699539, 725804749, 726984787, 732223663, 726918640, 711112137, 719396667, 726742401, 732438278, 732493668, 710192413]
3821.8G10192413M434128Q175278L728256K384567j330413n522080J060104L547440
3829.5G26669693L776550L62931r732895M791031P849121q415223n47714R724350q977661
3838.2G25500183n788116Q493499o252746N52215P596589l474350l339539L584595
3845.9G26872330K623520P55081J485824k160110K584686Q725739p719651n51528j9356385
3854.6G13259506K063141J2497177j581039k79007L722687L357696L466416p909165
3862.3G28597412j326599O491470p666549m432450O339112O975402O408844j1555328
3870G29831314j0334015N285034P688599M062347j2872924J888046O583481O01577
3877.7G32733459K583619M322433r744873q919449Q480683K518158K055892M283066
$$ y = [710192413, 714626541, 722801819, 726530075, 728914642, 727584229, 722062149, 723122253, 726669693, 730446243, 730809174, 721076279, 725867310, 733716431, 725301208, 724753494, 734477844, 725500183, 719712067, 728205566, 721952820, 722505035, 730101624, 726627274, 723287735, 726872330, 729495850, 730250931, 731736755, 729576645, 732161331, 740887070, 733167419, 732615891, 713259506, 715322647, 727819824, 726238785, 725959778, 729682465, 733040161, 736506577, 728597412, 727270813, 733762283, 726095734, 721663284, 728002396, 734977798, 741386642, 729831314, 719497299, 724782333, 732470932, 736533279, 723660355, 725548401, 732131882, 732733459, 735317078, 739639511, 729894638, 720975189, 729455872, 731974030, 734029922, 738312988]
3885.4G38312988j6253662L234711N832825J606674N847397k281571j1277389K775421
3893.2G27797394M845962r91058J907959J403198J857376J017685j0763473O823654
3900.9G33898697K203064p543411M450378m141617j105575J117935K328796L625488
3908.6G34833755q08181l03879p3547N53207m9362o77719K202835K582779m853592
3917.3G33406296m579544N619125K62528m169693L247757J688385O7901l058395j865845
3926G30618515K920227J834946J803436j093292q53958J486511m177551j544190K608872
3934.6G33603516M42733M65546M51660m19006M58984M13819J843185J26114o048966
3943.3G31337585k94799K623214K175599J627120l225326J91803K76337k056885K637863
$$ y = [738312988, 722059326, 725294037, 731126862, 732733536, 738580933, 736299362, 725021973, 727797394, 732643356, 731652298, 733560257, 734963455, 736820831, 737838516, 727075043, 733898697, 736101761, 728558350, 733008728, 728867111, 727761536, 728879471, 731208267, 734833755, 734025574, 733721695, 733648148, 734201355, 734151993, 733474274, 735677109, 738259888, 733406296, 728826752, 734445877, 734708405, 730538712, 733786469, 735474854, 735542755, 732484360, 730618515, 733538742, 735373688, 737177124, 736083832, 735229874, 736716385, 732538834, 730994644, 733603516, 734046249, 734511795, 734963455, 734544449, 735003433, 735417252, 737260437, 737386551, 731337585, 731042786, 733666000, 735841599, 737468719, 734243393, 734435196, 734711533, 732654648, 735292511]
3952G35292511R20944j292038j78833L81470k84958k12707J321334n50003K07672N60532
3961.6G36165924j488953N05143Q75778L51028M18854O6071l35617j474534l33557
3970.3G34750137J742554K74429j183471J39160J13067k01873L15780M54941J8005
3979G36422729l25012K28501J5792r7274l90549n49393M88129N75485j64261l7841
3988.6G36166306Q94546J83868n79376l22723l72772J37481k81601j02310N06058p0114
3998.3G36159363K11868P87811
4000.2G37159042
$$ y = [735292511, 736213455, 734921417, 734742584, 735124054, 734839096, 734626389, 735947723, 735397720, 735605392, 736165924, 734676971, 735182114, 736057892, 736408920, 736827774, 736893845, 736558228, 735083694, 734750137, 736492691, 736767120, 735583649, 735722809, 735835876, 735634003, 735949783, 736404724, 736422729, 736097717, 736326218, 736342010, 736244736, 735854187, 735304794, 735792923, 736368408, 736204147, 736166306, 737060852, 737244720, 736665344, 736342621, 735969849, 736107330, 735825729, 735723419, 736229477, 736159363, 736371231, 737159042]
##END=$$ End of the data block
