##TITLE=$$ Begin of the data block
##JCAMP-DX=5.00 $$ ACD/SpecManager v 10.08
##SPECTROMETER/DATA SYSTEM=Varian
##DATE=20 Nov 2012 15:00:24
##DATA TYPE=INFRARED SPECTRUM
##DATA CLASS=XYDATA
##ORIGIN=
##OWNER=
##NPOINTS=3735
##FIRSTX=399.26403809
##LASTX=4000.35498047
##MAXX=4000.35498047
##MINX=399.26403809
##MAXY=82.62727356
##MINY=42.49463654
##XFACTOR=1.0000000000
##YFACTOR=0.000000100000000
##FIRSTY=67.63132477
##DELTAX=0.96440572
##XUNITS=1/CM
##YUNITS=TRANSMITTANCE
##XYDATA=(X++(Y..Y))
399.3 676313248 672688828 660217438 655568161 664981766 664826126 658848724 656295166 656329651 662365875
407.9 662365875 664710236 663171387 663963394 665711060 670674973 672471848 668162155 664245682 662244186
416.6 662244186 659037018 643048096 636997833 650363617 656500778 658487930 665235367 666151352
424.3 666151352 655297546 657489014 664200211 656564789 648162994 649393921 652466354 652997055
432.1 652997055 652895203 645917511 641439285 644246597 645229416 647633209 651082611 656263123 657634277
440.7 657634277 655320969 656468430 654628906 651155701 652174301 656377487 655781174 654832764 658399734
449.4 658399734 662099991 663562469 660979004 663720779 670660248 672283478 668382950 662288361
457.1 662288361 657744446 658213577 657946091 655275421 656073074 654531937 651968231 655314865 660802536
465.8 660802536 663494568 658705902 658627853 661439819 660361557 657549286 641335602 636548347 641858749
474.5 641858749 640653839 638357315 634003105 630348358 634769974 640877228 641379166 643165894 646508942
483.2 646508942 649925919 653165283 649566269 645816116 645137482 642628326 639408073 635034981 632706566
491.8 632706566 633995285 635583000 639306335 642926712 644185333 643712387 642749176 643588028 641918488
500.5 641918488 637999649 636894722 636274109 634929619 632572975 628820686 626834602 628320961 628638763
509.2 628638763 625808105 625552177 628694916 628840752 627061462 627155838 627903137 623979416 616520424
517.9 616520424 611605072 607847633 606394577 605918617 607273750 610467720 611198845 611356239 612785072
526.6 612785072 614221497 614891510 614812889 613315277 609038811 606151505 605844078 606207390 607666359
535.2 607666359 608902740 610809555 613972855 616059494 619974823 625272789 628653374 629957466
543 629957466 630181084 631669083 630686722 627068214 626139183 626666107 625336227 623949318 623608208
551.6 623608208 624067078 626872063 628423309 627913551 627675438 627430077 626128044 622253571 618448143
560.3 618448143 615008926 612181053 610939407 607828255 606101646 604927559 602212143 602365265 602131729
569 602131729 600807800 600517960 599096031 596570206 595436783 594296494 592878990 592546539 591481018
577.7 591481018 591907349 592836113 594946098 599413109 603497620 606406746 607749214 610929604 614469681
586.4 614469681 617570496 619812393 620130081 620822334 620765839 618620338 617399635 617689018 617700691
595 617700691 619349327 621920357 622375183 623555145 625776520 626225548 626505928 627164268 625044403
603.7 625044403 622568283 622148933 621154327 620078850 619188004 618644600 618913345 619307098 620852737
612.4 620852737 623772697 626075363 626302719 626530380 628001480 629692574 629639320 628782387 629136276
621.1 629136276 629110298 629875374 631633987 632848969 634760017 637115250 638989830 639935608 641918869
629.8 641918869 645668411 647320633 646356125 645810623 645359421 643863068 643002930 643403931 643447647
638.4 643447647 643607559 644757233 646206970 647849121 650143509 653379517 655327759 655648346 656605377
647.1 656605377 657043762 655571442 653433304 653186569 652204208 651018066 652365036 653672180 654999084
655.8 654999084 656883163 659701309 661777344 662398682 663732986 664579010 665008621 663744278 661983414
664.5 661983414 660734787 660100479 658903961 652258224 657400131 661187057 662925415 664755478 667226486
673.2 667226486 669416275 669994354 671059723 671601105 671271057 670308762 668397293 667296906 666714554
681.8 666714554 666863632 667271271 668008423 668999481 670614395 672990341 674009247 674578857 675108566
690.5 675108566 675454102 675539474 674293365 671606827 668940887 667080154 665165710 663802261 663387680
699.2 663387680 663115463 663175735 664160080 665167770 665258636 665226135 665641098 665423889 662609406 659613419
708.8 659613419 658381424 657383728 656534042 656703033 658581543 659986725 660854034 663356094 667139435
717.5 667139435 670865097 673739929 676664276 678427963 679220200 679121628 679310150 679920502 679069824
726.2 679069824 679755936 681624985 683863831 686490555 689351196 692050858 693669128 697105713 700041351
734.9 700041351 702283630 703606873 701512146 699884644 699801025 699316711 697247009 696098175 696449585
743.6 696449585 695978165 697532349 700524979 701874237 702474899 702489777 701396255 700238342 697738724
752.2 697738724 693162155 688741379 685922546 684344635 681907883 679184418 679005432 680077057 680665665
760.9 680665665 681509247 682543030 683126221 682853012 681592255 682014465 683792496 683232956 681868896
769.6 681868896 681230621 681399078 683769379 686662903 688958130 692855377 698000336 702904358 707914047
778.3 707914047 711628723 713635254 714831848 716241302 717571716 718278046 717953186 716721649 717123947
787 717123947 718861771 721399994 723641510 725682602 729368820 732816315 735135803 736227951 737555237
795.6 737555237 738154526 737321701 737061157 736548996 736612167 737283020 737639999 738597641 740668106 742724686
805.3 742724686 744916153 747510300 750008392 753231888 754688263 754614563 754684296 753524094 750818634
814 750818634 748768082 747820969 746023483 745637970 746378555 747593918 750036469 752682266 754689560
822.6 754689560 754969025 755632019 755261078 753525314 752139435 749375534 745654221 742741394 741026993
831.3 741026993 739071045 737959595 737644043 736881561 736746292 737568970 738022995 737245789 737008896
840 737008896 735581741 732459793 729571075 726983795 724753647 722051773 719496078 717580109 717078476
848.7 717078476 717331848 717633972 718792877 719790421 720040131 718523254 716514282 715072632 713095016
857.4 713095016 710126266 706705704 703731613 701161194 700832520 702233353 704593506 707974701 711224289
866 711224289 716353149 722193604 727117844 731068268 733699951 736103897 738578339 740777969 740529709
874.7 740529709 739159012 738908920 740423050 742713089 744200516 745858612 746924515 746872330 746664963
883.4 746664963 746696701 745810623 744128265 741612320 738195572 734960022 731423645 728507690 726122437
892.1 726122437 724570541 724086914 723950424 724530640 725172653 725471878 724851913 723757782 722237396
900.8 722237396 719936447 717077332 713562164 710826721 708420258 704793701 701433868 700041504
908.5 700041504 698460007 696292419 695419006 694464951 692403336 690826950 688978271 684450378 679755630
917.2 679755630 675964355 671498032 667074738 663228683 660559998 658821487 658047104 658135605 658628387
925.8 658628387 659347916 659847488 660401611 661114731 661786194 661671371 660847092 660331497 659699478 659750748
935.5 659750748 660671768 661149445 661748276 663426743 666834412 670636368 673206635 675636139 677904739
944.2 677904739 678702011 677491837 674995422 672066879 668310776 664261780 660676498 656441956 652037430
952.8 652037430 648257141 644725494 641189117 637900810 634040527 629674301 625086327 619258690
960.6 619258690 613223343 606469879 599507370 592750053 584706917 576593781 570193138 564872932
968.3 564872932 558332901 551352310 544178734 537538261 530843925 523903809 517337036 509183578
976 509183578 501485977 493790092 485932083 478072510 471214790 465577698 459615631 455128822 449980125
984.7 449980125 446575394 444720650 442818642 441286774 438997536 437334518 435698738 435040283 433634377
993.3 433634377 432348251 431362038 430758057 431054611 430135651 430950470 431606827 432211761 432492218 432777176
1003 432777176 433902206 434346085 435383987 434079285 432949181 432501259 432150345 431034203 428505058
1011.7 428505058 427996368 426732292 426128654 425476799 425033073 425100365 424946365 426174660 426747513
1020.3 426747513 428072472 428274384 428866959 430001640 431064644 432307091 432901230 435261497 436148682
1029 436148682 438014908 439886398 441785049 444792175 446143723 448779297 450393562 451037560 450872688
1037.7 450872688 451155777 451027412 450310898 451092072 450279427 450482101 450436630 451345711 452720947 454079399
1047.4 454079399 456107597 456334991 458551140 459604683 461419258 463929634 465699120 467903519
1055.1 467903519 468569260 471280212 474223518 478549423 483015747 486645279 490732346 494602318
1062.8 494602318 500098152 505354424 510367432 513508453 515729179 516091537 513975334 511126060
1070.5 511126060 505374680 499667931 493600616 487775192 482805328 479312477 477754555 475512047
1078.2 475512047 474631767 473703079 474304085 474843407 476054573 477479477 477203407 479092026 480507011
1086.9 480507011 482713127 484855309 487427711 490399780 493039932 496460457 499189873 503179207
1094.6 503179207 505943527 508970947 511137619 511803246 512559738 512521973 513679543 513211403 513446274
1103.3 513446274 513902321 514125748 514904327 515614090 518171501 519425125 521818504 523876762 525478706
1112 525478706 527683144 528765945 530380478 531204987 532951508 533990784 535115013 536778908 537895355
1120.6 537895355 539881058 540851555 542127991 543315659 545580139 548099327 549318275 549922295 550591545
1129.3 550591545 553021202 554567642 556094666 557438278 558474693 560206947 561699905 562196465
1137 562196465 561568184 561949158 560359383 557493935 554562035 550300713 545474052 541327248 540702744
1145.7 540702744 537789879 533179207 530237274 528019371 526986504 524688530 522972794 521483116
1153.4 521483116 520980873 520959396 520769997 520621719 520089989 520560799 520090218 521173515 522333603
1162.1 522333603 523734398 526189575 528192863 531682510 535210342 539933205 544791870 549889603
1169.8 549889603 554604225 559035645 564566231 569373398 573936806 577591324 582041359 586546440
1177.5 586546440 590938148 595853691 600694923 606514130 611297836 615959740 620836830 625572014
1185.3 625572014 629582024 632694740 636095963 638402863 640005341 641234055 642568130 643800278
1193 643800278 644202805 644779129 645391006 646750717 648307114 648936310 649196548 649932404 650744171 651329117
1202.6 651329117 652060089 651632233 651160202 651396637 652003555 652972412 653476486 654856262 656300735
1211.3 656300735 657535858 659834671 662426071 665077209 667236786 668808441 670018921 670456772
1219 670456772 670689392 670743637 670811615 671098557 670882339 670425034 670581818 671029587 671469727 671825409
1228.6 671825409 671850357 672104187 671961441 670937195 669532776 668076935 667165222 666265640 665395203
1237.3 665395203 664715118 664252243 663659286 662911682 663392944 664344254 665009460 665696335 665958099 666236572
1247 666236572 666677628 666877823 666525879 666203537 666253281 666158600 666600189 667224884 667702484 668892212
1256.6 668892212 670233841 671191330 671758499 672136765 672365875 672689285 673051758 672927094 672810974
1265.3 672810974 672734985 672538376 672851486 673476257 674494019 676043472 677425995 678671799 679892426
1274 679892426 680831451 681521530 681756439 681897659 681896591 681432190 680452576 679544067 678969727 678470993
1283.6 678470993 678572617 678564987 678301010 678569565 679438705 680201950 680074997 679711609 679100266 678136978
1293.3 678136978 677497025 676862335 675385895 673656769 672316589 671256256 670884399 670619888 670334320
1301.9 670334320 670412827 670417786 669965973 669527359 669273758 668323135 667047119 665726013 663988800 662338867
1311.6 662338867 661973801 662254257 661513367 660945816 660696869 660224838 660192184 660228500 660312729 660656662
1321.2 660656662 660428619 659588776 658514786 656968765 655136337 653131332 651360703 649648056 647910385
1329.9 647910385 646571503 645430984 644542236 643582687 643061905 642268295 640649109 639412384 638225098
1338.6 638225098 636454582 635571022 636593323 636864357 636560516 636697350 637115669 637673416 638002052
1347.3 638002052 638593979 638894081 639037018 639361382 639456062 639276314 638614922 637899857 637180328 636429558
1356.9 636429558 635418205 634774475 634764252 634012260 633180618 631975594 631239395 633189697 634536514
1365.6 634536514 634173012 633629875 632173920 630910873 630899048 630339432 630299492 630006828 628487244
1374.3 628487244 628086777 629906921 631577454 631892204 632999840 633967705 635140762 635936737 635714798
1382.9 635714798 636307449 636609535 636997566 636915855 636663818 639047089 641356583 642809601 644291611
1391.6 644291611 646038208 646995468 645869675 644903030 646901703 648124695 647907715 645419464 644631424
1400.3 644631424 645987396 645755234 645093384 643928070 641313324 641296768 642425079 642865982 642604141
1409 642604141 642393646 642132111 641939011 641315155 640573349 639817314 638962212 637896194 636226044 634774551
1418.6 634774551 629834061 631539650 635076599 636567841 636770630 635533714 637566528 639747429
1426.3 639747429 640097122 640712128 640023346 638234138 638359566 639617805 639090538 639105949 641032410
1435 641032410 641144257 637847214 639298630 643557358 645513153 646457367 647947998 647943497 648306732
1443.7 648306732 648116074 648275146 647883072 645543900 643146515 643947525 645255127 644078217 643568039
1452.4 643568039 644394760 645519028 645139618 643261642 638203659 633912315 638241081 640202942 642491226
1461.1 642491226 642580872 642566986 643341751 639474144 642000809 645368958 648918381 651384048 654633331
1469.7 654633331 658498764 658654709 659080963 660778046 667812271 672189789 673113480 676194458 679821167
1478.4 679821167 682862091 684408188 686087723 688434982 692803040 696152420 698620987 701806259
1486.1 701806259 702280884 703795624 705633469 703441010 701219864 705391617 709073715 709799500 710958557
1494.8 710958557 710003281 706917496 710990143 712542953 713348923 717170944 719157028 719483185 721014023
1503.5 721014023 721774750 720435944 706506042 702081909 710002289 713017273 715615387 718200531
1511.2 718200531 718639221 719001007 722613525 723828049 723213882 722156372 720470123 725980682 727877731
1519.9 727877731 721107025 714945755 716445465 722072144 724024734 722439194 723315506 725192642
1527.6 725192642 724831009 727652206 731937485 732453918 732261887 729317398 725944824 728779144 730124512
1536.3 730124512 731426315 731752777 722804718 709638519 718247528 722074432 722952194 727910385
1544 727910385 728181381 728148880 732199173 734662399 735664139 733037796 729498825 731644897 733338318
1552.7 733338318 733286133 728555832 728679428 733428040 735535355 722880630 709316940 719824905
1560.4 719824905 730389786 735744934 738453979 738104630 734384613 734527664 735616989 735647202 734312210
1569.1 734312210 727678986 729622192 732227936 733303299 734669189 736309052 734466171 725305099
1576.8 725305099 729443893 732781754 733238297 732742538 731398544 730113449 728416824 727279053 726340485
1585.5 726340485 725518341 725451355 725359573 725003662 724169998 723922729 723348541 723046494 721407623 718887024
1595.1 718887024 717844315 715805435 714485931 712422943 710536346 709259491 708287811 707629318 706008911
1603.8 706008911 706189957 705833893 704617996 703087158 702263794 700099640 697014542 696498032 694433365
1612.5 694433365 692744370 690446243 689652863 687397156 675891724 679548798 681825714 682397232
1620.2 682397232 681635361 681859970 679641953 673023987 674256592 674470062 674022751 669342194 666882019
1628.9 666882019 667555084 666419296 665900116 664886627 665614777 666310806 659209976 657101517 659952698
1637.5 659952698 662172241 663457642 664058609 662730713 662425766 661228638 661889038 662583237 657894287
1646.2 657894287 656439362 655471344 659986343 663928986 667201080 670556717 670033569 657115631
1653.9 657115631 661584396 667718658 670627823 672289505 673430710 674328308 675106812 676104355 675910645
1662.6 675910645 675921631 680446930 683827057 686545334 689576340 690669708 687331314 689645920 693276062
1671.3 693276062 693794174 697010651 700612946 698911743 696302948 701081085 705467453 707940063
1679 707940063 709196396 709986115 714779282 718951950 716075439 708397598 714487457 721860580 725093918
1687.7 725093918 724898987 725727539 726580124 729044113 731542053 733748856 736816254 737713089 730825806
1696.4 730825806 735384979 741821823 747543793 742732849 734337387 743363495 748262863 748774719
1704.1 748774719 747133255 746826401 746036148 748807144 752546463 753468475 754191742 756434555 758359833
1712.8 758359833 759681473 757734451 756217422 758923264 756636887 748788376 755476608 759972000
1720.5 759972000 761703873 762898026 762962723 763615112 766163025 767963638 769029846 771057358 772205811
1729.1 772205811 768564072 768193130 772058334 773119812 764666290 757282486 765542068 770773697
1736.9 770773697 772133484 774160919 772097626 771067505 776944504 779576111 777141495 777623825
1744.6 777623825 780732880 781460648 780138779 778424072 778384552 781994858 780082855 779207001 784431992
1753.3 784431992 787178802 788978348 790171127 788155136 790271759 793007278 794865875 796603241
1761 796603241 791681747 790834885 793968048 794777832 795003586 795855560 795899048 792988205 795971375
1769.7 795971375 799380951 796985550 792588959 793903046 799609299 801162872 799826050 801653137
1777.4 801653137 801992035 802212372 800513611 797937241 799570236 801895447 803190689 802308044 803085175
1786 803085175 805441284 806515808 807288055 808197174 807138748 805550766 801565933 801322556 804755783
1794.7 804755783 804504623 803518372 805631638 807358322 806065445 805407639 808315659 808523407 809419250
1803.4 809419250 811129532 810837326 811112671 810716858 809592819 809906158 809823227 807723694 807858887
1812.1 807858887 808995819 809907684 811390381 812404327 813488312 813446503 814150467 815181122 814524155
1820.8 814524155 813841629 812423782 813065796 813116302 809006653 809803772 812400818 813968506 812342682
1829.4 812342682 808532181 811756897 815295258 815908051 815803833 815959015 815939331 814876862 814155960
1838.1 814155960 814534149 813825684 813901291 814107208 815173874 814531479 809045563 812678223 816373978
1846.8 816373978 816682587 816320724 816949081 817418289 816730194 816356430 815591049 814955215 814583054 814892044
1856.4 814892044 815423660 815007172 815678635 816467590 816737595 816827621 817393494 818005829 818086624 817653656
1866.1 817653656 815751572 814853134 812740097 811373291 813472595 814982071 815707932 816167755 816727295
1874.8 816727295 817098923 817847595 818486938 818702469 818577576 817961731 818051605 817779160 817402039 816528931
1884.4 816528931 815753708 816257095 816732407 817846603 817231979 815332336 817239151 819203262 819363327
1893.1 819363327 819699631 818964462 817284775 817741165 818259354 817994919 817291260 816867828 817144852
1901.8 817144852 817584534 818249817 818417358 819105911 819780655 819518738 819021530 818636551 818266220 818331070
1911.4 818331070 818765030 818207245 818240356 817926712 817890244 818562622 815781403 815864639 818040924 819287033
1921.1 819287033 819792175 817794495 817544479 819176865 819522171 818826065 818465652 818074036 817632980
1929.7 817632980 817616959 817850189 818270187 818019943 818240509 818615417 818940887 819447021 819331284 819226532
1939.4 819226532 819074097 819546509 817759628 815342331 817122726 817449875 816371994 816737747 817730408
1948.1 817730408 818158112 818314362 818819046 819212875 819620972 819704590 819104767 818349991 818185120 818085785
1957.7 818085785 817852173 817770615 817546005 817544861 817590637 817825928 818264084 818810883 818864059 818321457
1967.3 818321457 818941650 819743958 819683762 819290314 819141617 818695984 817981720 817606201 817308655 817525406
1977 817525406 818130569 818695145 818813629 819020157 819570847 819703674 819886703 819727936 819216232 818652878
1986.6 818652878 818075485 817669144 817720871 818456116 817806244 816061935 816723175 818251953 818968048
1995.3 818968048 819246063 819191818 819136887 819344940 819220505 818969727 818400269 817911911 817786636 817525482
2005 817525482 817186432 816722183 817002106 817551956 817686462 818052444 818401871 818528137 818465652 818506012
2014.6 818506012 818247452 816914368 815737228 815936356 815917587 815456772 815446777 815639954 815945206 816028671
2024.2 816028671 816430359 816811981 816657333 816734848 816590576 816363907 816178818 815873489 815579910 815406418
2033.9 815406418 814831238 813999100 814278564 814738770 814583282 814539032 814832458 814728012 814686737 815020599
2043.5 815020599 814608994 814434738 814287567 814011078 813783569 813180084 813136520 813105621 812835388 812568283
2053.2 812568283 812783279 813324890 813879013 814571075 814646988 814453430 813889847 813872833 814125748 813707428
2062.8 813707428 813574524 812858505 812078171 811969070 812352371 813132782 813600540 813689270 813758774 814297104
2072.5 814297104 814578705 814723434 814737396 814187393 813619614 813242187 812845306 812152252 812188110 812559586
2082.1 812559586 812583694 812810516 812963562 813235397 813703308 814139023 814457092 814661255 814282455 813869858
2091.7 813869858 813848572 813470688 813111572 812798233 812641907 812636414 812903366 813297424 813433151 813925400
2101.4 813925400 814118576 814263229 814498367 814253159 814253464 814086456 813516083 813517151 813811035 813483582
2111 813483582 812943420 812863998 813394623 813511353 813357391 813944778 814643860 815234604 815000153 814661255
2120.7 814661255 814790344 814422913 813900909 813098373 812582550 812651367 812808228 812842941 813241577 813856277
2130.3 813856277 813933182 814299088 814857635 815279846 815146942 814817276 814648285 814304886 814096756 813290176
2140 813290176 812824402 812623749 812455368 812750931 812924423 813497543 813945847 814572296 815009155 815145721
2149.6 815145721 815200119 814615631 814393082 814044571 813863602 813748398 813441849 813213501 812906342 813051834
2159.3 813051834 813176956 813978577 814674759 814822922 815204391 815241623 815282669 814953461 814525223 814295120
2168.9 814295120 814191589 814038239 813816605 813713379 813349380 813548431 814176102 815005341 815712662 815967331
2178.5 815967331 816172714 816537857 817144775 816892090 816343842 815765228 815136871 815093460 815103149 815083466
2188.2 815083466 814868240 815040894 815535660 816268845 817142181 817400589 817670441 817845078 817868500 817651138
2197.8 817651138 817050629 816602173 816362076 816044159 815882645 816006165 816020432 816530151 817312927 818113251
2207.5 818113251 818792725 818835297 818710556 818567200 818573227 818376541 818129883 818047028 817796402 817191925
2217.1 817191925 816677017 817001419 817393875 817948914 818369217 818773651 819442062 819666061 820046158 819904633
2226.8 819904633 819448471 819243851 819160538 818935699 818139954 817629471 817550049 817936249 818278427 818683701
2236.4 818683701 819159851 819633026 820492859 820643692 820481567 819998627 819735641 820128860 819810867 819029160
2246 819029160 818362122 818170242 818311310 818542709 818613815 819029770 819538040 819867325 820681763 820866852
2255.7 820866852 820691452 820370178 820368729 820396423 819646378 819151917 818156662 817713623 818124924 818504944
2265.3 818504944 819019241 819634323 820388489 820221786 820347519 821055984 821378326 821070938 820209274 819865112
2275 819865112 819599075 819145126 818561325 818528824 819012680 819518585 819756851 819755859 820142670 820219193 821102295
2285.6 821102295 821984558 821715240 821250839 820430603 820247498 820160828 820002518 819478989 818993530 819223404
2295.2 819223404 819411240 820342941 820893631 821126633 821571121 821844559 822015991 821819916 821704941 821057892
2304.9 821057892 820936813 821003799 820681000 820674210 820572739 820922470 820990067 821291580 821520233 821355896
2314.5 821355896 821933365 823001022 823693848 823145905 822811356 822597275 822575455 822308273 820912781
2323.2 820912781 820723343 821362457 822310486 822789383 822996063 823512650 824305801 825040283 824351196 823804245
2332.8 823804245 823749695 824307251 824204559 822726746 821946335 822047348 822742081 822023468 821466827 821767273
2342.5 821767273 821688995 822538528 822795563 821760254 820554504 820835876 822883530 824412766 823757248
2351.2 823757248 823133316 822796936 822613068 823568192 823984909 824894867 823891678 821304016 821487656
2359.8 821487656 823276978 825359573 826272736 825646210 822724533 820826874 821367264 821097336 820899811
2368.5 820899811 820427628 819188538 818438644 819152222 819774628 818647156 817854156 818275452 818675232
2377.2 818675232 818357620 817883530 817582245 816980057 816192703 815261230 814409332 814120560 814155350 814348984
2386.8 814348984 814433670 814655838 815389862 815438461 815029907 815009232 814990082 814877472 814464188 814034348
2396.5 814034348 813674469 813535538 813449936 813196335 813203201 813129807 813323898 813293839 813004990 813675995
2406.1 813675995 814332275 813884811 813339539 813364563 812737045 812046432 811869507 811591492 811388931 810948563
2415.8 810948563 810654526 810618515 810947723 811206512 811266479 811472244 811205292 811386261 811466141 811031723
2425.4 811031723 810574570 809934006 809808350 809750061 809365540 808592606 808111191 808249741 808592072 809057159
2435.1 809057159 809168167 809278488 809057693 808699875 808648071 808543243 808168335 807476273 807301331 806882782
2444.7 806882782 805966949 805744705 806028061 806154938 806185989 806299438 806258316 806252747 806091461 806070175
2454.3 806070175 806162186 805812759 805400543 804891434 804478302 804110489 803658066 803364182 803491135 803751297
2464 803751297 803765564 803935394 803987961 804083481 804209976 804107742 803716507 803045654 802665024 802221146
2473.6 802221146 801687317 801281967 801195068 801214905 800938187 800802994 800928726 801471329 801823044 801631851
2483.3 801631851 801211777 800865631 800873032 800584335 799776230 799217148 799178391 798785629 798473282 798550568
2492.9 798550568 798762970 799107056 799105911 799520340 799482498 799104538 799168549 798814392 798663483 798303452
2502.6 798303452 797842636 797312775 796685562 796711884 796631622 796616745 796879196 797214737 797558746 797832794
2512.2 797832794 797721329 797322769 797125015 796686630 796206055 795690689 795563202 795507126 794897995 794756851
2521.9 794756851 794909363 795296402 795533981 795312424 795289230 795573654 795801468 795262451 794830170 794508057
2531.5 794508057 793633041 793441620 793736649 793463135 792882462 792680206 792888489 792836456 792862091 793219528
2541.1 793219528 793090515 792796402 792510910 791918564 791228561 790690765 790536118 790213318 789741821 789708557
2550.8 789708557 790114212 790165024 790051804 790470810 790368195 790279465 790416870 789948502 789165649 788462143
2560.4 788462143 788452759 788465881 788203583 787785568 787482452 787419510 787044144 786873245 786733551 786895447
2570.1 786895447 787343903 787308655 787030487 786716461 786221695 785700226 785717773 785336533 784941025 785100327
2579.7 785100327 785121307 785210648 784988480 785021057 784831009 784450912 784788361 784686508 784060974 783566208
2589.4 783566208 783537216 783254776 782999420 782960129 782452545 782411499 782446671 782389832 782307053 782038574 781981354
2600 781981354 781963501 782088242 781897736 781561813 781342010 780901642 780470657 780233078 780134811 780146408
2609.6 780146408 780353241 780183182 779650192 779371262 779313049 779173813 779011078 778800812 778283386 778154526
2619.3 778154526 778255310 777837143 777183609 776751862 776493988 776193466 775991058 775670776 775610962 775758896
2628.9 775758896 775325928 774659348 774311981 774194794 773815002 773321838 773136826 773155518 772559891 771718216
2638.5 771718216 771467590 771146164 771226654 771300735 770836563 770594864 770206451 769968109 769658737 768936081
2648.2 768936081 768507690 768053818 767265396 766796188 766939087 766911316 766361771 766027145 765987549 765634003
2657.8 765634003 765312576 765274658 765283432 765069580 764309158 763744202 763529510 763319321 763326492 763053513
2667.5 763053513 762369385 762120972 762033997 761388092 761226273 761528778 761312790 761103973 761175537 760919037
2677.1 760919037 760096207 759515228 759405823 759382477 759145432 758789749 758639297 757964249 757222290 757277679
2686.8 757277679 757369919 756942444 756597748 756916046 757063141 756534729 756184464 756235046 755697174 754931564
2696.4 754931564 754866028 754638901 753875122 753444595 753618011 753437500 752936096 752742233 752322769 752016525
2706 752016525 752146835 751920395 751301727 750788422 750340195 750250702 750282135 749755630 749109344 748596420
2715.7 748596420 748406906 748401031 748456421 748624115 748496399 748140869 747574387 747214050 746902237 746411819
2725.3 746411819 746035004 745651398 745530167 745198898 744775620 744631653 744590530 744820709 744675674 744149780
2735 744149780 743848267 743878479 743796082 743150253 742619019 742396164 741746140 741242523 741182480 740912018
2744.6 740912018 740847855 740758438 740926361 741569519 741586914 741245193 740762558 740276871 739924698 739699478
2754.3 739699478 739357071 738666077 738385239 738189392 737828751 737526474 737574081 737802963 737791214 737996521
2763.9 737996521 737750854 737396698 737681046 737774887 737217636 736588211 736429138 735982666 735372543 735245667
2773.5 735245667 735265427 734831467 734308472 734205399 733957214 733698349 733493958 733578491 733828812 733743896
2783.2 733743896 733292770 732326050 731890869 731581955 730887756 730575790 730062103 729355927 729062729 729049530
2792.8 729049530 728840637 728711243 728638916 728367538 728260574 727815857 726890259 725785446 724872360 724291000
2802.5 724291000 723761292 723500748 723171539 722485199 721711044 721221924 721395493 721673050 721238937 720434265
2812.1 720434265 719745483 718781052 717626114 716833420 716270752 715580139 714701538 713872299 713594131
2820.8 713594131 713480225 712789993 711986465 711260757 710328979 709434357 709094086 708929138 708041840 706889267
2830.4 706889267 705600052 704098511 703030853 702090607 700959854 699982681 699601593 699599762 698960419
2839.1 698960419 697732468 696443176 695053329 693734970 692160034 690117264 688146820 686366043
2846.8 686366043 684359360 681956406 679824066 678224335 677111893 676380539 675653229 675243988 674918518
2855.5 674918518 674472885 674173584 673818436 673376923 672652359 671774902 671140900 670587769 669828186 668677673
2865.2 668677673 667257080 666405945 665580139 663805695 662651825 661896973 660280609 658518753 656815262
2873.8 656815262 655430527 654079971 652237473 650394363 648609161 646768265 645704956 645239639
2881.6 645239639 644053192 642729721 641962967 641636734 641227646 640229263 639505615 639024734 638482399
2890.2 638482399 637840424 637166939 636959496 636699905 636141052 635541649 635062561 634714928 634596634 634887466
2899.9 634887466 635067177 634705544 634223938 633775864 632731438 631571350 630665894 629547234 628030167
2908.6 628030167 626642570 626023560 624937248 623278236 621850281 620474129 618882713 616799507
2916.3 616799507 615150375 613820381 612307854 610713158 609010277 607882767 606747513 605001831
2924 605001831 603648720 603403511 603267632 603000221 603079796 603322983 604217491 604876671 605036926 605623817
2933.6 605623817 606501617 607169342 607732010 609202461 610795746 611941910 613641205 615853386 617840538
2942.3 617840538 619695854 621963730 624410973 626976585 628932953 630345459 632404556 634448814
2950 634448814 635718651 636782379 637853012 638668785 640027466 641885834 643418655 644920273 647022934
2958.7 647022934 649517899 651654358 653817139 655819931 657479477 658949509 660080872 661323853
2966.4 661323853 662530746 663520966 664351044 665680618 667373047 668624496 669993973 671754532 673313522
2975.1 673313522 674531784 675998611 677444687 679055939 680560760 681067276 681456070 682165451 683125076
2983.8 683125076 683545914 683672028 684576416 685654373 686545181 687434921 688552322 689330215 689665146
2992.5 689665146 689992981 690237885 690306320 690423126 690740509 690621567 690733414 691046982 690925293 690717392
3002.1 690717392 690626526 690718613 690480347 690812531 691257858 690925674 690890350 690836868 690391235 689764557
3011.7 689764557 689106750 688679276 688477936 687598190 686715622 686630402 686211929 686291046 686435394 685852051
3021.4 685852051 685411987 685112686 684795456 684127426 683370895 682572250 681712036 680793381 680173950 679476013
3031 679476013 677781067 676920090 676836014 676374054 676264496 676377258 675708618 674681549 674156952 673216019
3040.7 673216019 671906128 670790253 669930496 668866119 667363434 666761780 666603470 665643463 664599609
3049.4 664599609 664372559 663938293 663177567 662758255 661790085 660712204 659699554 658323517 657215424
3058 657215424 656592636 655787659 654497757 653701935 653425217 652789078 651719208 651168594 650793762 650044327
3067.7 650044327 649691696 649269562 648018646 646345749 645266342 644139633 642906799 642102280 640938187
3076.4 640938187 640208893 639671936 638759460 637857666 636982613 636253014 635732346 635388222 634579391 633656273
3086 633656273 632567329 631555290 630828018 629930496 629033203 627715263 626788788 626025162 625555496
3094.7 625555496 625324135 624389229 623540001 622458420 621822014 620896149 619702072 618798828 617180481
3103.4 617180481 616503639 616011543 615349884 614807663 613893242 612856979 611577606 611142769 610684471
3112 610684471 609939880 609074402 607808800 606481323 605075111 604592934 603883095 602768059 602120132
3120.7 602120132 601417580 600680122 599967918 599631195 598777313 597507057 596673393 595785637 594860115
3129.4 594860115 593986549 593266487 592554245 591327934 590292625 589927597 589052429 588063622 587241364
3138.1 587241364 586315689 585883827 585244026 584609909 583912239 582844315 581763000 580631599 579854431
3146.8 579854431 578988266 578067284 577267380 576389542 575479240 574503670 573692513 573118095 572520866 571637878
3156.4 571637878 571264877 571201897 570459328 569028130 567607460 566904526 566329575 565349388 564121132
3165.1 564121132 563242836 562489891 561791229 561036720 560027351 559596214 559133263 558686867 557804031
3173.8 557804031 556779327 556570892 556094170 555358391 553779831 552674332 552007065 550726318 550477486
3182.4 550477486 550105057 549475098 549104462 548226242 547049713 546084099 545447426 544560852 543766823
3191.1 543766823 543288231 543121338 542376556 541041679 540346756 539762344 538752480 538014870 537901459
3199.8 537901459 537332420 536880798 536474838 535454559 534964943 534431953 533620071 532801743 531968002
3208.5 531968002 530974159 530401993 530194397 529221497 528471870 528074188 527784920 526721039 525486183
3217.2 525486183 525757751 525555687 524469757 523690300 523229980 522708588 522342834 521634026 520529022
3225.8 520529022 519946899 519008675 518573303 518492050 518079109 517900696 517631493 517273712 516482620 516022110
3235.5 516022110 515517311 514700203 513848228 512674828 512165184 511870575 511201057 510207977 509765930
3244.2 509765930 509652214 509237633 509039268 508451920 508407364 508869286 508501778 507248001 505985794
3252.8 505985794 505103111 504496689 504540253 504107971 503181839 502425919 502140083 501966858 501404991 501086082
3262.5 501086082 500614738 500407600 500091934 499305000 498450317 497759666 497721443 497273827 496806793 496765289
3272.1 496765289 496644783 496072617 495524521 495358238 494783173 494501419 494152870 494050217 494115219 493581161
3281.8 493581161 493145638 492459755 492103920 491641769 491123085 490889206 490096397 489824600 490014725 489899330
3291.4 489899330 489338455 488989906 489209862 489023247 488812637 488960152 488393860 487427597 487086067 486722031
3301 486722031 486206665 485451050 484529572 484337120 484703178 485037155 484621162 483722267 483168983 483263016
3310.7 483263016 483354149 482878227 482198830 481494560 481394424 481484909 481196899 480580521 479970245 479775467
3320.3 479775467 479427299 479226875 479373817 479203453 478410568 477769547 477266388 476945038 476983223 476108131
3330 476108131 475351677 474694977 473956299 473796387 473612823 473854599 473414459 472784271 472685318 472301140
3339.6 472301140 471973305 471598091 471275978 470488472 469793129 469755058 469642944 469068260 468491783 468267899
3349.3 468267899 467471771 467062149 467008171 466499557 466396255 466505699 466235046 465509987 464784393 464091721
3358.9 464091721 463916779 463843727 463056870 462029228 461041794 460886345 460940018 460556107 460273743 459839516
3368.6 459839516 459283104 459312439 459441910 458815804 458464203 458090858 457377090 456788139 456402664 456307220
3378.2 456307220 455635223 454973221 454462776 454164810 454197807 453851662 453421822 452952805 453074150 452969055
3387.8 452969055 452342186 452036591 451657867 451707726 451570511 451092072 450835381 450716324 451140938 451119690
3397.5 451119690 450400200 450035629 450039368 450186806 450425758 450524330 450211029 449879875 449562912 448928375
3407.1 448928375 448878174 448753853 448108215 448305855 448502121 448553467 448852196 449136658 449441414 449261284
3416.8 449261284 449236069 449008408 448419037 448454971 448729897 448493729 448152046 448359528 448623199 449003754
3426.4 449003754 448884468 448346405 448371849 448313217 448544312 449060783 449195862 449151001 449532852 449733658
3436.1 449733658 449117813 449117622 449735031 449860802 450028381 450825729 451148148 451386604 452017441 452698593
3445.7 452698593 453299026 451762581 450981140 451894684 452560616 453347969 453284302 453125114 453187943 453326187
3455.3 453326187 454169350 454776039 454991074 455566750 456644669 457225876 457574158 457616272 457506332 457806396
3465 457806396 457755928 457813683 458156281 459127045 460210800 460630569 460955048 461483994 462401962 462944145
3474.6 462944145 463103981 463242264 463592834 464311752 464694672 464719658 465111580 465443077 465285416 466259003
3484.3 466259003 467195053 467728767 468951683 469021988 468924980 470081558 471344986 472234268 472896233
3493 472896233 473027763 473133659 473469887 472992859 473149757 474062767 474692993 475370255 476415253 477366371
3502.6 477366371 477208252 477406616 478692474 479874763 480280533 481051025 481246376 480556297 481567612
3511.3 481567612 482251625 482629738 483345566 484231224 485726624 486620216 487074661 486919899 487083321
3520 487083321 488577347 490584679 491036911 489725990 490237770 491523514 491959152 492008095 492943230
3528.6 492943230 493551941 493804932 494883156 496277351 497786407 498123589 498857574 498925438 498903923
3537.3 498903923 501118011 502236900 502799263 502727623 503337135 504371376 504235764 504309921 504262199 505533218
3547 505533218 505699196 507105293 509243813 511257935 513697815 512445488 513321991 514180527 514527702
3555.6 514527702 515924263 515674286 517272301 518604889 518810120 518745995 521207733 523281479 523334618
3564.3 523334618 528032494 527756348 524938164 524743156 524941978 529569206 530780258 531588898 533443375
3573 533443375 534611740 535278206 536379929 538728561 538771744 540621033 542098274 542403030 544868279
3581.7 544868279 547104759 547772026 547431755 551704979 553717804 550523567 550885315 550026932 553947983
3590.4 553947983 557617798 560513954 561340561 561785774 565593796 563908005 566453819 569369354 568567848
3599 568567848 572106743 572945061 573616562 576066933 577118607 578444595 581568756 583734131 581983261
3607.7 581983261 586069984 584450607 583597679 592815170 592764473 588736191 593224792 592118492 596569862
3616.4 596569862 601323433 598802299 599167442 597865067 599299164 603332558 605696640 608127098
3624.1 608127098 611071510 613066254 615398750 623052139 620944786 605615807 611180267 617505836
3631.8 617505836 623990021 624240646 620940285 623788300 627274513 629090271 628770638 630450745 633174400
3640.5 633174400 635769615 636436958 636067162 638306122 641371613 646544113 642997971 637290192 640927963
3649.2 640927963 637669067 636442986 638103600 645025101 650662460 655667496 658979263 647104340
3656.9 647104340 650697937 657577515 658524246 659435043 659537201 661112595 662027512 662902145 664122391
3665.6 664122391 665110474 669619675 672176743 671346130 669389725 659646225 663438034 673689117
3673.3 673689117 683059464 680695114 657765427 662056732 672505798 678241501 675007019 674994431
3681 674994431 678988266 680977783 681989899 682426910 683351059 688176117 694754257 683328629 678431320
3689.7 678431320 687499619 681055984 681714020 688103714 688677063 690486374 690543137 690176544 691786118
3698.4 691786118 692604370 695851517 697823715 689953842 688969955 696044693 698328247 698650131 698741837
3707 698741837 700446320 703422012 693980331 698721237 703739548 688143463 693257751 699018860
3714.8 699018860 700017166 700991135 703976517 704882812 700903015 703176804 709478912 703651886 698772964
3723.4 698772964 705552292 705869751 704840088 702087479 702632370 707687607 708311996 713974228 710267639
3732.1 710267639 702159195 712754059 710155258 696176224 698307495 702247696 703915024 708208313
3739.8 708208313 711985626 707778320 711952744 725198898 710051193 691254044 705323868 713040924
3747.5 713040924 719246521 714595490 702644043 714861679 706343384 698438873 707555237 714322968
3755.3 714322968 716989212 711325989 714938583 720759735 711380692 709430847 714983902 716826859
3763 716826859 717565079 721802368 717503891 712423325 716599579 722118988 721235123 710404663 714149475
3771.7 714149475 718753433 719350586 720431747 720356522 720927658 721025848 724625702 723782196 714731903
3780.3 714731903 718108292 720848465 722397919 723918915 719385834 718763885 720762253 722699585
3788 722699585 723858261 723278275 723754120 723691711 724458923 724782410 726504593 730249100 724113846
3796.7 724113846 719242325 722763062 727838440 734051361 724223938 711471939 717163162 722126541
3804.4 722126541 727978058 733386841 720026779 717100449 724624710 726922913 727490158 728122253
3812.2 728122253 728193970 729327850 734881134 731050491 713152161 720859375 728926773 735027084
3819.9 735027084 735832977 713536072 717795486 724468460 727470016 730322952 728803940 723967972
3827.6 723967972 725210876 728627930 732451859 732394257 722159348 726984329 735916748 728315659
3835.3 728315659 727120514 736029053 725332336 720513611 730462494 724208221 724769592 733440552
3843 733440552 729886551 725053024 728608322 731796570 732389450 733100433 731228943 734406281 742195435
3851.7 742195435 732942200 731592178 714794006 717774429 729770279 728657455 728328171 731805115
3859.4 731805115 735354004 738537445 730681305 729943466 736814346 728620377 724200592 730833511
3867.1 730833511 737124710 742801590 730536194 721063843 727502289 735051270 738262100 725214386
3874.8 725214386 727213516 733128891 733791199 737344818 742087021 732607269 723760681 732143936
3882.6 732143936 734416656 736337128 741298981 725759048 728864594 734543991 735932846 741312103
3890.3 741312103 738352890 727518311 730556717 734894943 733515396 735371857 736926575 739150009
3898 739150009 740114670 728909760 735443878 738009949 731322708 735382538 731016769 730383072 731793747
3906.7 731793747 733750610 736675949 735989761 736114655 735804749 736184921 736589127 736533737 738689651
3915.3 738689651 740172272 734806137 730664062 736090088 735880127 731462173 735231552 737361908
3923.1 737361908 737828827 735138931 732693100 735870361 738042221 739894562 738516006 737338791
3930.8 737338791 739614258 735326004 732929001 735282669 736415024 737510376 737325134 736778488 737289276
3939.5 737289276 737445679 739667206 740352020 734686356 734202576 735955887 737666550 739652557 736592026
3948.1 736592026 736954269 737166138 735280762 738267517 738261032 736177521 735966187 736886292 737449112
3956.8 737449112 736964798 738237839 738571014 738763504 738569946 736697540 736889572 737751770 738098602
3965.5 738098602 738019333 737807693 737653351 736947632 736996002 738552399 739358215 738641052 738423309 738544922
3975.1 738544922 738568573 738413162 738415909 738592682 738792801 738861237 738336792 738298035 738340988 738640137 739130249
3985.7 739130249 738976669 738714676 738718262 739505539 739249268 738293915 738266220 738760605 739254608 738017502
3995.4 738017502 737052917 737939529 738476410 738360596 739024963
4000.2 739024963
##END=$$ End of the data block
