##TITLE=$$ Begin of the data block
##JCAMP-DX=5.00 $$ ACD/SpecManager v 10.08
##SPECTROMETER/DATA SYSTEM=Varian
##DATE=20 Nov 2012 15:00:18
##DATA TYPE=INFRARED SPECTRUM
##DATA CLASS=XYDATA
##ORIGIN=
##OWNER=
##NPOINTS=3735
##FIRSTX=399.26403809
##LASTX=4000.35498047
##MAXX=4000.35498047
##MINX=399.26403809
##MAXY=82.58878326
##MINY=42.50466537
##XFACTOR=1.0000000000
##YFACTOR=0.000000100000000
##FIRSTY=64.49615479
##DELTAX=0.96440572
##XUNITS=1/CM
##YUNITS=TRANSMITTANCE
##XYDATA=(X++(Y..Y))
$$ plain form
399.3 644961548 660821838 661372833 653206100 648331070 649818802 648948593 642233124 642283096 653553543
407.9 653553543 660959167 657304611 655908432 656937408 660185776 665804901 662252579 654449615
415.7 654449615 656682816 669734802 674114151 655903778 652019730 652249756 655467758 660920334
423.4 660920334 661705856 657575684 658008652 658422470 653308334 650337982 653134689 654439316 646382523
432.1 646382523 641821976 640714569 642419052 647494888 646166229 644891205 649149017 656219254
439.8 656219254 654898605 650268021 649988632 648416672 652178955 650367584 645385590 649310760 656804657
448.4 656804657 661294708 660345459 660886307 658980789 660136261 663205490 663722992 667212906 662732620
457.1 662732620 649257660 647862854 651027679 653341751 652868118 652884064 649895706 647877655 652602234
$$ packed form
399.3F44961548J5860290N50995q166733m875030J487732q70209o715469M9972J1270447
407.9F53553543P405624l654556j396179J028976L248368N619125l552322p802964
415.7F54449615K233201J3051986M379349j8210373l884048K30026L218002N452576
423.4F60920334P85522m130172M32968M13818n114136k970352K796707J304627q056793
432.1F46382523m560547j107407J704483N075836j328659j275024M257812P070237
439.8F56219254j320649m630584k79389j571960L762283j811371m981994L925170P493897
448.4F56804657M490051r49249N40848j905518J155472L069229N17502L489914m480286
457.1F62732620j3474960j394806L164825K314072m73633J5946k988358k018051M724579
$$ plain form
465.8 652602234 656419067 653126678 654354172 657088547 654258728 652601700 641720200 636771202
473.5 636771202 639568367 639793358 641961288 639055176 637086334 638573456 641231155 643332138 641486588
482.2 641486588 641876984 643740158 647181244 647846603 644947357 642035980 636608353 634238625 633217392
490.9 633217392 633501511 638044167 641122284 640573502 638318367 638941116 639549675 641216431 643185043
499.6 643185043 638754654 633132324 630882683 629313660 626346092 627027893 628800201 628032303 629698982
508.2 629698982 629987907 627707939 626678543 628162460 628495483 626391258 626211739 624766922 619839821
516.9 619839821 616511650 614099426 609784737 606120605 606215019 609751854 611780853 612405357 614625587
525.6 614625587 612885399 611072845 612596092 613510208 613191452 610425415 607175980 605849380 606418419
$$ packed form
465.8F52602234L816833l292389J227494K734375k829819j657028j0881500m948998
473.5F36771202K797165K24991K167930k906112j968842J487122K657699K100983j845550
482.2F41486588L90396J863174L441086O65359k899246k911377n427627k369728j021233
490.9F33217392K84119M542656L078117n48782k255135O22749O08559J666756J968612
499.6F43185043m430389n622330k249641j569023k967568O81801J772308p67898J666679
508.2F29698982K88925k279968j029396J483917L33023k104225j79519j444817m927101
516.9F19839821l328171k412224m314689l664132R4414L536835K028999O24504K220230
525.6F14625587j740188j812554J523247R14116l18756k766037l249435j326600N69039
$$ plain form
534.3 606418419 608009033 606927185 607251472 612836914 617727242 621468544 624765854 627409821 631251221
543 631251221 633304253 632208290 629444618 627129097 625487213 624629097 623143234 621210632 621536598
551.6 621536598 623490982 626863899 627719879 625689545 624502373 624044380 625388145 624392090 620234413
560.3 620234413 616191902 612566528 611575470 609227982 605954857 604538269 602693481 602592697 602247200
569 602247200 600709801 599894867 598543015 596332664 595618057 595553322 594110146 592388573 590341263
577.7 590341263 590982895 593206139 594510269 597006836 600518837 603507690 606464233 611655045 615594101
586.4 615594101 618321953 620141640 619695663 619513855 618997879 616387863 616202316 618445702 618527756
595 618527756 618682289 620059357 621709518 623666000 623880577 623862991 624115639 625149269 625064240 622706490
$$ packed form
534.3F06418419J590614j081848L24287N585442M890328L741302L297310K643967L841400
543F31251221K053032j095963k763672k315521j641884q58116j485863j932602L25966
551.6F21536598J954384L372917Q55980k030334j187172m57993J343765r96055m157677
560.3F20234413m042511l625374r91058k347488l273125j416588j844788j00784l45497
569F02247200j537399q14934j351852k210351p14607o4735j443176j721573k047310
577.7E90341263O41632K223244J304130K496567L512001K988853K956543N190812L939056
586.4F15594101K727852J819687m45977j81808n15976k610016j85547K243386Q2054
595F18527756J54533J377068J650161J956482K14577j7586K52648J033630q5029k357750
$$ plain form
604.7 622706490 621316109 620271225 620069542 619399643 617824669 617791176 618572464 619954872 622694016
613.4 622694016 625667839 625938759 627004204 629903450 630449562 629210701 628041077 628962326 630004501
622 630004501 630127449 631088028 632321739 634300537 637277374 640303116 641694870 642895966 645619659
630.7 645619659 647431564 647410736 647249756 646620407 644979324 644710464 644747849 643362350 643224411 644701385
640.4 644701385 646453781 647861404 649615479 652936554 655920715 656998672 657188797 656082230 654216537
649 654216537 653464661 652744370 651769028 652435074 652286835 651841125 654241638 657780380 659842987 660727615
658.7 660727615 663198166 665294495 665065231 664831238 663477859 661825256 660921173 660845642 660481415
667.4 660481415 658418808 660238495 660125656 660822372 663743820 666805954 668897018 669949875 671094208
$$ packed form
604.7F22706490j390381j044884k01683o69899j574974l3493P81288J382408K739144
613.4F22694016K973823K70920J065445K899246N46112j238861j169624R21249J042175
622F30004501J22948R60579J233711J978798K976837L025742J391754J201096K723693
630.7F45619659J811905k0828j60980o29349j641083k68860L7385j385499j37939J476974
640.4F44701385J752396J407623J754075L321075K984161J077957J90125j106567j865693
649F54216537p51876p20291r75342O66046j48239m45710K400513L538742K062607Q84628
658.7F60727615K470551K096329k29264k33993j353379j652603r04083p5531l64227
667.4F60481415k062607J819687j12839O96716K921448L062134K091064J052857J144333
$$ plain form
676.1 671094208 672597122 673356705 671989136 669990463 668717194 667770767 667471695 668218689 669304276
684.7 669304276 669706879 671554031 674460907 676012039 675998840 675311966 675484009 675728378 674955215
693.4 674955215 672244415 669038315 666555405 664430542 663848877 664079666 664471054 664860687 664802399
702.1 664802399 664871140 665407867 665960846 665593185 664074860 661624222 660317993 659873505 658577423
710.8 658577423 657605133 657461700 658559113 660217743 661457214 663450317 666325302 668998032 672237854
719.5 672237854 676498947 679299316 680105209 679449539 679576721 680092010 680079193 681241531 682310944
728.1 682310944 684377670 687354279 690381927 692990646 695247803 699095688 701464539 702595139
735.8 702595139 703458557 702541046 700219955 698178940 697610245 696743164 696408615 696913757 697597961
$$ packed form
676.1F71094208J502914P59583j367569j998673j273269r46427k99072P46994J085587
684.7F69304276M02603J847152K906876J551132j3199o86874J72043K44369p73163
693.4F74955215k710800l206100k482910k124863n81665K30789L91388L89633n8288
702.1F64802399O8741N36727N52979l67661j518325k450638j306229m44488j296082
710.8F58577423r72290j43433J097413J658630J239471J993103K874985K672730L239822
719.5F72237854M261093K800369Q05893o55670J27182N15289j2817J162338J069413
728.1F82310944K066726K976609L027648K608719K257157L847885K368851J130600
735.8G02595139Q63418r17511k321091k041015n68695q67081l34549N05142O84204
$$ plain form
744.5 697597961 699331436 700935211 701532135 702100754 703153687 702547379 700132217 697264557 693879395
753.2 693879395 689555283 685783844 684349518 682545242 679160156 678366241 680152435 680928726 681388321
761.9 681388321 681993790 681986389 681918106 681986389 682999878 683708725 683298645 682601242 682053452 682531433
771.5 682531433 684061661 686807098 690185089 694338913 698955688 703551712 707969894 710977554
779.2 710977554 714096375 716159973 717363968 717861481 717217407 717425385 717465134 718508453 719967422
787.9 719967422 721839294 724752655 727572021 730886612 733086548 734628677 735908127 737467499
795.6 737467499 738727722 738460922 737750320 737080917 737037201 737240677 738151550 739408798 741415024
804.3 741415024 743739700 745989532 749294052 751788177 753763275 754408493 753654861 753412781 753847198
$$ packed form
744.5F97597961J733475J603775N96924N68619J052933o06308k415162k867660l385162
753.2F93879395m324112l771439j434326j804276l385086p93915J786194P76291M59595
761.9F81388321O05469p401o8283O8283J013489P08847m10080o97403n47790M77981
771.5F82531433J530228K745437L377991M153824M616775M596024M418182L007660
779.2G10977554L118821K063598J203995M97513o44074K07978L9749J043319J458969
787.9G19967422J871872K913361K819366L314591K199936J542129J279450J559372
795.6G37467499J260223k66800p10602o69403m3716K03476R10873J257248K006226
804.3G41415024K324676K249832L304520K494125J975098O45218p53632k42080M34417
$$ plain form
813 753847198 752399368 749038696 747483978 746615906 746969833 748181305 749458923 750985184 752171021
821.7 752171021 754453506 755611649 756777267 757066727 754635086 752421188 749640884 746570663 744135590
830.4 744135590 741453476 739032669 738148651 737515030 736616287 736693573 737137756 737194824 736759872 736103897
840 736103897 734410248 732321625 730024033 727118149 724530182 722122650 719836960 717883987 717496414
848.7 717496414 717909775 718918762 720055237 720090103 720611038 719673920 717280273 715304794 713118820
857.4 713118820 709826736 706012650 703097305 700624084 700414734 702040939 704487305 708507614 712683563
866 712683563 717248306 721888199 727226562 731388397 733368835 735988846 738343430 739759445 739392929
874.7 739392929 739158173 740205383 741397476 743109894 744755020 746070023 746849442 747378693 747451859
$$ packed form
813G53847198j447830l360672j554718q68072L53927J211472J277618J526261J185837
821.7G52171021K282485J158143J165618K89460k431641k213898k780304l070221k435073
830.4G44135590k682114k420807q84018o33621q98743P7286M44183N7068m34952o55975
840G36103897j693649k088623k297592k905884k587967k407532k285690j952973l87573
848.7G17496414M13361J008987J136475L4866N20935r37118k393647j975479k185974
857.4G13118820l292084l814086k915345k473221k09350J626205K446366M020309M175949
866G12683563M564743M639893N338363M161835J980438K620011K354584J416015l66516
874.7G39392929k34756J047210J192093J712418J645126J315003P79419N29251P3166
$$ plain form
883.4 747451859 747245255 746138382 744089966 741669235 737866669 733892670 731350174 729227753 726453857
892.1 726453857 724490891 723550339 723637466 724214935 724210052 724413910 724011307 723290634 722517853 720803299
901.7 720803299 717685013 714005356 711163025 708153229 704613037 700835266 698951340 698570023 697402344
910.4 697402344 696433334 694688034 692208099 691361847 689975204 685068054 679607620 675251389 671014099
919.1 671014099 666743164 662204742 659537125 658555984 657817383 658010330 658615189 659297104 660181198
927.8 660181198 660836716 661516800 661784286 661439362 660987778 660153732 659697571 660228729 661169434 662294388
937.4 662294388 662706451 663684006 667121506 670591965 672741089 675191574 677529984 678177185 677093887
946.1 677093887 674580078 671303711 668082123 664354477 660151215 655607376 651426163 647625580
$$ packed form
883.4G47451859k06604j106873k048416k420731l802566l973999k542496k122421k773896
892.1G26453857j962966r40552Q7127N77469m883K03858m02603p20673p72781j714554
901.7G20803299l118286l679657k842331l009796l540192l777771j883926l81317j167679
910.4F97402344r69010j745300k479935q46252j386643m907150n460434m356231m237290
919.1F71014099m270935m538422k667617r81141p38601J92947O04859O81915Q84094
927.8F60181198O55518O80084K67486l44924m51584q34046m56161N31158R40705J124954
937.4F62294388M12063R77555L437500L470459K149124K450485K338410O47201j083298
946.1F77093887k513809l276367l221588l727646m203262m543839m181213l800583
$$ plain form
953.8 647625580 644163818 641495285 638489761 634149666 629275513 624381638 618747902 612682648
961.5 612682648 605829811 598592567 591752167 584665527 577351646 570459595 563864708 557329407
969.2 557329407 551214371 544117050 537092667 529839478 522681427 516041908 508177719 500757141
976.9 500757141 492669563 485276375 477890816 470820198 465232277 459274292 455121346 450715141
984.7 450715141 447717285 445496750 442845726 440720253 438464546 437582550 436010132 434834824 433397980
993.3 433397980 432401924 431619148 430466309 430763016 430600471 430969658 431067963 431999435 432583771 433348389
1003 433348389 434755020 434826241 435691414 434423599 433472099 432943077 431622696 430209885 427960434
1011.7 427960434 427240448 426295280 425996666 425046654 425169678 426140785 425692253 426401520 426724319 427656021
$$ packed form
953.8F47625580l461762k668533l005524m340095m874153m893875n633736o065254
961.5F12682648o852837p237244o840400p086640p313881o892051o594887o535301
969.2E57329407o115036p097321p024383p253189p158051o639519p864189p420578
976.9E00757141q087578p393188p385559p070618n587921n957985m152946m406205
984.7D50715141k997856k220535k651024k125473k255707q81996j572418j175308j436844
993.3D33397980r96056p82776j152839K96707j62545L69187R8305R31472N84336P64618
1003D33348389J406631P1221Q65173j267815r51500n29022j320381j412811k249451
1011.7D27960434p19986r45168k98614r50012J23024R71107m48532P09267L22799R31702
$$ plain form
1021.3 427656021 427721329 428761444 430653038 431544571 432283096 432412300 434491119 436305580 438352661
1030 438352661 440136337 442504539 445235748 446560516 448698463 449567680 451131210 452073059 452261696
1038.7 452261696 452054443 451066093 450705566 449496574 450472145 451092987 451625633 452485008 453539352
1047.4 453539352 455449448 455978165 458033600 459864464 461881523 463230782 464590759 466209946
1055.1 466209946 467919846 472303543 475151520 478801804 482625809 486396370 490210304 494304085
1062.8 494304085 500659752 505358887 509953880 513188629 515272293 515623550 513570862 510338478
1070.5 510338478 504643898 499504890 493302498 487852402 483600349 479740906 477229614 474900055
1078.2 474900055 474305611 473453445 474944191 475467148 475641632 476926346 477050095 478771591 479453888
$$ packed form
1021.3D27656021O5308J040115J891594Q91533P38525J29204K078819J814461K047081
1030D38352661J783676K368202K731209J324768K137947Q69217J563530R41849J88637
1038.7D52261696k07253r88350l60527j208992R75571O20842N32646Q59375J054344
1047.4D53539352J910096N28717K055435J830864K017059J349259J359977J619187
1055.1D66209946J709900M383697K847977L650284L824005L770561L813934M093781
1062.8D94304085O355667M699135M594993L234749K083664L51257k052688l232384
1070.5E10338478n694580n139008o202392n450096m252053l859443k511292k329559
1078.2D74900055n94444q52166J490746N22957J74484J284714J23749J721496O82297
$$ plain form
1086.9 479453888 482077141 484914322 487153816 490239944 493865013 497839203 500587769 504847412
1094.6 504847412 507052116 509134178 510936928 511377449 512472992 512132301 512693405 512944260 514067192
1103.3 514067192 514228401 513677559 514646187 515155983 517088509 518966637 522242050 524791374 526345558
1112 526345558 528491859 529854507 531298103 531960945 533708153 534831924 535847054 536902046 537752342
1120.6 537752342 540065117 541299973 542729340 544023819 545891418 547871399 548814430 549705811 550538483
1129.3 550538483 552232361 553792686 555832634 557323685 558937416 560913582 561926575 562385025
1137 562385025 561663208 560742912 558607750 556284637 553895874 550367050 546013298 542895317 542458382
1145.7 542458382 538863411 534595146 531357803 528406372 526819839 524319878 522826080 521351357
$$ packed form
1086.9D79453888K623253K837181K239494L086128L625069L974190K748566M259643
1094.6E04847412K204704K082062J802750M40521J095543l40691N61104K50855J122932
1103.3E14067192J61209n50842R68628N09796J932526J878128L275413K549324J554184
1112E26345558K146301J362648J443596O62842J747208J123771J015130J054992Q50296
1120.6E37752342K312775J234856J429367J294479J867599J979981R43031Q91381Q32672
1129.3E50538483J693878J560325K039948J491051J613731J976166J012993M58450
1137E62385025p21817r20296k135162k323113k388763l528824m353752l117981m36935
1145.7E42458382l594971m268265l237343k951431j586533k499961j493798j474723
$$ plain form
1153.4 521351357 521290436 521377449 521156883 521243858 520396576 521085777 521088333 521209488 521629372 523736801
1163.1 523736801 526617088 528932838 532385559 535172081 540012283 544960594 549452362 553897934
1170.8 553897934 558612099 564630470 569450760 573931274 577882729 582404747 586813126 591168098
1178.5 591168098 596085663 600839081 606086502 610782127 616032066 621319847 626334190 630042343
1186.2 630042343 632623634 635858345 638284454 640054245 641433487 643108521 644132690 644184723 645063400
1194.9 645063400 646318588 647741165 648287201 648611069 649597931 650306396 650560913 651275024 652429504
1203.6 652429504 652334900 652228088 652358780 652508392 653313217 653982925 654846039 656092453 658356094
1212.3 658356094 660705948 662792053 665510254 667817307 669412689 670138168 670178833 670780945 671140671
$$ packed form
1153.4E21351357o0921Q7013k20566Q6975q47282O89201K556J21155M19884K107429
1163.1E23736801K880287K315750L452721K786522M840202M948311M491768M445572
1170.8E53897934M714165O018371M820290M480514L951455M522018M408379M354972
1178.5E91168098M917565M753418N247421M695625N249939N287781N014343L708153
1186.2F30042343K581291L234711K426109J769791J379242J675034J024169N2033Q78677
1194.9F45063400J255188J422577N46036L23868R86862P08465K54517P14111J154480
1203.6F52429504r4604j06812J30692J49612Q04825O69708Q63114J246414K263641
1212.3F58356094K349854K086105K718201K307053J595382P25479M0665O02112L59726
$$ plain form
1220.9 671140671 670658722 670573654 670451050 670189743 670714951 671079102 671406784 671887817 672127457 672393799
1230.6 672393799 672127838 671261368 669985046 668894577 668083267 667001038 665936508 664839859 664382172
1239.3 664382172 664126511 663644257 663683929 663957214 664493637 665500031 666204300 666188965 666404724 666885376
1248.9 666885376 666745453 666276016 666093597 666259460 666487808 666803055 667560806 668648605 669360580
1257.6 669360580 670385590 672004700 673017044 673457489 673668594 673349075 672933350 673112869 673298187
1266.3 673298187 673099823 673394699 673880539 674945526 676568832 677606201 678800125 680295715 681544724
1274.9 681544724 682235107 682360535 682251129 681630859 681326675 680817032 680016022 679678955 679059906 678722458
1284.6 678722458 678682251 678880692 679350433 679791183 680429764 680822830 680731354 679898453 678837738 678050842
$$ packed form
1220.9F71140671m81949q5068j22604k61307N25208L64151L27682M81033K39640K66342
1230.6F72393799k65961q66470j276322j090469q11310j082229j064530j096649m57687
1239.3F64382172k55661m82254L9672K73285N36423J006394P04269j5335K15759M80652
1248.9F66885376j39923m69437j82419J65863K28348L15247P57751J087799P11975
1257.6F69360580J025010J619110J012344M40445K11105l19519m15725J79519J85318
1266.3F73298187j98364K94876M85840J064987J623306J037369J193924J495590J249009
1274.9F81544724O90383J25428j09406o20270l04184n09643q01010l37067o19049l37448
1284.6F78722458m0207J98441M69741M40750O38581L93066r1476q32901j060715p86896
$$ plain form
1294.2 678050842 677072220 675525436 673990326 673016510 672188568 671387787 670717621 670534973 670705109
1302.9 670705109 670676422 670291672 670017395 669449844 668250732 667347107 666140671 664509506 662776260
1311.6 662776260 661673813 661800766 661616287 661078873 660501404 660345535 660850296 661045609 661093979 661130371
1321.2 661130371 660642929 659970322 659107285 657411041 655357132 653390884 651752167 649973450 648124313
1329.9 648124313 646867981 645785217 644839478 643777161 643184204 642303925 640682144 639687538 638721199
1338.6 638721199 637080421 636115150 637328873 637970085 637527580 637292824 637304459 637604828 638137550
1347.3 638137550 639131622 639676857 639583244 639567261 639491081 639600449 639320717 638094444 637110405 636715317
1356.9 636715317 635679626 635037346 635207062 634526787 633675194 632148590 631011276 633098640 634463272
$$ packed form
1294.2F78050842r78622j546784j535110r73816q27942q00781o70166j82648J70136
1302.9F70705109k8687l84750k74277n67551j199112r03625j206436j631165j733246
1311.6F62776260j102447J26953j84479n37414n77469j55869N04761J95313M8370L6392
1321.2F61130371m87442o72607q63037j696244k053909j966248j638717j778717j849137
1329.9F48124313j256332j082764r45739j062317n92957q80279j621781r94606r66339
1338.6F38721199j640778r65271J213723O41212m42505k34756J1635L00369N32722
1347.3F38137550R94072N45235r3613j5983p6180J09368k79732j226273r84039l95088
1356.9F36715317j035691o42280J69716o80275q51593j526604j137314K087364J364632
$$ plain form
1365.6 634463272 634013786 633925323 632938652 631510506 631122894 630361710 630566711 630023804 627908134
1374.3 627908134 628083839 630265121 632115631 632562790 633470306 634458427 635451813 636079788 636243515
1382.9 636243515 636973267 637181244 637695999 637747078 637606506 639869499 641998825 643287735 644463577
1391.6 644463577 646082306 647220917 646036301 644742813 647242737 648801117 648128052 645762634
1399.3 645762634 645375824 646405563 645687103 644969940 644135666 641757431 641882248 642909470 643132095
1408 643132095 642686234 642342224 642224960 642169113 641855316 641248779 640377731 639507904 638282509 636562729
1417.7 636562729 635180397 630677719 632632713 636002884 637163773 637439804 636766815 638514595 640377884
1426.3 640377884 640546951 641263504 640914536 639078217 639045105 640049667 639574165 639520416 641307602
$$ packed form
1365.6F34463272m49486q8463r86671j428146l87612p61184K05001n42907k115670
1374.3F27908134J75705K181282J850510M47159R07516R88121R93386O27975J63727
1382.9F36243515P29752K07977N14755N1079j40572K262993K129326J288910J175842
1391.6F44463577J618729J138611j184616j293488K499924J558380o73065k365418
1399.3F45762634l86810J029739p18460p17163q34274k378235J24817J027222K22625
1408F43132095m45861l44010j17264n5847l13797o06537q71048q69827j225395j719780
1417.7F36562729j382332m502678J954994L370171J160889K76031o72989J747780J863289
1426.3F40377884J69067P16553l48968j836319l3112J004562m75502n3749J787186
$$ plain form
1435 641307602 641497498 637305145 639300842 644052963 646033325 646598206 647688980 647973251 648538742
1443.7 648538742 648520279 648842926 648737106 646751099 643764267 644418640 645797043 644622345 644047470
1452.4 644047470 644656906 645816345 645439911 642156372 634978943 633791122 639088974 640609970 643261261
1461.1 643261261 643701553 643611755 644477005 640911255 642808075 645673676 649113007 651807632 655080032
1469.7 655080032 658501663 658920441 660579910 662049179 668813477 672853546 673060913 676193771 680059662
1478.4 680059662 683219604 685048523 686846237 689209061 693572922 696694870 699029922 701745834
1486.1 701745834 702137222 704436874 705700150 702719650 701738358 706022720 709347534 710247726 711905670
1494.8 711905670 711147842 707223434 711207047 713108063 713745880 717410049 719206924 719837494 721823959
$$ packed form
1435F41307602J89896m192353J995697M752121J980362N64881J090774K84271N65491
1443.7F48538742j8463L22647j05820j986007k986832O54373J378403j174698n74875
1452.4F44047470O09436J159439l76434l283539p177429j187821N297852J520996K651291
1461.1F43261261M40292q9798Q65250l565750J896820K865601L439331K694625L272400
1469.7F55080032L421631M18778J659469J469269O764298M040069K07367L132858L865891
1478.4F80059662L159942J828919J797714K362824M363861L121948K335052K715912
1486.1G01745834L91388K299652J263276k980500r81292M284362L324814R00192J657944
1494.8G11905670p57828l924408L983613J901016O37817L664169J796875O30570J986465
$$ plain form
1503.5 721823959 722340088 720695801 707496338 701702957 709634628 713538284 716184845 718840103
1511.2 718840103 719635162 719749298 723195419 724459534 724037552 721805878 719279175 725871887 728634720
1519.9 728634720 723458557 716701813 716853409 722426376 723890915 721781616 723008957 725127563
1527.6 725127563 725129395 728282471 731873550 731972046 732890396 729719315 725736237 729150467 730623856
1536.3 730623856 732197647 732734375 723147430 707764130 717773361 723188171 723368301 727589417
1544 727589417 727974625 728549576 732395935 734775696 736207504 733833008 730326920 732477798 734073944
1552.7 734073944 733787155 728429337 728482056 733342743 736540527 728226624 710686951 719061584 730538559
1561.4 730538559 736395798 738981018 738300247 735014420 735468445 736654663 736442337 733387222 725719681
$$ packed form
1503.5G21823959N16129j644287j3199463n793381P931671L903656K646561K655258
1511.2G18840103P95059J14136L446121J264115m21982k231674k526703O592712K762833
1519.9G28634720n176163o756744J51596N572967J464539k109299J227341K118606
1527.6G25127563J832L153076L591079R8496R18350l171081l983078L414230J473389
1536.3G30623856J573791N36728r586945j5383300J0009231N414810J80130M221116
1544G27589417L85208N74951L846359K379761J431808k374496l506088K150878J596146
1552.7G34073944k86789n357818N2719M860687L197784q313903j7539673Q374633J1476975
1561.4G30538559N857239K585220o80771l285827M54025J186218k12326l055115p667541
$$ plain form
1570 725719681 729752960 733371735 734158630 734912643 736495209 734336014 725257950 730398865 733913879
1578.7 733913879 734129410 733530579 732139053 730951080 729353867 728396912 727593842 726428528 726043091
1587.4 726043091 725772095 725573349 724986954 725000610 724763794 724219360 722427368 719737473 718635025
1596.1 718635025 716728363 715038376 713038864 711580582 710264511 708979263 708189850 706630554
1603.8 706630554 707014999 706768570 705224915 703700256 702971039 700673752 697782516 697137833 694776459
1612.5 694776459 693208466 691171799 690301437 687794724 677070999 680835342 682706451 682952652
1620.2 682952652 682323303 682926025 680391083 672840958 675063629 675705185 674820328 670343781 667789917
1628.9 667789917 668378220 667297211 666575394 665566254 666509933 668118362 661082916 657832336 660930710
$$ packed form
1570G25719681M033279L618775P86895P54013J582566k159195r078064N140915L515014
1578.7G33913879K15531n98831j391526j187973j597213r56955q03070j165314l85437
1587.4G26043091k70996j98746n86395J3656k36816n44434j791992k689895j102448
1596.1G18635025j906662j689987j999512j458282j316071j285248p89413j559296
1603.8G06630554L84445k46429j543655j524659p29217k297287k891236o44683k361374
1612.5F94776459j567993k036667q70362k506713j0723725L764343J871109K46201
1620.2F82952652o29349O02722k534942p550125K222671O41556q84857m476547k553864
1628.9F67789917N88303j081009p21817j009140R43679J608429p035446l250580L098374
$$ plain form
1637.5 660930710 662970200 664086380 664725418 663794556 663935013 663061066 663581619 663761292 658661194
1646.2 658661194 656909332 656614609 661044312 664603882 667963943 671111374 667768555 656010284
1653.9 656010284 662234268 668845139 671705093 673148956 674302673 675334778 676221313 677538376
1661.6 677538376 677358017 677288971 682018204 685303497 687950668 690944061 692068863 688849030 690774155
1670.3 690774155 694228973 694893036 698380127 702131729 700235977 697846603 702896423 706995010
1678 706995010 709151764 710473480 711215897 716402512 721238785 716780777 707496490 715437546 723045197
1686.7 723045197 726266556 726216202 727359772 728182983 730763016 733220978 735049133 738214722 738901215
1695.4 738901215 731403275 736116333 742468414 748493500 745762787 737403488 745040512 749494858
$$ packed form
1637.5F60930710K039490J116180O39038r30862J40457q73947N20553J79673n100098
1646.2F58661194j751862k94723M429703L559570L360061L147431l342819j1758271
1653.9F56010284O223984O610871K859954J443863J153717J032105Q86535J317063
1661.6F77538376j80359o9046M729233L285293K647171K993393J124802l219833J925125
1670.3F90774155L454818O64063L487091L751602j895752k389374N049820M098587
1678G06995010K156754J321716P42417N186615M836273m458008r284287P941056P607651
1686.7G23045197L221359n0354J143570Q23211K580033K457962J828155L165589O86493
1695.4G38901215p497940M713058O352081O025086k730713q359299P637024M454346
$$ plain form
1703.1 749494858 749847336 748232727 748485641 747349396 749904099 753576431 754165497 754817276 756935654
1711.8 756935654 759048386 760489120 758337708 757530670 760712357 758164825 749081345 755989609
1719.5 755989609 760999603 763112411 764396820 764340286 764715881 767197876 769361038 770518646 772241974
1728.2 772241974 773125992 769493637 769383850 773090668 773704453 764879227 757971497 766088257 771198654
1736.9 771198654 773154984 775449905 772999573 772260971 777853088 779925156 777692566 778307495 781163177
1745.5 781163177 782009811 781380310 779912796 779149704 782595444 781233292 780485764 785305557 787890701
1754.2 787890701 789895706 791115875 789137650 791338120 793758545 795110626 796670837 792223740
1761.9 792223740 791643829 794841537 795512924 795784531 797217102 797420044 794282379 797192841 800590591
$$ packed form
1703.1G49494858L52478j614609K52914j136245K554703L672332N89066O51779K118378
1711.8G56935654K112732J440734k151412q07038L181687k547532r083480O908264
1719.5G55989609N009994K112808J284409n6534L75595K481995K163162J157608J723328
1728.2G72241974Q84018l632355j09787L706818O13785q825226o907730Q116760N110397
1736.9G71198654J956330K294921k450332p38602N592117K072068k232590O14929K855682
1745.5G81163177Q46634o29501j467514p63092L445740j362152p47528M819793K585144
1754.2G87890701K005005J220169j978225K200470K420425J352081J560211m447097
1761.9G92223740n79911L197708O71387K71607J432571K02942l137665K910462L397750
$$ plain form
1770.6 800590591 798747482 794664078 795354309 800794067 802410126 801220322 802974777 802963486 802780533
1779.3 802780533 801141129 798775940 800707474 803368149 804581833 803404694 803871231 806349564
1787 806349564 807522583 808164062 809536819 808486786 806466675 802873917 802285538 805371399 804935226
1795.7 804935226 804130783 806496277 808358002 807548447 807017899 809668884 809613190 810437088 812174759
1804.4 812174759 811763687 811938629 811513977 810692368 811277084 811174698 808982239 809119492 810387039
1813 810387039 811072845 812241211 813192444 814216003 814097519 814771347 815827255 815295029 815104523
1821.7 815104523 813796310 813919601 814113464 810265808 811023712 813781891 814881592 812253571 808698883
1830.4 808698883 812756958 816255264 816498184 816585236 816996689 816905136 815719147 814957428 815555573
$$ packed form
1770.6H00590591j843109m083404O90231N439758J616059j189804J754455j1291j82953
1779.3H02780533j639404k365189J931534K660675J213684j177139M66537K478333
1787H06349564J173019O41479J372757j050033k020111l592758n88379L085861m36173
1795.7H04935226q04443K365494J861725q09555n30548K650985n5694Q23898J737671
1804.4H12174759m11072J74942m24652q21609N84716j02386k192459J37253J267547
1813H10387039O85806J168366R51233J023559j18484O73828J055908n32226j90506
1821.7H15104523j308213J23291J93863l847656P57904K758179J099701k628021l554688
1830.4H08698883M058075L498306K42920Q7052M11453r1553j185989p61719N98145
$$ plain form
1839.1 815555573 815248260 815410461 815376587 816138687 814890366 809672928 814015961 817388458 817060699
1847.8 817060699 816919632 817701950 817967758 817605591 817685013 816933212 816216583 815775757 816022949 816576614
1857.4 816576614 816204681 816682434 817379684 817977676 818305130 818858719 819242096 819092102 818735428 816921158
1867.1 816921158 815742264 813225937 811966248 814179535 815797119 816762619 817437286 818145905 818305511
1875.7 818305511 818631516 819067001 819452744 819645081 819001694 818786697 818398132 818249969 817670670 817164307
1885.4 817164307 817640228 817736359 818631668 817881470 815925751 817984009 820166702 820566025 820809326
1894.1 820809326 819646606 818012695 818731537 819202728 819180679 818587341 817910385 818224792 818674774
1902.7 818674774 819241867 819242096 819749756 820243912 819932709 819734650 819346695 818916473 819198532 819828949
$$ packed form
1839.1H15555573l07313J62201l3874P62100j248321n217438M343033L372497l27759
1847.8H17060699j41067P82318K65808l62167P9422p51801p16629m40826K47192N53665
1857.4H16576614l71933M77753O97250N97992L27454N53589L83377j49994l56674j814270
1867.1H16921158j178894k516327j259689K213287J617584R65500O74667P08619J59606
1875.7H18305511L26005M35485L85743J92337o43387k14997l88565j48163n79299n06363
1885.4H17164307M75921R6131Q95309p50198j955719K058258K182693L99323K43301
1894.1H20809326j162720j633911P18842M71191k2049n93338o76956L14407M49982
1902.7H18674774N67093K29N07660M94156l11203j98059l87955m30222K82059O30417
$$ plain form
1912.4 819828949 819221191 818988037 818875580 819261322 819959259 816431885 816103287 818741226 820068741
1921.1 820068741 820149994 818032150 817990036 819885406 820608826 820172577 819644165 818851700 818487167 818691788
1930.7 818691788 818500290 818734894 818943024 819463654 819738312 819801712 820422211 820543518 820376663 820229263
1940.3 820229263 820865936 819090424 816406097 818098526 818544083 817486343 817500153 818374786 819171295
1949 819171295 819476242 819989929 820397949 820390701 820099030 819803772 819445343 819506683 819509811 819060898 819015656
1959.6 819015656 818710632 818174210 818087997 818841324 819831848 820284729 820072479 819336090 819859390 821040726
1969.3 821040726 821163483 820511551 820167999 819764938 819229889 819029541 818695908 818585281 818828430 819394073
1978.9 819394073 819929352 820237503 820577850 820518188 820451889 820359726 820284653 820207214 819510269 818539429
$$ packed form
1912.4H19828949o07758k33154j12457L85742O97937l527374l28598K637939J327515
1921.1H20068741Q1253k117844m2114J895370P23420m36249n28412p92465l64533K04621
1930.7H18691788j91498K34604K08130N20630K74658O3400O20499J21307j66855j47400
1940.3H20229263O36673j775512k684327J692429M45557j057740J3810Q74633P96509
1949H19171295L04947N13687M08020p248k91671k95258l58429O1340L128m48913m5242
1959.6H19015656l05024n36422q6213P53327R90524M52881k12250p36389N23300J181336
1969.3H21040726J22757o51932l43552m03061n35049k00348l33633j10627K43149N65643
1978.9H19394073N35279L08151L40347n9662o6299r2163p5073p7439o96945r70840
$$ plain form
1988.6 818539429 818275528 818706970 818179932 817124405 818123550 819705429 820186996 820143051 820314941
1997.2 820314941 820600739 820606689 820148163 819853745 819418182 818680038 818275681 818381195 818380432 817811661
2006.9 817811661 817851791 818432159 818550568 818731842 819133606 819389801 819608536 819750900 819500198 818312531
2016.5 818312531 816961517 816974030 816878433 816667328 816900177 816669159 816646423 817059402 817596283 817786179
2026.2 817786179 817933273 818052368 817681580 817630615 817315369 816901550 816587448 816112671 815671082 815292892
2035.8 815292892 815520248 815819321 815787430 815716934 815896683 815494766 815487213 816207352 815902863 816035080
2045.5 816035080 815810089 815160446 814909058 814131012 813934479 813681641 813647003 813951263 814073639 814595337
2055.1 814595337 815111542 815411987 815457687 815649872 815205154 814669342 814765244 814600067 814507370 813989334
$$ packed form
1988.6H18539429k63901M31442n27038j055527R99145J581879M81567m3945J71890
1997.2H20314941K85798N950m58526k94418m35563p38144m04357J05514p63n68771
2006.9H17811661M0130N80368J18409J81274M01764K56195K18735J42364k50702j187667
2016.5H18312531j351014J2513r5597k11105K32849k31018k2736M12979N36881J89896
2026.2H17786179J47094J19095l70788n0965l15246m13819l14102m74777m41589l78190
2035.8H15292892K27356K99073l1891p0496J79749m01917p553P20139l04489J32217
2045.5H16035080k24991o49643k51388p78046j96533k52838l4638L04260J22376N21698
2055.1H14595337N16205L00445M5700J92185m44718n35812R5902j65177r2697n18036
$$ plain form
2064.7 813989334 813229218 813047943 813472977 814183731 814772644 815070496 815302353 815608521 815448990 815583344
2074.4 815583344 815618591 815051727 814633331 814391174 814054031 813473206 813398743 813498001 813623199 813964920
2084 813964920 814361115 814787369 814790192 815008850 815541687 815844193 815426788 815048752 815035172 814740524
2093.7 814740524 814482956 813854370 813612595 813906784 814249191 814673386 814842911 815121918 815334015 815582733
2103.3 815582733 815529556 815516891 815734482 815376511 814906540 814662552 814682541 814292755 813728485 813693390
2113 813693390 814323807 814949722 815125122 815726471 816093063 816317902 816317291 816091843 816170502 815691299 815068436
2123.6 815068436 814625702 814435501 814298782 814153671 814086761 814240570 814725571 814815979 815172958 815879974
2133.2 815879974 816523056 816579895 815997009 815575943 815282516 815140381 814755173 814484940 813940887 813538513
$$ packed form
2064.7H13989334p60116j81275M25034P10754N88913K97852K31857L06168j59531J34354
2074.4H15583344L5247n66864m18396k42157l37143n80825p4463R9258J25198L41721
2084H13964920L96195M26254K823K18658N32837L02506m17405l78036j3580k94648
2093.7H14740524k57568o28586k41775K94189L42407M24195J69525K79007K12097K48718
2103.3H15582733n3177j2665K17591l57971m69971k43988J9989l89786n64270l5095
2113H13693390O30417O25915J75400O01349L66592K24839o11k25448P8659m79203o22863
2123.6H15068436m42734j90201j36719j45111o6910J53809M85001R0408L56979P07016
2133.2H15879974O43082N6839n82886m21066k93427j42135l85208k70233n44053m02374
$$ plain form
2142.9 813538513 813892136 814035263 814525681 815140228 815566101 815633469 815853806 816130371 815617752 815365448
2152.5 815365448 815294647 815215378 814883957 814677811 814486160 814164047 814337845 814312286 814723892 815296021
2162.1 815296021 816044617 816401901 816216202 816813278 816651306 816247635 815956726 815511551 815407715 815402756
2171.8 815402756 815411987 814876633 814835205 815439835 816425400 817171097 817251434 817606812 817851944 818161545
2181.4 818161545 817975006 817245560 817032928 817033386 816557846 816155243 816408081 816429367 816517868 817036514
2191.1 817036514 818128891 818836441 818649445 819076767 819469070 819458466 819092102 818335648 817809219 817519608
2200.7 817519608 817133484 816956177 817423935 817741089 818065262 818348312 818807449 819639511 820156860 820610199
2210.4 820610199 820629654 820518951 820137024 819611588 819394455 819022217 818689728 818251648 818170242 818221359
$$ packed form
2142.9H13538513L53623J43127M90418O14547M25873O7368K20337K76565n12619k52304
2152.5H15365448p0801p9269l31421k06146j91651l22113J73798k5559M11606N72129
2162.1H15296021P48596L57284j85699N97076j61972m03671k90909m45175j03836m959
2171.8H15402756R231n35354m1428O04630R85565P45697Q0337L55378K45132L09601
2181.4H18161545j86539p29446k12632M58m75540m02603K52838K1286Q8501N18646
2191.1H17036514J092377P07550j86996M27322L92303j0604l66364p56454n26429k89611
2200.7H17519608l86124j77307M67758L17154L24173K83050M59137Q32062N17349M53339
2210.4H20610199J9455j10703l81927n25436k17133l72238l32489m38080q1406N1117
$$ plain form
2220 818221359 818542023 819480362 820232620 820799103 821251755 821500168 820983429 820398865 820389709 820294189
2229.7 820294189 819832153 819231415 818999863 819065018 819239044 819148254 819681549 820699081 821281662 821875687
2239.3 821875687 821948318 821759872 821431808 821220322 821120071 820580673 819974442 819360123 819048691 818809128
2248.9 818809128 819122849 819885406 820536270 821025772 821322708 822103806 822313919 822058258 821873550 821623154
2258.6 821623154 821464157 820979919 820425797 819663162 819375153 819725189 820313797 820841293 821206970 821593857
2268.2 821593857 821572952 822093277 822652512 822601547 822168732 821414185 820910492 820563965 820578766 820318222
2277.9 820318222 820048828 820366440 821040649 821247101 821216125 821843491 821886978 822367783 822766647 822318649
2287.5 822318649 822255707 821668167 821269684 821330948 821558456 821096725 820626984 820946655 820701447 821297607
$$ packed form
2220H18221359L20664R38339P52258N66483M52652K48413n16739n84564r156r5520
2229.7H20294189m62036o00738k31552O5155J74026r0790N33295J017532N82581N94025
2239.3H21875687P2631j88446l28064k11486j00251n39398o06231o14319l11432k39563
2248.9H18809128L13721P62557O50864M89502K96936P81098K10113k55661j84708k50396
2258.6H21623154j58997m84238n54122p62635k88009L50036N88608N27496L65677L86887
2268.2H21593857k0905N20325N59235n0965m32815p54547n03693l46527J4801k60544
2277.9H20318222k69394L17612O74209K06452l0976O27366M3487M80805L98864m47998
2287.5H22318649o2942n87540l98483O1264K27508m61731m69741L19671k45208N96160
$$ plain form
2297.2 821297607 822160034 822525024 823134079 823585739 823496857 823043747 822847137 822191696 822307358 822799149
2306.8 822799149 822476196 822224808 821978760 822246933 822194366 822087479 822135773 822501678 823537903 823833389
2316.4 823833389 823996658 823921509 824173431 825134659 825098495 824021835 822335052 821860123 822850418 823236542
2326.1 823236542 822862244 823423462 824721832 825430679 825552902 825503769 825620346 825702744 825887833 825547867
2335.7 825547867 824114761 823017426 822903595 823267746 823231277 822406235 821981049 822636261 822783203
2344.4 822783203 822829971 823416519 822925720 822192001 823353806 825188980 825215302 825123749 824633102 824048920
2354.1 824048920 824835358 824378204 824919281 824783249 822801132 822398300 823464279 824858932 825568161
2362.7 825568161 825577774 824013672 823133240 822768707 821588440 820638657 819794769 819652023 819802628 820155411
$$ packed form
2297.2H21297607Q62427L64990O09055M51660q8882m53110j96610o55441J15662M91791
2306.8H22799149l22953k51388k46048K68173n2567j06887M8294L65905J036225K95486
2316.4H23833389J63269p5149K51922R61228l6164j076660j686783m74929R90295L86124
2326.1H23236542l74298N61218J298370P08847J22223m9133J16577Q2398J85089l39966
2335.7H25547867j433106j097335j13831L64151l6469q25042m25186O55212J46942
2344.4H22783203M6768N86548m90799p33719J161805J835174K6322r1553m90647n84182
2354.1H24048920P86438m57154N41077j36032j982117m02832J065979J394653P09229
2362.7H25568161R613j564102q80432l64533j180267r49783q43888j42746J50605L52783
$$ plain form
2372.4 820155411 819855347 818779907 818628006 819468918 820259933 820011444 819257584 818664627 817934341
2381.1 817934341 817071609 816382751 815881729 815760727 815707703 815364990 815526428 816118164 816538239 816516800
2390.7 816516800 816505661 816730423 816620865 816418915 815852280 815216370 815018234 815060959 814883728 814401550
2400.3 814401550 814777985 815189056 814980469 814900284 814928665 815212402 815432968 815143661 814807968 814810715
2410 814810715 814320221 813652649 813467712 813276215 812925644 812274170 812092209 812499771 812554550 812377319
2419.6 812377319 812723083 813177032 813075409 812932434 812564468 812162704 811905518 811511993 811062164 810663681
2429.3 810663681 810491104 810089111 809925842 810077438 810181122 810416565 810465240 810517273 810617294 810475311
2438.9 810475311 809925156 809451294 809047546 808475571 808106537 807747726 807367706 807243958 807603455 807650909
$$ packed form
2372.4H20155411l00064j075440j51901Q40912P91015k48489p53860n92957p30286
2381.1H17934341q62732o88858n01022j21002n3024l42713J61438N91736M20075k1439
2390.7H16516800j1139K24762j09558k01950n66635o35910j98136M2725j77231m82178
2400.3H14401550L76435M11071k08587q0185K8381K83737K20566k89307l35693K747
2410H14810715m90494o67572j84937j91497l50571o51474j81961M07562N4779j77231
2419.6H12377319L45764M53949j01623j42975l67966m01764k57186l93525m49829l98483
2429.3H10663681j72577m01993j63269J51596J03684K35443M8675N2033J00021j41983
2438.9H10475311n50155m73862m03748n71975l69034l58811l80020j23748L59497M7454
$$ plain form
2448.6 807650909 807538300 807706375 807663574 807827530 807928467 807923355 807329559 806457291 806219025 805887909
2458.2 805887909 805601883 805113907 804521255 804434586 804646378 804946365 805311737 805481949 805448914 805768356
2467.8 805768356 805854874 805697708 804899139 803864594 803663940 803374634 803114929 802598495 802242889 802302856
2477.5 802302856 802231674 802522964 802570190 802557373 802769928 803025284 802822495 802410812 802403870 801959152
2487.1 801959152 801164856 800705185 800922775 800676498 800079651 800002899 800158005 800710449 800874557 801035538
2496.8 801035538 800960388 800610733 800668564 800404358 800068130 799338837 798763962 798705750 798527832 798334503
2506.4 798334503 798163834 798309479 798436661 798590469 798858414 799093170 799053345 798924866 798905334 798531113
2516.1 798531113 798258896 797816162 797440262 797278671 796817932 796457596 796272736 796464157 796633911 796549225
$$ packed form
2448.6H07650909j12609J68075m2801J63956J00937n112n93796q72268k38266l31116
2458.2H05887909k86026m87976n92652q6669K11792K99987L65372J70212l3035L19442
2467.8H05768356Q6518j57166p98569j034545k00654k89306k59705n16434l55606N9967
2477.5H02302856p1182K91290M7226j2817K12555K55356k02789m11683o942m44718
2487.1H01959152p94296m59671K17590k46277n96847p6752J55106N52444J64108J60981
2496.8H01035538p5150l49655N7831k64206l36228p29293n74875n8212j77918j93329
2506.4G98334503j70669J45645J27182J53808K67945K34756l9825j28479j9532l74221
2516.1G98531113k72217m42734l75900j61591m60739l60336j84860J91421J69754q4686
$$ plain form
2525.7 796549225 796506729 796837845 797153244 796715851 796127090 795811386 795619736 795117798 794909821 795100403
2535.4 795100403 795022736 795047913 794941940 794734573 794617310 794640732 794561005 794307098 793995895 793199539
2545 793199539 792468719 792359924 792523575 791991959 791171875 791181717 791771469 792010498 791666260 791736755
2554.6 791736755 791748199 791573181 791569977 791448898 791096420 790200119 789768524 789786758 789793625 789614105 789146118
2565.2 789146118 788826904 788353119 788161621 788307343 788695755 788746567 788420563 788528442 788244247 787727127
2574.9 787727127 787358322 787226334 787102051 786711884 786490784 786425400 786563721 786481781 786453094 786468277
2584.5 786468277 786371078 786451492 786206360 785770569 785354233 785152740 784821701 784430618 784122772 783611069
2594.2 783611069 783677750 783999939 784235153 784212265 783815155 783648605 783596497 783659286 783444443 782799606
$$ packed form
2525.7G96549225m2496L31116L15399m37393n88761l15704j91650n01938k07977J90582
2535.4G95100403p7667K5177j05973k07367j17263K3422p9727k53907l11203p96356
2545G93199539p30820j08795J63651n31616q20084R842N89752K39029l44238P0495
2554.6G91736755J1444j75018l204j21079l52478q96301m31595J8234O867j79520m67987
2565.2G89146118l19214m73785j91498J45722L88412N0812l26004J07879k84195n17120
2574.9G87727127l68805j31988j24283l90167k21100o5384J38321q1940k8687J5183
2584.5G86468277r7199Q0414k45132m35791m16336k01493l31039l91083l07846n11703
2594.2G83611069O6681L22189K35214k2888l97110j66550n2108O2789k14843o44837
$$ plain form
2603.8 782799606 782532043 782489319 782153931 781856155 781741409 781996613 782184830 781585236 781239777 781223373
2613.5 781223373 781065521 781106110 781006165 780577545 780077286 779867783 779700394 779246063 778636322 778114624
2623.1 778114624 777791138 777591248 777531738 777431946 777209549 776988602 776839600 776302338 775631027 775407867
2632.8 775407867 775259399 774857941 774309311 774163361 773889160 773655624 773576508 773033447 772870636 772627716
2642.4 772627716 772535629 772476349 771738129 771484604 771283951 770740814 770300598 769898529 769164810 768699036
2652 768699036 768783188 768233032 767510071 767203369 767419815 767548447 767142181 766959763 766569824 766091156
2661.7 766091156 765908356 765766830 765669098 765515747 765073700 764420090 764029770 763802643 763367157 762703018
2671.3 762703018 762556610 762786484 762509995 762393723 762809525 762747955 761919174 761482315 761356812 760717163
$$ packed form
2603.8G82799606k67563m2724l35388k97776j14746K55204J88217n99594l45459j6404
2613.5G81223373j57852M0589r9945m28620n00259k09503j67389m54331o09741n21698
2623.1G78114624l23486j99890n9510r9792k22397k20947j49002n37262o71311k23160
2632.8G75407867j48468m01458n48630j45950k74201k33536p9116n43061j62811k42920
2642.4G72627716r2087n9280p38220k53525k00653n43137m40216m02069p33719m65774
2652G68699036Q4152n50156p22961l06702K16446J28632m06266j82418l89939m78668
2661.7G66091156j82800j41526r7732j53351m42047o53610l90320k27127m35486o64139
2671.3G62703018j46408K29874k76489j16272M15802o1570q28781m36859j25503o39649
$$ plain form
2681 760717163 760115967 760109482 760123596 759558487 759157028 759192276 759085159 758560333 758175812 758434296 758485641
2691.6 758485641 758094254 757668228 757358932 757089844 756838608 756531372 755955887 755424042 755327835 755540848
2701.2 755540848 754972687 754342804 754529266 754231567 753619766 753367233 753527374 753473129 752823792 752152176
2710.9 752152176 751687546 751714706 751572113 750992279 750725632 750466003 749843216 749539871 749486618 749292908
2720.5 749292908 749675751 749847336 749185181 748737030 748415909 747776031 747190247 746899338 746759567 746628342
2730.2 746628342 746463470 746593323 746755829 746616669 746274261 745931091 745803223 745154266 744322205 744010162
2739.8 744010162 744028854 743702774 743055573 743066788 742878036 742713318 742829208 742615967 742641296 742516785
2749.4 742516785 742404404 742285080 742221451 742390137 742126389 741581879 740824814 740133743 739803009 739636002
$$ packed form
2681G60717163o01196o485J4114n65109m01459L5248j07117n24826l84521K58484N1345
2691.6G58485641l91387m26026l09296k69088k51236l07236n75485n31845r6207K13013
2701.2G55540848n68161o29883J86462k97699o11801k52533J60141n4245o49337o71616
2710.9G52152176m64630K7160j42593n79834k66647k59629o22787l03345n3253j93710
2720.5G49292908L82843J71585o62155m48151l21121o39878n85784k90909j39771j31225
2730.2G46628342j64872J29853J62506j39160l42408l43170j27868o48957q32061l12043
2739.8G44010162J8692l26080o47201J1215j88752j64718J15890k13241K5329j24511
2749.4G42516785j12381j19324o3629J68686k63748n44510p57065o91071l30734j67007
$$ plain form
2759.1 739636002 739265060 739158096 739341888 739260559 739632568 739791336 739235764 739011841 739416122 739418716
2768.7 739418716 738700180 738265839 737931595 737475891 736863403 736533661 736508102 736410980 736638794 736323090
2778.4 736323090 735964355 736105042 736123886 735963669 735263062 734594498 734117889 733814621 733688278 733226013
2788 733226013 732516937 731710205 731294479 731151886 730893478 730769730 730552139 730147629 730089417 730066757
2797.7 730066757 729379349 728488464 727656784 726687622 725954208 725603027 725235367 724670868 724092789 723794785
2807.3 723794785 723583069 723263168 723197098 722906647 722306900 721742630 720807343 719823837 719086533 718303680
2816.9 718303680 717273483 716298981 715634003 715056229 714557114 714047470 713551712 713092270 712512817
2825.6 712512817 711680984 710888748 710458374 709691238 708263321 706896515 706003647 705390396 704703445
$$ packed form
2759.1G39636002l70942j06964J83792q1329L72009J58768n55572k23923M04281K594
2768.7G39418716p18536m34341l34244m55704o12488l29742k5559r7122K27814l15704
2778.4G36323090l58735J40687J8844j60217p00607o68564m76609l03268j26343m62265
2788G33226013p09076q06732m15726j42593k58408j23748k17591m04510n8212k2660
2797.7G30066757o87408q90885q31680r69162p33414l51181l67660n64499n78079k98004
2807.3G23794785k11716l19901o6070k90451n99747n64270r35287r83506p37304p82853
2816.9G18303680j030197r74502o64978n77774m99115n09644m95758m59442n79453
2825.6G12512817q31833p92236m30374p67136j427917j366806q92868o13251o86951
$$ plain form
2834.3 704703445 703399811 702105484 701651154 701067200 700148849 699451599 698642197 697311325 695479584
2843 695479584 693371887 691475983 689976807 688134995 685956802 683840103 681966705 680276947 678845596
2851.7 678845596 678137131 677411270 676838303 676675339 676330261 676221313 676200943 675817261 674737625 673748245
2861.3 673748245 673385162 672326813 670846710 669922409 669065781 668134308 667148056 665673218 664461136
2870 664461136 663502655 661772003 660038910 658800964 657452850 655601654 653506393 651770172 650300903
2878.7 650300903 648710556 647192841 646040726 645101547 644352112 643568649 643192978 643339157 642576218
2887.3 642576218 641295395 640392303 639611549 639108925 638663940 638107300 637729073 637318649 637090034
2896 637090034 637188835 636862259 636548080 636478386 636299400 636109238 635608292 635065651 634306374 633163185
$$ packed form
2834.3G04703445j303634j294327m54330n83954r18351o97250q09402j330872j831741
2843F95479584k107697j895904j499176j841812k178193k116699j873398j689758j431351
2851.7F78845596p08465p25861n72967j62964l45078j08948k0370l83682j079636r89380
2861.3F73748245l63083j058349j480103r24301q56628r31473r86252j474838j212082
2870F64461136r58481j730652j733093j237946j348114j851196k095261j736221j469269
2878.7F50300903j590347j517715j152115r39179p49435p83463l75671J46179p62939
2887.3F42576218j280823r03092p80754n02624m44985n56640l78227m10424k28615
2896F37090034R8801l26576l14179o9694j78986j90162n00946n42641p59277j143189
$$ plain form
2905.7 633163185 632064247 631241379 630094643 628300095 627123070 626181908 624852905 623240089 621668053
2914.3 621668053 620483551 618779068 617155609 615894089 614173126 611976967 610357475 609388618
2922.1 609388618 607594795 606011696 605192490 604992104 605004654 604559326 604844170 605271797 605695038
2930.7 605695038 606384850 606747742 607344017 608100548 608591270 609320145 610565300 611457672 612656441
2939.4 612656441 614878273 617227211 619476051 621445580 623292198 625713463 628294678 630253792
2947.1 630253792 632366753 634277573 635619278 637207680 638395081 639481010 640601654 641776047
2954.8 641776047 643541336 645497131 647493973 649401550 651397934 653423996 655464706 657341919
2962.6 657341919 658871613 660325699 661563187 662671661 664007721 665717468 667070389 668123322
$$ packed form
2905.7F33163185j098938q22868j146736j794548j177025r41162j329003j612816j572036
2914.3F21668053j184502j704483j623459j261520j720963k196159j619492r68857
2922.1F09388618j793823j583099q19206k00386J2550m45328K84844M27627M23241
2930.7F05695038O89812L62892N96275P56531M90722P28875J245155Q92372J198769
2939.4F12656441K221832K348938K248840J969529J846618K421265K581215J959114
2947.1F30253792K112961J910820J341705J588402J187401J085929J120644J174393
2954.8F41776047J765289J955795J996842J907577J996384K026062K040710J877213
2962.6F57341919J529694J454086J237488J108474J336060J709747J352921J052933
$$ plain form
2970.3 668123322 669141235 670024719 671475449 673321686 674792252 675969925 677749176 679468613
2978 679468613 680685043 681737747 682566986 684018707 684750748 684492264 685046616 686069412 686825485
2986.7 686825485 687534561 688638763 689699173 690563736 691424408 692161484 692335281 692211761 692571030
2995.3 692571030 692732925 692830048 693065262 692986832 692889633 692771225 692608337 692761459 693025360 693040619
3005 693040619 693261795 693381042 693603973 694035568 693562012 692619705 691989517 691338806 690578232 690719910
3014.6 690719910 690733795 689969025 689867401 689448624 688805313 688349304 687837372 687805557 687616653 687271957
3024.3 687271957 686857300 686067657 685020370 684074097 683156433 682318497 681583786 680436096 679876785
3033 679876785 679717407 679232178 678996658 678610001 677695541 676775742 676281586 675491867 674233932 673213959
$$ packed form
2970.3F68123322J017913Q83484J450730J846237J470566J177673J779251J719437
2978F79468613J216430J052704Q29239J451721P32041k58484N54352J022796P56073
2986.7F86825485P09076J104202J060410Q64563Q60672P37076J73797j23520L59269
2995.3F92571030J61895R7123K35214p8430r7199j18408j62888J53122K63901J5259
3005F93040619K21176J19247K22931M31595m73556r42307o30188o50711p60574J41678
3014.6F90719910J3885p64770j01624m18777o43311m56009n11932l1815j88904l44696
3024.3F87271957m14657p89643j047287r46273r17664q37936p34711j147690n59311
3033F79876785j59378m85229k35520l86657r14460r19799m94156p89719j257935j019973
$$ plain form
3042.6 673213959 672099533 670783997 670007706 669817657 669559479 668794632 667723465 666856079 666063461
3051.3 666063461 665599823 665292053 664621658 663791122 662470551 660958557 659630508 658822632 658235779
3060 658235779 656985092 656005859 655855865 655506592 654264069 653740540 653642502 652476120 651744385 651281738
3069.6 651281738 650245132 648919907 647740784 646564255 645231400 644486160 643442307 642446976 642192307
3078.3 642192307 641450272 640547867 639984093 639248428 638563805 638144913 637428436 636218491 634812546
3087 634812546 633685837 632525864 631654282 631471329 630612984 629366760 628569107 628056335 627159424
3095.6 627159424 626142540 625507851 624665947 624320145 623497314 622265167 621502953 620018997 618708382
3104.3 618708382 617871399 617307892 616885452 615972443 614629631 613746452 613706703 613027763 611955070
$$ packed form
3042.6F73213959j114426j315536p76291j90049k58178p64847j071167q67386p92618
3051.3F66063461m63638l07770o70395q30536j320571j511994j328049q07876n86853
3060F58235779j250687r79233j49994l49273j242523n23529r8038j166382p31735m62647
3069.6F51281738j036606j325225j179123j176529j332855p45240j043853r95331k54669
3078.3F42192307p42035r02405n63774p35665o84623m18892p16477j209945j405945
3087F34812546j126709j159973q71582j82953q58345j246224p97653n12772q96911
3095.6F27159424j016884o34689q41904l45802q22831j232147p62214j483956j310615
3104.3F18708382q36983n63507m22440r13009j342812q83179l9749o78940j072693
$$ plain form
3113 611955070 611170197 610643921 609879150 608587646 607696686 606397858 605002518 604462242 603973351
3121.7 603973351 603202667 602401505 601439743 600490913 599958572 599158707 598257294 597328720 596359024 595968361
3131.3 595968361 595410881 593700447 591888885 591396370 590987930 590224571 589127045 588183441 588175049
3140 588175049 587485466 586728210 586111794 585076904 584165344 583265686 582490082 581184921 580135918
3148.7 580135918 579370079 578217964 577363319 576895523 576346664 575280647 574821014 574191475 572890244
3157.4 572890244 572460365 572046356 570962334 570016174 569406700 568338318 567272224 566594620 565669136
3166 565669136 564490013 563170395 562493439 562276192 561765289 561094666 560466461 559883080 559281044 558484802
3175.7 558484802 557624779 556817970 555544853 554928131 554515762 553322144 552617607 552264900 551981812
$$ packed form
3113F11955070p84873n26276p64771j291504q90960j298828j395340n40276m88891
3121.7F03973351p70684q01162r61762r48830n32341p99865r01413r28574r69696l90663
3131.3E95968361n57480j710434j811562m92515m08440p63359j097526r43604q392
3140E88175049o89583p57256o16416j034890r11560q99658p75604j305161j049003
3148.7E80135918p65839j152115q54645m67796n48859j066017m59633o29539j301231
3157.4E72890244m29879m14009j084022r46160o09474j068382j066094o77604r25484
3166E65669136j179123j319618o76956k17247n10903o70623o28205n83381o02036p96242
3175.7E58484802q60023q06809j273117o16722m12369j193618p04537l52707k83088
$$ plain form
3184.4 551981812 551054497 549608994 548610535 547859268 547603798 547247429 546594200 545734062 544720230
3193 544720230 544238777 543702660 542618141 541513901 540107002 538691330 538385735 538677864 538721581
3201.7 538721581 537908249 537122955 536715927 535731506 535025635 534374809 533743477 533012390 532138405 531689110
3211.4 531689110 531034203 530577507 529445763 528567200 528662796 528120766 528001785 527836952 526855812 526026077
3221 526026077 525424271 524341469 523131943 522588768 522191391 521853523 520861435 519683113 519314728
3229.7 519314728 519213295 519199982 518845367 518471222 518228111 517930298 517842331 517279167 516005363 514657555
3239.3 514657555 513505058 513038330 512776070 511716080 510898170 510590439 510572128 510727158 510360451
3248 510360451 509957123 509554901 509168968 508696136 508025169 507235031 506405182 505951004 505312157 504827576
$$ packed form
3184.4E51981812r27315j445503r98459p51267k55470l56369o53229q60138j013832
3193E44720230m81453n36117j084519j104240j406899j415672l05595K92129M3717
3201.7E38721581q13332p85294m07028r84421p05871o50826o31332p31087q73985m49295
3211.4E31689110o54907m56696j131744q78563R5596n42030j18981j64833r81140q29735
3221E26026077o01806j082802j209526n43175l97377l37868r92088j178322l68385
3229.7E19314728j01433j3313l54615l74145k43111k97813q7967n63164j273804j347808
3239.3E14657555j152497m66728k62260j059990q17910l07731j8311J55030l66707
3248E10360451m03328m02222l85933m72832o70967p90138q29849m54178o38847m84581
$$ plain form
3257.7 504827576 504589958 504299507 503824539 503351631 503346672 502709732 502070656 502024956 501553230 500599251
3267.3 500599251 499851646 499370232 498417587 497663155 497431374 497457504 497427292 497302399 496986198 496002846
3276.9 496002846 495692291 495833626 495705490 495350418 494601059 493883705 493377304 493564415 493472900 492637978
3286.6 492637978 492105980 491818275 491445541 491084747 491068344 490979843 490635681 490398941 490301895 490150833
3296.2 490150833 489623222 488801956 488401451 488186684 487204857 486510353 486463432 486447105 486369858 486052666
3305.9 486052666 485927238 485684280 485469742 485122490 484511833 484446411 484350586 483700981 482822495 482493782
3315.5 482493782 482348137 482037659 481770058 481221046 481071815 481052475 480742111 480426331 480017662 479635315
3325.2 479635315 479202690 478668633 478161201 477830849 477130814 476282654 475966415 475701675 475417786 475117416
$$ packed form
3257.7E04827576k37618k90451m74968m72908m959o36940o39076m5700m71726r53979
3267.3E00599251p47605m81414r52645p54432k31781K6130l0212j24893l16201r83352
3276.9D96002846l10555J41335j28136l55072p49359p17354n06401J87111r1515q34922
3286.6D92637978n31998k87705l72734l60794j6403q8501l44162k36740r7046j51062
3296.2D90150833n27611q21266m00505k14767r81827o94504m6921j6327p7247l17192
3305.9D86052666j25428k42958k14538l47252o10657o5422r5825o49605q78486l28713
3315.5D82493782j45645l10478k67601n49012j49231j9340l10364l15780m08669l82347
3325.2D79635315m32625n34057n07432l30352p00035q48160l16239k64740k83889l00370
$$ plain form
3334.8 475117416 474644394 473956490 473383141 473601265 473758736 473092766 472657013 472320595 471825294 471570053
3344.4 471570053 470836906 470142403 469396095 468550949 468772469 468985214 468618507 468117065 467776413 467802353
3354.1 467802353 467574539 467050056 466609230 466174278 465486145 464726677 464025879 463357391 462979126 462991791
3363.7 462991791 462908669 462222862 461685066 461734161 461708069 461177597 460410347 459890404 459575081 458884048
3373.4 458884048 458051834 457542648 457009354 456950760 456807785 456206169 455999222 455684776 455544472 455537682
3383 455537682 455360146 454846687 454133110 454087830 454170151 454384918 453697929 452198029 452245941 452606430
3392.7 452606430 451858063 451285667 451443672 451645393 451424942 451218224 451474113 451939697 451995583 451682739
3402.3 451682739 451346893 450908966 450264854 449649582 449242325 449322090 449346848 449336128 449850960 449925423
$$ packed form
3334.8D75117416m73022o87904n73349K18124J57471o65970m35753l36418m95301k55241
3344.4D71570053p33147o94503p46308q45146K21520K12745l66707n01442l40652K5940
3354.1D67802353k27814n24483m40826m34952o88133p59468p00798o68488l78265J2665
3363.7D62991791q3122o85807n37796M9095k6092n30472p67250n19943l15323o91033
3373.4D58884048q32214n09186n33294n8594j42975o01616k06947l14446j40304o790
3383D55537682j77536n13459p13577m5280Q2321K14767o86989j499900M7912L60489
3392.7D52606430p48367n72396J58005K01721k20451k06718K55889M65584N5886l12844
3402.3D51682739l35846m37927o44112o15272m07257P9765K4758j0720N14832P4463
$$ plain form
3412 449925423 449831772 449883690 449992409 450113029 449883842 449902687 449924088 450002594 449449959 448573761 448760529
3422.6 448760529 448801956 449109116 449674568 449455719 449062729 448992882 449787254 450732193 450670013 450482140
3432.2 450482140 450384560 450263100 450461807 450145493 449830627 449682961 449910126 450624466 450855217 451384201
3441.8 451384201 451743240 452122765 452388725 452709198 453332672 452025757 452120781 453342133 453765221
3450.5 453765221 454024849 453776855 453905220 453676605 454208069 455426979 456144562 457028313 457268295
3459.2 457268295 457519875 457779655 458059959 458127136 458042259 458214912 458334885 459073334 459345894 459690971
3468.8 459690971 460518456 461362724 462178001 462633667 463707657 464023323 463456459 463803940 464525490
3477.5 464525490 465347939 466229362 466305237 466304245 466757164 466428108 467013283 467924957 468259773 469143257
$$ packed form
3412D49925423r3651N1918J08719J20620k29187J8845K1401P8506n52635q76198J86768
3422.6D48760529M1427L07160N65452k18849l92990o9847P94372R44939o2180j87873
3432.2D50482140r7580j21460J98707l16314l14866j47666K27165P14340K30751N28984
3441.8D51384201L59039L79525K65960L20473O23474j306915R5024J221352M23088
3450.5D53765221K59628k47994J28365k28615N31464J218910P17583Q83751K39982
3459.2D57268295K51580K59780K80304O7177q4877J72653J19973P38449K72560L45077
3468.8D59690971Q27485Q44268Q15277M55666J073990L15666n66864L47481P21550
3477.5D64525490Q22449Q81423P5875r92M52919l29056N85175R11674L34816Q83484
$$ plain form
3487.2 469143257 469461479 470249252 471697006 472229500 472380257 472967758 473431625 473623199 473898811
3495.8 473898811 473961296 474564781 475095253 475347290 476392746 477501564 477894058 478027534 478647308
3504.5 478647308 480131950 481620293 481780319 482235031 482215805 481443214 482793427 483965797 484364166
3513.2 484364166 484852066 485687408 486417198 486863098 488006325 488682976 489094543 489652100 490880241
3521.9 490880241 491653328 491031494 491458130 492624207 493804588 493606911 493730850 494336510 494736862
3530.6 494736862 495849991 497083473 498633003 499374809 500635529 500495262 499589615 501197014 502089424
3539.2 502089424 503433113 504233513 504634476 505734024 506759224 506823578 505681229 506546745 506605873
3547.9 506605873 508785858 511289139 512729378 514856262 513504944 514481087 515854645 516745186 517760925
$$ packed form
3487.2D69143257L18222P87773J447754N32494J50757N87501M63867J91574K75612
3495.8D73898811O2485O03485N30472K52037J045456J108818L92494J33476O19774
3504.5D78647308J484642J488343J60026M54712j9226p72591J350213J172370L98369
3513.2D84364166M87900Q35342P29790M45900J143227O76651M11567N57557J228141
3521.9D90880241P73087o21834M26636J166077J180381j97677J23939O05660M00352
3530.6D94736862J113129J233482J549530P41806J260720j40267r05647J607399Q92410
3539.2E02089424J343689Q00400M00963J099548J025200O4354j142349Q65516N9128
3547.9E06605873K179985K503281J440239K126884j351318R76143J373558Q90541J015739
$$ plain form
3556.6 517760925 517027588 519072609 520723038 520600014 520355721 522914085 524826012 525051727 529383354
3565.3 529383354 528744354 527238464 526586800 526219826 530830917 532492294 533839455 535717850 537065811
3574 537065811 537012405 537711639 540262680 540533409 543082008 544472008 544581566 546710548 548460007
3582.6 548460007 549674835 549797058 553551178 554379234 551340294 552285995 551282921 555266037 559182320
3591.3 559182320 562296715 563081779 563562393 566751747 564750252 568005180 571262512 570809441 573904114
3600 573904114 573760490 574196091 576842232 578665810 580654030 584306107 586749306 584176292 587571793
3608.7 587571793 585854530 585784569 595330849 595181465 591008301 594446526 593519363 598710594 603815613
3617.4 603815613 602474480 602699394 600333405 601395988 606254616 609439316 611304054 613988876
$$ packed form
3556.6E17760925p33337K045021J650429j23024k44293K558364J911927K25715M331627
3565.3E29383354o39000j505890o51664l66974M611091J661377J347161J878395J347961
3574E37065811n3406O99234K551041K70729K548599J390000J09558K128982J749459
3582.6E48460007J214828J22223L754120Q28056l038940R45701j003074L983116L916283
3591.3E59182320L114395P85064M80614L189354k001495L254928L257332m53071L094673
3600E73904114j43624M35601K646141J823578J988220L652077K443199k573014L395501
3608.7E87571793j717263o9961R546280j49384m173164L438225r27163N191231N105019
3617.4F03815613j341133K24914k365989J062583M858628L184700J864738K684822
$$ plain form
3625.1 613988876 615544777 617243042 625514030 623829422 607706528 613307343 619726868 625642471
3632.8 625642471 625510788 623092003 626473846 629885864 631568069 631363869 632629776 635364647 638233643
3641.5 638233643 638251076 637649422 639903412 643618469 649966583 645057373 637905045 643677979 642443314
3650.1 642443314 639134178 640168991 648034515 653631287 658012390 661630707 650717773 653629074
3657.9 653629074 659833221 661102066 662031555 661788330 663819809 665210342 666251068 666857529 666961517
3666.5 666961517 671977005 674933853 672837601 670746231 662281723 666612701 677388306 687011948
3674.3 687011948 684099197 661649628 665613480 675731049 680857162 676700211 676921921 681303329
3682 681303329 683346939 684550095 685313950 685963211 690413055 696677856 684609756 681113892 690928116
$$ packed form
3625.1F13988876J555901J698265Q270988j684608j6122894N600815O419525N915603
3632.8F25642471j31683k418785L381843L412018J682205k04200J265907K734871K868996
3641.5F38233643J7433o01654K253990L715057O348114m909210p152328N772934j234665
3650.1F42443314l309136J034813P865524N596772M381103L618317j0912934K911301
3657.9F53629074O204147J268845R29489k43225K031479J390533J040726O06461J03988
3666.5F66961517N015488K956848k096252k091370q464508M330978J0775605R623642
3674.3F87011948k912751k2449569L963852J0117569N126113m156951K21710M381408
3682F81303329K043610J203156P63855O49261M449844O264801j2068100l495864R814224
$$ plain form
3690.6 690928116 683742828 684244690 690751419 691409378 693526382 693944397 693338852 694179459 694452667
3699.3 694452667 698184662 701549835 694346466 692388916 699105682 701161194 700710449 701037750 703269424
3708 703269424 706566925 697643433 701283951 704865036 689017487 694955750 701601181 703225479
3715.7 703225479 704180298 706786118 708143616 704355011 706473312 712770004 706575012 701758881
3723.4 701758881 708267136 708478622 707194748 704351654 704997711 709953766 711896667 718544617 713670273
3732.1 713670273 704523163 714675522 711708527 698002701 699428482 703936081 707159729 711886444
3739.8 711886444 715606689 711205139 715648956 729563828 715117874 695425949 707607803 714829636
3747.5 714829636 722201691 716706009 703040085 716223602 709902802 701727524 709798279 716368866
$$ packed form
3690.6F90928116p185288N01862O506729O57959K117004M18015o05545Q40607K73208
3699.3F94452667L731995L365173p203369j957550O716766K055512m50745L27301K231674
3708G03269424L297501q923492L640518L581085j5847549N938263O645431J624298
3715.7G03225479R54819K605820J357498l788605K118301O296692o194992m816131
3723.4G01758881O508255K11486j283874k843094O46057M956055J942901O647950m874344
3732.1G13670273r147110J0152359k966995j3705826J425781M507599L223648M726715
3739.8G11886444L720245m401550M443817J3914872j4445954j9691925J2181854P221833
3747.5G14829636P372055n495682j3665924J3183517o320800q175278Q070755O570587
$$ plain form
3755.3 716368866 720128632 714764786 717654724 723268509 714216614 712925873 717752075 719572906
3763 719572906 721317215 724689636 719107437 714508896 718903580 724124451 724300995 714017792 716082840
3771.7 716082840 720270996 721265030 722707291 722773819 723546371 723996277 727084656 725247498 716427536
3780.3 716427536 720757904 723511581 724720917 726813278 722370911 721503220 723577271 725181198
3788 725181198 726527634 726001129 725823898 725873566 726762848 726936569 728477859 731648483 725642090
3796.7 725642090 720971298 724289856 729221954 735713043 725556259 711984711 719355774 725090485
3804.4 725090485 730735855 736052628 722859421 719166260 726092911 729010773 730061264 730921097
3812.2 730921097 731293488 732670288 737833633 732497406 716255264 724155121 731663437 738157806
$$ packed form
3755.3G16368866L759766n363846K889938N613785r051895j290741M826202J820831
3763G19572906J744309L372421n582199m598541M394684N220871J76544j0283203K065048
3771.7G16082840M188156R94034J442261O6528P72552M49906L088379j837158q819962
3780.3G16427536M330368K753677J209336K092361m442367q67691K074051J603927
3788G25181198J346436n26505j77231M9668Q89282J73721J541290L170624o006393
3796.7G25642090m670792L318558M932098O491089j0156784j3571548P371063N734711
3804.4G25090485N645370N316773j3193207l693161O926651K917862J050491Q59833
3812.2G30921097L72391J376800N163345n336227j6242142P899857P508316O494369
$$ plain form
3819.9 738157806 739506378 715691299 719680252 727814941 731199341 733665390 731963348 726670532
3827.6 726670532 727896957 730944138 734738464 735414505 725455093 729700470 737651291 729943466
3835.3 729943466 730158539 740255814 729843140 723590317 731509628 725514908 727928619 736637344
3843 736637344 732218552 727137680 730943985 733691406 734292297 735825043 733830414 736848984 744616165
3851.7 744616165 734907990 733307495 715174637 719284668 732383118 731258240 730491943 733981857
3859.4 733981857 737251587 740416489 733344955 732989349 739317856 729464417 725092163 732592239
3867.1 732592239 739540100 745725937 733645782 722628098 729629974 738697739 741513062 727499237
3874.8 727499237 729912567 736135864 736905746 740142670 745452728 737476349 727781067 735166245
$$ packed form
3819.9G38157806J348572k3815079L988953Q134689L384400K466049j702042n292816
3827.6G26670532J226425L047181L794326O76041r959412M245377P950821p707825
3835.3G29943466K15073J0097275j0412674o252823P919311n994720K413711Q708725
3843G36637344m418792n080872L806305K747421O00891J532746j994629L018570P767181
3851.7G44616165r708175j600495j8132858M110031J3098450j124878p66297L489914
3859.4G33981857L269730L164902p071534l55606O328507r853439m372254P500076
3867.1G32592239O947861O185837j2080155j1017684P001876R067765K815323j4013825
3874.8G27499237K413330O223297P69882L236924N310058p976379r695282P385178
$$ plain form
3882.6 735166245 737134094 739026871 743961182 727796402 730510635 736341705 737441864 742524414
3890.3 742524414 739843903 728993912 732148895 736572418 735488205 737888870 739759979 742025070
3898 742025070 742718658 731509018 738477783 740755310 734009705 739281311 735273361 734077148 734796753
3906.7 734796753 736196060 739157333 738564072 738965454 738964310 739265747 739139175 738479843 740532227
3915.3 740532227 742850037 738419571 733784180 739154663 739468994 735408707 738620758 739672623
3923.1 739672623 740248184 738191452 735818100 738558655 740182190 741357651 739670105 739351501 741952667
3931.7 741952667 738110046 736283417 738476868 738901596 739785843 740920181 740648651 740314941 740043945
3940.4 740043945 741801376 742627869 737267761 737318268 740011139 741395721 742238312 738753128 738836823
$$ packed form
3882.6G35166245J967849J892777M934311j6164780K714233N831070J100159N082550
3890.3G42524414k680511j0849991L154983M423523j084213K400665J871109K265091
3898G42025070O93588j1209640O968765K277527o745605N271606m007950j196213P19605
3906.7G34796753J399307K961273n93261M01382j144L01437j26572o59332K052384
3915.3G40532227K317810m430466m635391N370483L14331m060287L212051J051865
3923.1G39672623N75561k056732k373352K740555J623535J175461j687546l18604K601166
3931.7G41952667l842621j826629K193451M24728Q84247J134338k71530l33710k70996
3940.4G40043945J757431Q26493n360108N0507K692871J384582Q42591l485184Q3695
$$ plain form
3949.1 738836823 739068451 737369232 740020981 740525208 739010620 739122086 740489578 740633316 740110626
3957.8 740110626 741620865 741455994 741376266 741534882 740166245 740485992 741458740 742082062 741572800
3966.5 741572800 740538101 740356140 739634781 739240112 740821152 741569901 740596848 740763321 740863419
3975.1 740863419 740394058 740434341 740603409 741413345 742086258 741469040 740842056 740580292 740081863 740441132
3984.8 740441132 741090393 741244125 741089020 741018372 741603241 741828690 741896515 741600037 741226730 741278076
3994.4 741278076 740812378 740906525 741384506 741398697 741033173 741151581
4000.2 741151581
$$ packed form
3949.1G38836823K31628j699219K651749N04227j514588J11466J367492J43738n22690
3957.8G40110626J510239j64871p9728J58616j368637L19747R72748O23322n09262
3966.5G41572800j034699j81961p21359l94669J581040P48749r73053J66473J00098
3975.1G40863419m69361M0283J69068Q09936O72913o17218o26984k61764m98429L59269
3984.8G40441132O49261J53732j55105p0648N84869K25449O7825k96478l73307N1346
3994.4G41278076m65698R4147M77981J4191l65524J18408
4000.2G41151581
##END=$$ End of the data block
