##TITLE=$$ Begin of the data block
##JCAMP-DX=5.00 $$ ACD/SpecManager v 10.08
##SPECTROMETER/DATA SYSTEM=Varian
##DATE=20 Nov 2012 15:00:14
##DATA TYPE=INFRARED SPECTRUM
##DATA CLASS=XYDATA
##ORIGIN=
##OWNER=
##NPOINTS=3735
##FIRSTX=399.26403809
##LASTX=4000.35498047
##MAXX=4000.35498047
##MINX=399.26403809
##MAXY=82.87949371
##MINY=42.51556015
##XFACTOR=1.0000000000
##YFACTOR=0.000000100000000
##FIRSTY=69.14763641
##DELTAX=0.96440572
##XUNITS=1/CM
##YUNITS=TRANSMITTANCE
##XYDATA=(X++(Y..Y))
399.3F91476364L101273r092179k1922454q136673M349060l417054n86395L925400
407F59697342P792816K545548M806594n32074r28039M095535m432068P041169L394393
415.7F83481216l936538L263397j3934631k5980454J3411179J2601394m576263m034424
423.4F60294876N136414J09787k900544n67627K251511n705719j682663N007019K662125
432.1F64605179m275284q814468K322540M657593l859940j684570N101242Q1940o27442
440.7F57506790J669617k811432O427002K109680m216614k901916O2713M72794J239166
449.4F59557800P273407K33155L758926J1596985L444900l723449l103943P329788
457.1F86367569r374085o264648q91113r010544J263351J133652k278442K032699M389649
$$ y = [691476364, 694577637, 685485458, 663563004, 655426331, 659775391, 656358337, 655771942, 659697342, 667490158, 670035706, 674842300, 674310226, 673382187, 677477722, 673045654, 680086823, 683481216, 679544678, 682808075, 668873444, 642892990, 656304169, 668905563, 664329300, 660294876, 665431290, 665541077, 662640533, 662072906, 664324417, 658618698, 656936035, 661943054, 664605179, 660329895, 651515427, 653837967, 658495560, 654635620, 652951050, 658052292, 658134232, 657506790, 659176407, 656364975, 662791977, 664901657, 660685043, 657783127, 657845840, 658318634, 659557800, 666831207, 667064362, 670823288, 682420273, 685865173, 682141724, 679037781, 686367569, 676993484, 670728836, 669837723, 660827179, 662090530, 663224182, 660945740, 662978439, 667368088]
465.8F67368088n9052k386322k992019l722840L118973N22003r481964k794266L481522
474.5F53054123m119034q00018K496719q900223k57949Q767242M672623p01676r79538
483.2F53232269J774369k384186k610245k172089j36337j178741k311020j497269k665176
491.8F40051575m43917J029549L882217K453309P43026j440277l983536J081543K123413
500.5F45496902M08936k415466m271965k353363p01104k542610l732185J629753M73862
509.2F31992760j557808n07050Q42781P80106j031685k281418K94838j17950o617089
517.9F21797485l974838n439911l035545K994346J692811J620712k91481J12114J389999
526.6F16865692R40552J075783J1596k046699m363518r36203j381454j492577J911659
$$ y = [667368088, 667309036, 664922714, 661930695, 658207855, 661326828, 661848831, 652366867, 649572601, 653054123, 648935089, 648135071, 650631790, 641731567, 641473618, 650240860, 654913483, 654211807, 653232269, 655006638, 652622452, 650012207, 647840118, 647703781, 646525040, 644214020, 642716751, 640051575, 639607658, 640637207, 644519424, 646972733, 647715759, 646275482, 642291946, 643373489, 645496902, 645905838, 643490372, 639218407, 636865044, 636163940, 633621330, 629889145, 631518898, 631992760, 630434952, 629927902, 630770683, 631550789, 630519104, 628237686, 628532524, 628414574, 621797485, 617822647, 612382736, 609347191, 612341537, 614034348, 615655060, 615363579, 615475693, 616865692, 617806244, 618882027, 618893623, 616846924, 612483406, 611547203, 610165749, 608673172, 610584831]
535.2F10584831J187096J676445L438949L884812J869392L220902N238762K940788
543F34041977J229401q31337k833863k917518r36509P17125j26037j433754j478462
551.6F25431023P27424L585129L096314Q8729r17205k610932k405205j832656l414498
560.3F21748123j941490k352982k144661j910438j442871k751045m920693Q5030O4850
569F04433823j099472m87290n70602j552315k188950q24012l874855j668206Q83713
577.7E93051834J037788K339020K170334L442230K702484L198357K999077K948952
585.4F13890076L614502K816085J845513N12771j96762j124305j582833R1172J579589
594.1F21445808n90820n06477J994896J571808K214584J164627J166878k13089j215859
$$ y = [610584831, 611771927, 613448372, 616887321, 620772133, 622641525, 625862427, 631101189, 634041977, 635271378, 634440041, 631606178, 628688660, 627752151, 628469276, 628343239, 626909485, 625431023, 626158447, 629743576, 632839890, 632928619, 632011414, 629400482, 626995277, 625162621, 621748123, 619806633, 617453651, 615308990, 613398552, 611955681, 609204636, 604283943, 604368973, 604433823, 603334351, 602847061, 602276459, 600724144, 598535194, 597711182, 593836327, 592168121, 593051834, 594089622, 596428642, 598598976, 602041206, 604743690, 607942047, 610941124, 613890076, 617504578, 620320663, 622166176, 622678947, 622482185, 621357880, 619775047, 619866219, 621445808, 620854988, 620348511, 622343407, 623915215, 626129799, 627294426, 628461304, 628248215, 627032356]
602.8F27032356N49965j432190j091957j331100j445160r19342o74362J525650J179046
611.4F23392906J944847P93610L84674J757622J851196J885147K00577P84073P79686
620.1F33774338n70755j250534M84504K118187J650696K656288J655999J980667J802215
628.8F44301605J764984L234024P41730j304932r35821O91681n16434j335754L73001
637.5F47014084r6359O1035L59192J728058K401504K392502K788162K560730J622315
646.2F60831223o05011l0442q60214k534027q25119o11420l50418j65939N82962J792831
655.8F57224426L151703K353821K09045J804886K281113P01446p40890j811981j088715
664.5F64084854j004562k1286R00955j875534M69971J521301K118530K814636P79801
$$ y = [627032356, 627582321, 626150131, 625058174, 623727074, 622281914, 621362572, 620688210, 622213860, 623392906, 625337753, 626131363, 626516037, 628273659, 630124855, 632010002, 632210579, 632994652, 633774338, 633203583, 631953049, 632437553, 634555740, 636206436, 638862724, 640518723, 642499390, 644301605, 646066589, 649300613, 650042343, 648737411, 647801590, 648493271, 647976837, 646641083, 647014084, 646917725, 646978760, 647337952, 649066010, 651467514, 653860016, 656648178, 659208908, 660831223, 660226212, 660195770, 659335556, 656801529, 655976410, 655364990, 655014572, 654848633, 655431595, 657224426, 660376129, 662729950, 662938995, 664743881, 667024994, 667726440, 666985550, 665173569, 664084854, 663080292, 663059006, 663959961, 662084427, 662554398, 664075699, 666194229, 669008865, 669788666]
673.2F69788666P8430K155914K232514J063842n95474k014770j948090m13208k14386
681.8F70133438j420593P23114J516037M25033K215958L204956J291428j3962J94244
690.5F78269653j44577J44882n89752k830047k501068j279221k310333k883759j80893
699.2F65694885J036530P02896L55835j04675N19638j87683m54178k93808j342240
707.9F65927200j537018j953506k650375j549683J63803Q23517J878052K332077K921371
716.6F66355438L670426L622055L618850K301789J734390J131516m73099l26996m87442
725.2F81146927P26395K112426J660767J820755J928711K393875K816391L334579L947373
733.9G01888199L282699J106568j117935q71354q97445q70438j021118j694031p85217
$$ y = [669788666, 669867096, 672023010, 674255524, 675319366, 674723892, 672709122, 670761032, 670347824, 670133438, 668712845, 669435959, 670951996, 671377029, 673592987, 676797943, 678089371, 678075409, 678269653, 678125076, 678269958, 677680206, 674850159, 672349091, 671069870, 668759537, 665875778, 665694885, 666731415, 667434311, 667790146, 667685471, 668205109, 668017426, 667563248, 667269440, 665927200, 664390182, 662436676, 659786301, 658236618, 658400421, 659223938, 661101990, 663434067, 666355438, 670025864, 673647919, 677266769, 679568558, 681302948, 682434464, 681961365, 681634369, 681146927, 681873322, 683985748, 685646515, 687467270, 689395981, 691789856, 694606247, 697940826, 701888199, 705170898, 706277466, 705159531, 704288177, 703390732, 702520294, 701499176, 699805145, 699019928]
742.6F99019928o81839L3646J812591J886826Q81576Q90885J084213n60684j877899
751.3G02489243k417756l399505m386444l534012k136383k335663l143845j903534
759F79232101J339646J542053K45972J236114J250229L89023K91138M21905J2894q55789
768.6F85105286r74503r53445K60162K478561K971192K669906L308793M859848N906448
777.3G05632248N220337L056564K217789K400360J617050L77121j58462n74952n33981
786G19254074J231232K036056K215119K215194K124024K977600K217483K089692L312988
794.7G39673462K482300o59638j945190K03934J178894l48359j325378n37033J143417
803.4G39866409K747727K946701K636261K128448J826325K379226J075898m61274j56173
$$ y = [699019928, 698338089, 698371735, 700184326, 702071152, 702952728, 703843613, 704927826, 704367142, 702489243, 700071487, 696671982, 692285538, 688751526, 686615143, 684279480, 681135635, 679232101, 680571747, 682113800, 682359772, 683595886, 684846115, 685235138, 685526276, 685948181, 685961075, 685105286, 684130783, 683177338, 683437500, 685916061, 688887253, 691557159, 694865952, 699725800, 705632248, 710852585, 713909149, 716126938, 718527298, 720144348, 720521469, 720363007, 719788055, 719254074, 720485306, 722521362, 724736481, 726951675, 729075699, 732053299, 734270782, 736360474, 739673462, 742155762, 741496124, 739550934, 739754868, 740933762, 740585403, 739260025, 738722992, 739866409, 742614136, 745560837, 748197098, 750325546, 752151871, 754531097, 755606995, 755145721, 754989548]
812G54989548Q44345o59409k444763k023849j883774j00403Q32214R18885J511917
820.7G51984711J383438J612549J028976J718063J184388j202011k468796l427429
828.4G51813889k693634k765198l362732j946182j308823j192932o91300J09330R50546
837.1G38912964o4087k79465k99377j983109k350769k423935k760162k758102k088013
845.8G23905945j942215j935425p70111k97318P07856R16061M56390P68586p79267
854.5G21030502k935028k323532j267929l244705l497086k517776k441406o64826J196900
863.1G03335114L010177M077988L546753L681259N283966O099396M622879K561035
870.9G36218567J396484J509171J094360L63236N39398L61252Q95309R10263J325531
$$ y = [754989548, 755833893, 755174484, 752729721, 750705872, 748822098, 748721695, 749553909, 750472794, 751984711, 753368149, 754980698, 756009674, 757727737, 758912125, 757710114, 755241318, 751813889, 749120255, 746355057, 742992325, 741046143, 739737320, 738544388, 737853088, 737962418, 738912964, 738848877, 738569412, 738270035, 736286926, 733936157, 731512222, 728752060, 725993958, 723905945, 721963730, 720028305, 719258194, 718960876, 719668732, 720584793, 721041183, 721809769, 721030502, 718095474, 715771942, 714504013, 711259308, 707762222, 705244446, 702803040, 702138214, 703335114, 706345291, 710423279, 713970032, 717651291, 722935257, 729034653, 733657532, 736218567, 737615051, 739124222, 740218582, 740581818, 741121216, 741482468, 742377777, 743288040, 744613571]
879.5G44613571J979904J378785O35070P1869J83563p84683j770019l391724m550705
888.2G38365631l818817k974854j980438k153625j836167j160965k47345M87519N99746
896.9G25280685N48783n38101q74176j668625k499314k779388k882767k712784l363876
905.6G08510437l206177k466583j548080j952134k369232q39462r94568k549210j252212
914.3F91332779j022797m779358n662002n082703m685440l553467l757476k636338
922F60153198r62448o03561m39530J14746N89371J102677P66525L93066O69861j3809
931.6F61770096n75257r45816l39889P18689N73044N83267Q03986J916275L193130
940.3F67697525K786331J971436K533111K654038R13849j266098k741166k776412l510132
$$ y = [744613571, 746593475, 747972260, 748607330, 748679199, 748862762, 748078079, 746308060, 742916336, 738365631, 734546814, 731571960, 729591522, 727437897, 725601730, 724440765, 724193420, 724680939, 725280685, 725829468, 725291367, 724417191, 722748566, 720249252, 717469864, 714587097, 711874313, 708510437, 705304260, 702837677, 701289597, 699337463, 696968231, 696128769, 695134201, 692584991, 691332779, 690309982, 685530624, 679868622, 674785919, 670100479, 666547012, 662789536, 660153198, 659190750, 658587189, 658147659, 658262405, 658851776, 659954453, 660720978, 661114044, 661783905, 661770096, 661194839, 660249023, 659909134, 660627823, 661200867, 661784134, 662588120, 664504395, 667697525, 670483856, 672455292, 674988403, 677642441, 678556290, 677290192, 674549026, 671772614, 668262482]
949F68262482m375229l532944l562927m106445m249421l609771l356171k960129l218460
957.7F35290985m833984n408516n416489n758972p615547p377434o584396p371178
965.4E84924469p357597p041779n989189o439438o557350o630325o386033p086868
973.1E31435890p960167o686973p755280p876777p643700p237358p647858p624588
980.8D71003189o110001n446319l429451m163818l573533k981643k551079j709862
988.5D41037483k200355j330185j927567q99086j168175o21833q9493j191864n42526
997.2D31066399j10398R89647J09902J232261P51190Q17719J553841o99349M69666
1005.9D36180878o98738j026650j321831j366005r38110k134781j170387j349564J82877
$$ y = [668262482, 663887253, 660354309, 656791382, 652684937, 648435516, 644825745, 641469574, 638509445, 635290985, 630457001, 625048485, 619631996, 613873024, 606257477, 598880043, 592295647, 584924469, 577566872, 570525093, 564535904, 558096466, 551539116, 544908791, 538522758, 531435890, 523475723, 516788750, 509033470, 501156693, 493512993, 486275635, 478627777, 471003189, 464893188, 459446869, 456017418, 451853600, 448280067, 445298424, 442747345, 441037483, 438837128, 437506943, 435579376, 434680290, 433512115, 432890282, 432800789, 431608925, 431066399, 430956001, 431945648, 432055550, 433287811, 434039001, 434856720, 436410561, 435711212, 436180878, 435482140, 434455490, 433133659, 431767654, 430829544, 428694763, 427524376, 426174812, 426357689]
1014.6D26357689m99764j79710k15683l06930K126312J67465P71713N02587J162910
1023.2D29886589J608086R95369J129150J35574J993180M79355J409683J869011K270202
1031.9D41776199L634148J365623J874276R87129J382637N24902K9412n25818q69904
1040.6D50178604J514435m91867L20930N8213J155395J523819J74065K471199R75418
1049.3D57880211J007805Q43277K525444K477722Q84819K130661K096519L377343K387466
1058D75611267L868370M357147L668251M140168M291649M888572M134217N923728L435288
1066.6E14318657J884651Q24890k210693k823639o187058o291084n757675m824257
1074.4D88933792m298706m253616k542076j945076n1613j318932L01933K91024P09686
$$ y = [426357689, 425857925, 425678215, 425462532, 425155602, 427281914, 427449379, 428221092, 428723679, 429886589, 431494675, 432490044, 433619194, 433754768, 435747948, 436227303, 437636986, 439505997, 441776199, 445410347, 446775970, 448650246, 449637375, 451020012, 451544914, 451574326, 451048508, 450178604, 451693039, 451201172, 451522102, 451580315, 452735710, 454259529, 454433594, 456904793, 457880211, 458888016, 459731293, 462256737, 464734459, 465619278, 467749939, 469846458, 473223801, 475611267, 479479637, 483836784, 487505035, 491645203, 495936852, 500825424, 504959641, 510883369, 514318657, 516203308, 517028198, 514817505, 511993866, 505806808, 499515724, 493758049, 488933792, 484635086, 480381470, 477839394, 475894318, 475842705, 474523773, 474825706, 475116730, 475826416]
1083D75826416J786118l59192J887817J511040K240410K309532K464294K845078K832870
1091.7D93344383N069390L561019L038559J809845K302247K022171J093826J787262
1099.4E14028702k29111J07422n95932M26559J160622M73366O60629M20532J567192
1108.1E18019981J348496L158645K091675J286393K138137J734009K236633R34258
1115.8E32948227J598396P19910J040382J449395O04705J758080J615066K486191J466179
1124.5E45686531J701813J721000L16124K85035J325225L145142J399040J272927J123199
1133.2E57976036R06944J308976Q27560J062088j76849j20697j603127k444763l145943
1141.9E54590225m360580l628693l271408j538811l530693l770790k942962k977868
$$ y = [475826416, 477612534, 477253342, 479141159, 480652199, 482892609, 485202141, 487666435, 490511513, 493344383, 498413773, 501974792, 505013351, 506823196, 509125443, 511147614, 512241440, 514028702, 513799591, 513907013, 513311081, 513737640, 514898262, 515371628, 516032257, 516452789, 518019981, 519368477, 522527122, 524618797, 525905190, 528043327, 529777336, 532013969, 532948227, 534546623, 535266533, 536306915, 537756310, 538361015, 540119095, 541734161, 544220352, 545686531, 547388344, 549109344, 549425468, 549710503, 551035728, 554180870, 555579910, 556852837, 557976036, 558882980, 560191956, 561019516, 562081604, 561904755, 561784058, 560180931, 557736168, 554590225, 550229645, 546600952, 543329544, 541790733, 538260040, 534489250, 531546288, 528568420]
1149.6E28568420j455154k319031j320915j174583Q3274n81054q26569N58357m67987
1158.3E21064758O43349j43127Q08792R24911J709557K569732J688919L842164L412094
1166.9E36521149M075508M183464M632835N270577N347404N717621L793259M386520
1174.6E73928337M501839M395561M330978M933892N337066M627457N465965M578896
1182.4F12099991M994659M912071M416619M214516K808074K966004K458267J823616
1190.1F40693817J147156J228943R57641J03836P63932N03006J392440J380539O41480
1198.8F48812790J029892Q02078J042633Q58612P43332k87475q90503M0512N73730
1207.4F52725601N36728L49350J443405J636200K162171K639083J982728K391510K095642
$$ y = [528568420, 527113266, 524794235, 523473320, 522298737, 522382011, 521800957, 520974388, 521532745, 521064758, 521708107, 521564980, 522373772, 523298683, 525008240, 527577972, 529266891, 533109055, 536521149, 540596657, 544780121, 549412956, 554683533, 560030937, 565748558, 569541817, 573928337, 578430176, 582825737, 587156715, 592090607, 597427673, 602055130, 607521095, 612099991, 617094650, 622006721, 626423340, 630637856, 633445930, 636411934, 638870201, 640693817, 641840973, 643069916, 644027557, 644131393, 644895325, 645398331, 646790771, 648171310, 648812790, 649842682, 650644760, 651687393, 652546005, 653289337, 653001862, 652111359, 652151871, 652725601, 653262329, 653611679, 655055084, 656691284, 658853455, 661492538, 663475266, 665866776, 667962418]
1216.1F67962418J382293P21970O91605O86416k73971m4861L0746j90964j03683L46375
1225.8F71208344L06320o8512M12674J2436M20150L10593j072006j146698r50775l70102
1235.4F69062424j115189j888428q84475n85633n02395k05307j69068N78156J218719
1244.1F65508804Q88214M66309K31628J91422J39008j05515j98288k66800n8060M60968
1253.7F67257690N62668O29120J031342Q97827J105804J241837L18298K71836P15560
1262.4F74031982J90735m84161m48761J10550Q5602J87530P13959J122131J298294
1271.1F76807861J068421J323929J520996J008072P12814N71899Q927p62101n15670
1279.8F81745148m86908q64563q21457n20859J15357k36588k09274N50461Q16040O20498
$$ y = [667962418, 669344711, 670066681, 670758286, 671444702, 671170731, 671125870, 671156616, 670965652, 670861969, 671208344, 671514664, 671446152, 671858826, 671871262, 672291412, 672602005, 671529999, 670383301, 669432526, 669062424, 667947235, 666058807, 665174332, 664588699, 664086304, 663880997, 663711929, 664290085, 665508804, 666397018, 666863327, 667094955, 667286377, 667425385, 667319870, 667121582, 666854782, 666796722, 667257690, 667820358, 668449478, 669480820, 670378647, 671484451, 672726288, 673044586, 673316422, 674031982, 674222717, 673738556, 673289795, 673400345, 673485947, 673673477, 674387436, 675509567, 676807861, 677876282, 679200211, 680721207, 681729279, 682442093, 683013992, 683022919, 682260818, 681745148, 681258240, 680393677, 679572220, 679051361, 679166718, 678930130, 678720856, 679271317, 680087357, 680707855]
1289.4F80707855K02484J45417m93775r40857j061477j346970j433182j397705p78885
1298.1F73602905n69458p32269n40772k67181P1411j7395m05350k30789n10177j291809
1307.7F69109116j141663j269226j492310j285934j429749q09936J3275j05209k74811
1316.4F61313553k10800j8540j45187K23999O90918o44302j164017r13773j366043
1325.1F57765808j262360j779632j845474j710816j751556j316147j273041j144104
1332.8F45682678j084060n38025j240464j838607r13315q74291j304054r65996P51915
1341.5F37675781M86565N3024K3041O5613M84466N59082Q92525J26038j31150J73035
1351.1F40408020j06430l02849q26225o87714l38249n10712j417427q51173J67389
$$ y = [680707855, 680910339, 681055756, 680561981, 679621124, 678559647, 677212677, 675779495, 674381790, 673602905, 673033447, 672301178, 671760406, 671493225, 671564636, 671547241, 671141891, 670911102, 670400925, 669109116, 667967453, 666698227, 665205917, 663919983, 662490234, 661680298, 661693573, 661588364, 661313553, 661102753, 661084213, 660939026, 661163025, 661853943, 661209641, 660045624, 659131851, 657765808, 656503448, 654723816, 652878342, 651167526, 649415970, 648099823, 646826782, 645682678, 644598618, 644060593, 642820129, 640981522, 640068207, 639193916, 637889862, 636923866, 637675781, 638162346, 638215370, 638238411, 638304024, 638788490, 639347572, 640240097, 640366135, 640234985, 640408020, 640301590, 639998741, 639172516, 638484802, 638146553, 637635841, 636218414, 635367241, 635534630]
1359.8F35534630r79233p98569o38580n75333J680947J298713l09791j18599r40590
1368.5F34153595j363831j56135r07059k10419l63121j619033j29967J671524J722107
1377.2F32797661J7319O04515J121635Q50411P50923N71212N41535q1673P38297j37825
1386.8F37774010o87447K554436K588463J662674J448516K036362J175919j758881
1394.5F46794052j666336K304916J522446l71399k147369n47333J187897n55039q38470
1403.2F45683365r10950k398376K58712R33915j7243k07367o2790m73022m70657k61460
1412.8F42074127m07944q66699j166076j121331j005745p84454m481239J169090L022881
1421.5F36432610J046447J70555p01789J680984J790962L79257P32193m41589j324615
$$ y = [635534630, 634555397, 633756828, 633118248, 632542915, 634223862, 635522575, 635212784, 635094185, 634153595, 632789764, 632633629, 631726570, 631516151, 631153030, 629533997, 629404030, 631075554, 632797661, 632814980, 633419495, 634541130, 635391541, 636142464, 636713676, 637255211, 637173538, 637911835, 637774010, 637086563, 639640999, 642229462, 643892136, 645340652, 647377014, 648552933, 646794052, 645127716, 647432632, 648955078, 648583679, 646436310, 645888977, 647076874, 646521835, 645683365, 644772415, 642374039, 642632751, 643566666, 643549423, 643342056, 643279266, 642806244, 642335587, 642074127, 641666183, 640799484, 639633408, 638512077, 637506332, 636721878, 632240639, 633409729, 636432610, 637479057, 637649612, 636947823, 638628807, 640419769, 640799026, 641531219, 641089630, 639765015]
1430.2F39765015N7907P20215m49753M06799J953735R6207l605728J608429M252624
1438.9F44805450J831208P33871J142349K83966R85260j29852l83453m86069j793365
1447.6F46989365k602463O37588J515046j063996n37491O11573J021499l91540k182312
1456.2F43997269n946579l295822M980316J498031K436829L87802k45438O83213l537369
1464.9F40958252K701340K961502K978515K463684L304139L651580J52970Q27713K416153
1473.6F62415848O757660L512573Q13293L793946L943939L251572J360626J538849
1481.3F87388306K688598M086609L004685K549057K313919k71073K100525J596451
1489G05457077j244888p41730L698349L117065N06363J583176o77567l881149L732529
$$ y = [639765015, 639822922, 640543137, 640093384, 640500183, 642453918, 642550125, 638944397, 640552826, 644805450, 646636658, 647370529, 648512878, 648796844, 649782104, 649652252, 649268799, 648782730, 646989365, 644386902, 645024490, 646539536, 645475540, 644938049, 645549622, 646571121, 646179581, 643997269, 638050690, 634754868, 639735184, 641233215, 643670044, 644057846, 643812408, 644495621, 640958252, 643659592, 646621094, 649599609, 652063293, 655367432, 659019012, 659171982, 659999695, 662415848, 669173508, 672686081, 673499374, 677293320, 681237259, 684488831, 685849457, 687388306, 690076904, 694163513, 697168198, 699717255, 702031174, 701760101, 703860626, 705457077, 704212189, 703470459, 707168808, 710285873, 710792236, 712375412, 711697845, 707816696, 711549225]
1497.7G11549225J962585J353989L626480J607666J32294J580505P02515r90601j1342392
1506.4G10182266o986694O159363L917541L560333L176041R07059r7504L235474Q92105
1515.1G24945984j206818k252426j346359O583710K242965n932541n917053P61337
1522.8G17878799N862656J774750k085648R35364K288132k19345K678527M177475N35813
1531.5G33826523M44336l191300m528808L297653J606445J115875K57264p724610j3882141
1540.1G11221237P588654L537750J226501N385132R79157L64380L676376K096481M70734
1548.8G36546402k477264k527543K130814J304245m71649m699478K49023N035248J804352
1557.5G36894150j6906052j5555725J6038437J1999741N086212K777557q0337l997574
$$ y = [711549225, 713511810, 714865799, 718492279, 720099945, 720232239, 721812744, 722515259, 721524658, 710182266, 703195572, 709354935, 713272476, 716832809, 720008850, 720915909, 720818405, 724053879, 724945984, 723739166, 721486740, 720140381, 726724091, 728967056, 723034515, 717117462, 717878799, 723741455, 725516205, 723430557, 724365921, 726654053, 726434708, 729113235, 733290710, 733826523, 734270859, 731079559, 726550751, 729848404, 731454849, 732570724, 732827988, 725103378, 711221237, 718809891, 722347641, 723574142, 728959274, 729938431, 730302811, 733979187, 736075668, 736546402, 734069138, 731541595, 733672409, 734976654, 734505005, 729805527, 730054550, 735089798, 736894150, 719988098, 704432373, 720470810, 732470551, 737556763, 740334320, 740253983, 736256409]
1565.2G36256409M6539J066895q317k269668p076721L172226L335647J171723N93490
1573.9G36288223J300354k011566q895798N021210L701172K98080j005020j474609
1581.6G33222046j151199j764145j249466p61566p82090m11834n01938m44870m62952
1590.3G25691986K7771l58887m21600j650314k274933j264191k167969j471710j813812
1599G14296341j632919j583176j199341p01980j202393Q2169o85959j052780j504059
1607.6G04815903q98056k270203k960815o46897k435531j397553j843414j022034k740326
1616.3F88601074j0387039L729172J909790L23486q17871R8801k776718o336670J874618
1625F76218643L29666l10898m063949k384415M92401j410064j029129r37500J337356
$$ y = [736256409, 736302948, 737369843, 737361526, 735091858, 728015137, 731187363, 734523010, 735694733, 736288223, 737588577, 735577011, 726681213, 731702423, 735403595, 735701675, 734696655, 733222046, 732070847, 730306702, 729057236, 728295670, 727513580, 727101746, 726599808, 726154938, 725691986, 725719757, 725360870, 724939270, 723288956, 721014023, 719749832, 717581863, 716110153, 714296341, 712663422, 711080246, 709880905, 709178925, 707976532, 708058701, 707372742, 706319962, 704815903, 703917847, 701647644, 698686829, 698039932, 695604401, 694206848, 692363434, 691341400, 688601074, 678214035, 681943207, 683852997, 684176483, 683358612, 683457413, 680680695, 674344025, 676218643, 676548309, 676237411, 672173462, 669789047, 670281448, 668871384, 667842255, 666904755, 668242111]
1633.7F68242111J125717p433776k442704K533417K495193J260605J98365q38013K3117
1642.4F65164032j128998O69632K84042m701690j472931q32367M518967M145889L791046
1651F70437622K984009o502762j0437698P732162O567307K834472J302643R47800J191253
1659.7F77056808J295014J432419q89969k22321N072556L147507K403945K962189J213684
1668.4F93471832k692413J943130L102723Q47168L395767L378296j524735j965408
1676.1F99956360M622803L948288K359542J276932L17688M530716L926773l796081
1683.8G17143021p878876P573318P787476L066483k87476J287384R98077K222596K490844
1692.5G34402847K209244L044663R48486o631699M250412O331787O247483l120041
$$ y = [668242111, 669367828, 661934052, 659491348, 662024765, 664519958, 665780563, 665978928, 665140915, 665164032, 664035034, 664704666, 664988708, 660287018, 658814087, 657981720, 662500687, 666646576, 670437622, 673421631, 666918869, 656481171, 664213333, 670780640, 673615112, 674917755, 675865555, 677056808, 678351822, 679784241, 678894272, 678671951, 683744507, 686892014, 689295959, 692258148, 693471832, 690779419, 692722549, 695825272, 696672440, 700068207, 703446503, 701921768, 699956360, 704579163, 708527451, 710886993, 712163925, 712481613, 717012329, 720939102, 717143021, 709264145, 716837463, 724624939, 727691422, 727403946, 728691330, 729689407, 731912003, 734402847, 736612091, 739656754, 740605240, 733973541, 738223953, 744555740, 750803223, 747683182]
1700.2G47683182r286270P947387M648514L01590j761093M12674j126251K401428L635559
1708.9G54856720O76422Q18176K371216K364884J298065k571793j324692K474442k758865
1717.6G58204575p520905P086792M806061K023086J250916m43039K19498K813415K239380
1726.3G70679779J195145J559601O71310l487167l39280L903656J317139p856750p298813
1734.9G60344620P448196N021362J536789K180405k262573r02329N857315J974106
1742.7G81197891k316589Q74252L192291J120148j368484j864701k94113L446884j514053
1751.3G82473526q75626M619522K718659K544632J412277k495727J946411K832870
1759G95176544J600037J332321m419098m90036L057175O70700K31857J023636j87759
$$ y = [747683182, 738396912, 746344299, 750992813, 751294403, 749533310, 749945984, 748819733, 751221161, 754856720, 755533142, 756351318, 758722534, 761087418, 762385483, 759813690, 758488998, 760963440, 758204575, 750683670, 757770462, 762576523, 764599609, 765850525, 765407486, 765626984, 768440399, 770679779, 771874924, 773434525, 774105835, 770618668, 770279388, 774183044, 775500183, 767643433, 760344620, 767792816, 772814178, 774350967, 776531372, 774268799, 773366470, 779223785, 781197891, 778881302, 779755554, 782947845, 784067993, 782699509, 780834808, 780540695, 783987579, 782473526, 781597900, 786217422, 788936081, 791480713, 792892990, 790397263, 792343674, 795176544, 796776581, 798108902, 793689804, 793199768, 796256943, 796927643, 797159500, 798183136, 797995377]
1767.7G97995377l119965L072739L575592j878434l997421J177750N689850J594314
1775.4H04109802j832046J374359K71911K71302j589356k089462J891632K111435J025467
1784.1H05545044j126251O21414K598877J318970P33184R02634j574478k106247l234711
1792.8H03678436q316L264160l04107q62961K217483J886292j063004j154785K555084
1801.5H10208282N10178J135559J549454m77066J24664n85403q00095O87790k63748
1810.2H12089615k413178N81589J573029M76913R98154R24225J099319L281O72531
1818.8H16005478R28955n36881k20336j118393M10614k69013l991699J226654K765350
1827.5H15200729J071473k582322l927688L928909L927994M39911K24228O88629k23313
$$ y = [797995377, 794875412, 797948151, 801523743, 799645309, 795647888, 796825638, 802515488, 804109802, 802277756, 803652115, 803924026, 804195328, 802605972, 800516510, 802408142, 804519577, 805545044, 804418793, 805040207, 807639084, 808958054, 809691238, 810593872, 809019394, 806913147, 803678436, 803670120, 806934280, 806630173, 805767212, 807984695, 809870987, 808807983, 807653198, 810208282, 810718460, 811854019, 813403473, 812926407, 813051071, 812465668, 811665573, 812353363, 812089615, 809676437, 810258026, 811831055, 812307968, 813306122, 814230347, 815329666, 815332947, 816005478, 816934433, 816397552, 816177216, 815058823, 815469437, 815200424, 811208725, 812435379, 815200729, 816272202, 813689880, 809762192, 813691101, 817619095, 818059006, 818283234, 818971863, 818748550]
1836.2H18748550j631469j183472P38678l48892M654J0528Q54492q24585n861053M213944
1845.8H14721375L660583k35138m2496Q51059M92020p27844l43170o98929l48358R994
1855.5H17339096j16272L32565j41296M70276P10754P74155L14941M17786M68826l45764
1865.1H20225067m00009j546555j090240k330933j598587J950531J734619J101990
1872.8H18045883N44815O06995K52228K24456M23661N26809L03040n13916m120k60696
1882.5H20149155j76773p50351r25064M04586K27585Q52051p53708j701660K294311
1891.2H19620132J965027M8600P8506j229477j595077Q27713N37796k86179m58298
1899.8H19508743k2812L67279K07749P57904J28174L65677M48074l54996k06527m00773
$$ y = [818748550, 817117081, 815933609, 816672287, 816323395, 816328049, 816338577, 817193069, 816368484, 810507431, 814721375, 818381958, 818146820, 818104324, 818955383, 819447403, 818719559, 818376389, 817677460, 817329102, 817339096, 817222824, 817555389, 817414093, 817884369, 818595123, 819369278, 819684219, 820102005, 820570831, 820225067, 819825058, 818278503, 817188263, 814857330, 813258743, 815209274, 816943893, 818045883, 818590698, 819197693, 819449921, 819674377, 820098038, 820624847, 820927887, 820413971, 820409851, 820149155, 819972382, 819222031, 818296967, 818701553, 818929138, 819781189, 819027481, 817325821, 819620132, 821585159, 821633759, 821712265, 820482788, 818887711, 819715424, 820253220, 819967041, 819508743, 819485931, 819853210, 820060959, 820818863, 820947037, 821312714, 821760788, 821405792, 821199265, 820798492]
1909.5H20798492o10809J70670N26199p74155k23465R6207M64554P00073l179474k18582
1919.1H17749710K485123J480865K19956k322541j50375J732254M49295m61731l17993
1927.8H20864563o83746m73633K82593j0910J30920m8294N38788O26297K49405N09567
1937.5H21985550l2196k32086k18354L98789k010193k280426K085724K50854j147461
1946.1H18800201J97449P64694M86908J19706P12280O54907J18561r9564q2931m39911
1955.8H21232300l93372j39847m30603k26974k11411j49154K19116M95911M42504M45557
1965.4H21284027J37177o42853K59704R77250L05633n05676n45883l69263m89273l47138
1975.1H20063705j00708L42255N36347L24020q4610m5242M53262L75671K3575l14407
$$ y = [820798492, 820187683, 820358353, 820884552, 820110397, 819886932, 819983139, 820447693, 821147766, 817968292, 817749710, 820234833, 821715698, 821935654, 819613113, 819462738, 821194992, 821644287, 821182556, 820864563, 820180817, 819707184, 819989777, 819978867, 820109787, 820061493, 820600281, 821226578, 821475983, 821985550, 821953354, 821721268, 821502914, 821901703, 819891510, 817611084, 819696808, 819947662, 818800201, 818997650, 819762344, 820249252, 820368958, 821081238, 821736145, 821854706, 821755142, 821672211, 821232300, 820838928, 820699081, 820268478, 820041504, 819830093, 819680939, 819900055, 820395966, 820838470, 821284027, 821421204, 820778351, 821038055, 822015305, 822320938, 821815262, 821269379, 820900116, 820410843, 820063705, 819962997, 820305252, 820841599, 821165619, 821081009, 821035767, 821489029, 821864700, 821888275, 821573868]
1984.7H21573868j06354L7079o69327j025848L8757Q04672n58853j818237N76019K129288
1994.3H20981064Q50448j6021j09330p8735K97394l30200n15976l72772l56598k34986
2004H20114288j12228l0518n38635j6327O47736M81415K84347l1433J25961J14975
2013.6H21039581k51236m94918r86634q89282L9673j32141j04142K57111k19650j00784
2023.3H18157578L34854O40716K58637J52L9673l63006K8610k93427o71539l91541
2032.9H17740707k05001k64130n58777j907L53317L06015J70822J32828m16412m17939
2042.6H16839523N20325J16425j10474n14832m36096k35748p11823J37101R2697n8670
2052.2H15638428J47857J74942M18396P6065N0889K25067L14560k02485k79846j52435
$$ y = [821573868, 821467514, 821504593, 820835266, 819809418, 819848175, 820652847, 820093994, 818275757, 818851776, 820981064, 821831512, 821815491, 821706161, 821627426, 821924820, 821594620, 821078644, 820705872, 820349274, 820114288, 820002060, 819971542, 819432907, 819416580, 820064316, 820545731, 820830078, 820798645, 820924606, 821039581, 820788345, 820293427, 819306793, 818417511, 818457184, 818325043, 818220901, 818478012, 818258362, 818157578, 818492432, 819133148, 819391785, 819391937, 819431610, 819068604, 819097214, 818803787, 818132248, 817740707, 817535706, 817271576, 816712799, 816710892, 817064209, 817370224, 817541046, 817673874, 817257462, 816839523, 817359848, 817476273, 817365799, 816850967, 816414871, 816179123, 815467300, 815604401, 815697098, 815638428, 815786285, 815961227, 816379623, 816455688, 816506577, 816731644, 817046204, 816843719, 816563873, 816411438]
2061.9H16411438l12347L7765m50897p05795k40479L29208O14472L73001K50854L40729
2071.5H16647949L44696j33667J24665J87072k90298l81088n80597m93851j22452L052
2081.1H15305481k91596O3782L07770J86920L97873L02734K76413L01056L24250k03171
2090.8H16971512m25034l30429j81198K4872n19714j93787L3798J87912N09415N49850
2100.4H16627197O24771j06124O0272J55334k00271k41852k35138M5853m14429o63529
2110.1H15652084k85492R5673J14365L98178K31247J73187Q02383K77176L24707l8833
2119.7H17744675l36533K4719k57263l24478r40170l45002J53122%K30256K30026M16717
2130.3H16596069o3171K19421M69132N64270L96499o37359l51792N6611k26975o05392
$$ y = [816411438, 816099091, 816136856, 815685959, 814980164, 814739685, 815068893, 815683365, 816056366, 816307220, 816647949, 816992645, 816858978, 816983643, 817170715, 816880417, 816499329, 815918732, 815424881, 815302429, 815305481, 815013885, 815077667, 815385437, 815572357, 815970230, 816272964, 816549377, 816850433, 817174683, 816971512, 816546478, 816216049, 816034851, 816059723, 815540009, 815346222, 815380020, 815567932, 816077347, 816627197, 817251968, 817145844, 817206116, 817361450, 817161179, 816919327, 816684189, 816730042, 816315613, 815652084, 815366592, 815462265, 815576630, 815974808, 816206055, 816379242, 817181625, 817458801, 817783508, 817744675, 817408142, 817432861, 817175598, 816851120, 815910950, 815565948, 815719070, 815719070, 815949326, 816179352, 816596069, 816532898, 816752319, 817221451, 817785721, 818182220, 817544861, 817193069, 817249680, 817022705, 816417313]
2140H16417313k02332k21176o41785k13318J44349P35626Q49075N20630J06964K42691
2149.6H17738037O0730n82046j19782o1035k82135o46896l21808J80206O1798R5978
2159.3H16123047J10474N13076L18604P32498M72412j95312K69775l01590l37677l31345
2168.9H17373962l70178m82864l86887J42594k10648M85306R71756Q58383N89066K42309
2178.5H19212799R0942j40991L57208N723m89808n43441k97776j45797k89841q8577
2188.2H17670441r2469L38898L42941Q15354R71832L87802N93338P1182o8283j84021
2197.8H20847015n18875n97992m10766l71094o86340J31988L21045L91541Q00094P77054
2207.5H20683670O29120L25928M42276M7073k55508m67148n01862l12576m08707l99322
$$ y = [816417313, 816214981, 815993805, 815352020, 815138702, 815283051, 816018677, 816867752, 817388382, 817495346, 817738037, 817798767, 817216721, 817096939, 817035904, 816753769, 816106873, 815785065, 815965271, 816027069, 816123047, 816233521, 816746597, 817065201, 817797699, 818270111, 818074799, 818344574, 818042984, 817705307, 817373962, 817003784, 816520920, 816134033, 816276627, 816065979, 816551285, 817523041, 818381424, 818970490, 819212799, 819303741, 819162750, 819519958, 819525681, 819035873, 818492432, 818194656, 818048859, 817759018, 817670441, 817577972, 817916870, 818259811, 819075165, 820046997, 820434799, 821028137, 821099319, 821031036, 820847015, 820328140, 819730148, 819319382, 818948288, 818261948, 818393936, 818714981, 819106522, 819906616, 820683670, 821312790, 821638718, 822080994, 822128067, 821872559, 821405411, 820903549, 820590973, 820182266, 819782944]
2217.1H19782944k27356K80151L31650O69022N32684L83453P99027L78647m58m99115
2226.8H22430649Q697K30027m62265o45218p31430l31040P4463N56564K47345K92206
2236.4H21669998P61948N10559K74887j27487K32925M0436n9433o9733o63757o15082
2246H21955261p13501l76053l9215K96021M24194P38068M44946k31781O63834L78341
2255.7H23540115K9145j97373l63006O0958n02395m84085n78995l87115J08718M74091
2265.3H21700058N85785M17862N83343K07215N20248N81970l9749p53555p02515q1558
2275H23019104m14047k82593l98941j71814J94397M19769K94342L1205P41577K88772
2284.6H23721771K57645J27487j07956j00021n45807J20697k47421k69471m18777j31226
$$ y = [819782944, 819555588, 819835739, 820167389, 820836411, 821369095, 821752548, 822551575, 822930222, 822929764, 822430649, 822439346, 822669373, 822207108, 821561890, 820830460, 820499420, 820573883, 821130447, 821377792, 821669998, 822431946, 822942505, 823217392, 823089905, 823322830, 823363266, 823303833, 823234100, 822570343, 821955261, 821241760, 820865707, 820826492, 821122513, 821546707, 822284775, 822729721, 822497940, 823161774, 823540115, 823569260, 823371887, 823008881, 823069839, 822567444, 822083359, 821504364, 821117249, 821225967, 821700058, 822285843, 822703705, 823287048, 823494263, 824014511, 824596481, 824556732, 823803177, 823100662, 823019104, 822605057, 822322464, 821923523, 821751709, 821946106, 822365875, 822660217, 822691422, 823432999, 823721771, 823979416, 824106903, 823998947, 823898926, 823353119, 823473816, 823226395, 822956924, 822538147, 822406921]
2294.3H22406921L07084l79181O91833Q57697Q38394M93927l3341J07727m12902j14670
2303.9H24763489p03583l55988j16195m47083l81M4555O93894k51618k77252M65851
2313.5H23815689M58527O81991O70319Q17413l12118l54538J04675J63040n78308j656723
2323.2H23809967L87650J367569N41458p08313k22016J150666O62307N9510o10886
2331.9H26437912j24512M43116L00598q54416j309586k20108j45569R5902m0055L49198
2341.5H24932480L79944K81372P36847L16391r91288k418365k25296K180328J452561
2350.2H26644974m85916p02668k56042r3994J043091J790542n7220k573014j563415
2358.9H23746338L25546K236786K005539M52347K8381k556686q15354J61820j674271
$$ y = [822406921, 822714005, 822334824, 823026657, 823884354, 824722748, 825216675, 825183334, 825291061, 824878159, 824763489, 824059906, 823703918, 823587723, 823140640, 823140259, 823184814, 823878708, 823627090, 823349838, 823815689, 824274216, 824956207, 825626526, 826443939, 826131821, 825777283, 825881958, 826044998, 825466690, 823809967, 824197617, 825565186, 826106644, 825398331, 825176315, 826326981, 826989288, 827048798, 826437912, 826313400, 826756516, 827057114, 826202698, 824893112, 824673004, 824527435, 824623337, 824583282, 824932480, 825312424, 825593796, 826330643, 826647034, 825655746, 823237381, 823012085, 825192413, 826644974, 826159058, 825456390, 825200348, 825106354, 826149445, 827939987, 827882767, 825309753, 823746338, 824071884, 826308670, 828314209, 828766556, 828794937, 826238251, 825422897, 825584717, 823910446]
2367.6H23910446n22308o71082r78775l30887M80500K50244o46134j13830N30929L3951
2377.2H21943054p95364p09076n23453m63943o15540p73849l92838l77808m15649j26953
2386.8H16748581K78702P25403O26678L7842k10266k9755K40860j5259n84335m15192
2396.5H17403259l03268k96326o51321m94919N74570K86407J37177Q7127q5830M71115
2406.1H17127991J12686m06799k15836k6169n32913o02875p7438k15225o22940o01044
2415.8H13939438j53504J02387M27856J62049L280M6158k34451J60065L9901K2736
2425.4H14515915n52445j023483j91498k44598l58582k69546K1286J32523k6246O4393
2435.1H12067719k8306m8522k11487j8540j91726k85492l87726p65610j14365l5400
$$ y = [823910446, 823388138, 822717056, 821738281, 821407394, 821887894, 822138138, 821492004, 821378174, 821909103, 821943054, 821147690, 820438614, 819915161, 819451218, 818835678, 818061829, 817668991, 817291183, 816875534, 816748581, 817027283, 817752686, 818379364, 818417206, 818206940, 818177185, 818418045, 818402786, 817818451, 817403259, 817099991, 816803665, 816152344, 815657425, 816231995, 816518402, 816655579, 816742706, 816656876, 817127991, 817240677, 816833878, 816618042, 816591873, 816058960, 815456085, 815378647, 815163422, 814540482, 813939438, 813785934, 813888321, 814316177, 814478226, 814481506, 814527664, 814293213, 814453278, 814493179, 814515915, 813963470, 812939987, 812748489, 812503891, 812145309, 811875763, 811897049, 812029572, 812003326, 812067719, 812039413, 811990891, 811779404, 811760864, 811569138, 811283646, 810895920, 810130310, 810015945, 809980545]
2444.7H09980545m26178l96576l9444R16J068J96838p4463M6387O9122J98365k85340
2455.3H09271240q14819l16391k95792m52652n93490k37732k7161K10343L02886j86538
2465H06859894P9422J80206L41873P9041l75900n36576n28335l41950q35876l53775
2474.6H04568024j41220j24970J64948k80075J33361J65482M8599M09699Q3313m31595
2484.2H04595566l51868m06341o22788m41742l68042J27487j87301l99628J59073J66626
2493.9H02271042M22668K03553K2964q4076r3918j60675n05295k77252m53720k78091
2503.5H01067200j42365m07333m92020k36664J27335j28098L50800P64236L24555l44849
2513.2H00882797l43017j55182n26810j81580k89764l63617J4877j86386n67016l35465
$$ y = [809980545, 809554367, 809157791, 809118347, 809119263, 809120331, 809317169, 809242706, 809289093, 809358215, 809556580, 809271240, 808456421, 808140030, 807844238, 807391586, 806798096, 806560364, 806533203, 806743546, 807046432, 806859894, 806939316, 807119522, 807461395, 807540436, 807164536, 806627960, 806099625, 805757675, 804921799, 804568024, 804426804, 804301834, 804466782, 804186707, 804320068, 804485550, 804534149, 804943848, 805027161, 804595566, 804243698, 803837357, 803214569, 802772827, 802404785, 802532272, 802344971, 801945343, 802104416, 802271042, 802693710, 802897263, 802920227, 802836151, 802742233, 802581558, 802076263, 801799011, 801345291, 801067200, 800924835, 800517502, 800025482, 799788818, 799916153, 799788055, 800138855, 800903091, 801227646, 800882797, 800539780, 800384598, 799857788, 799676208, 799386444, 799022827, 799037704, 798851318, 798284302, 797948837]
2522.8G97948837N03998L43399k3727J21078L40424l3570n01861l53851m90418m82407
2532.5G97371902n54962j17492M6692m45786Q7509L94821k4032j38550K78778Q3160
2542.1G96982040l10669n79605q87985o03714l56979j38855m96521n10483K8152K37427
2551.7G93362808K26822L01285O58264j67313l49884j06964n46035n52598n97763k38189
2561.4G91990433k05536k96555o51703k24990M13589l75137j85776M8370L83301J67236
2571G91063232m42810P9270l85666p17163l12348q6517l45154k68326J36338P4005
2580.7G88794861J00403j94855j96076l24859k16293J01089j84250m87594o34537k26822
2590.3G86531067k49481q164r7046m16946R9106O5536J27106k12402n7297K14462m35333
$$ y = [797948837, 798452835, 798796234, 798772507, 798893585, 799234009, 799200439, 798698578, 798344727, 797854309, 797371902, 796816940, 796699448, 796746140, 796300354, 796387863, 796782684, 796758652, 796620102, 796898880, 796982040, 796671371, 796091766, 795203781, 794600067, 794243088, 794104233, 793607712, 793097229, 793125381, 793362808, 793589630, 793890915, 794549179, 794381866, 794031982, 793925018, 793378983, 792826385, 792228622, 791990433, 791784897, 791488342, 790836639, 790611649, 791025238, 790650101, 790464325, 790512695, 790895996, 791063232, 790620422, 790699692, 790314026, 789596863, 789284515, 789197998, 788852844, 788584518, 788720856, 788794861, 788895264, 788700409, 788504333, 788179474, 787963181, 788064270, 787880020, 787392426, 786757889, 786531067, 786281586, 786273422, 786176376, 785759430, 785858536, 785924072, 786051178, 785838776, 785781479, 785995941, 785560608]
2600.9G85560608l63541j47629j08337k86484l62701k88925l7232j3733R919K28881
2610.6G84190826n62286o51703j4343K58789j24588l20892r6436n48859l62091l41797
2620.2G81426620l29971l25241m66461o2409k65960k02942l12958l20434k94419m72793
2629.9G78373032k63367n61295q1329O1417n39399k58102m0588m70200p06329m99192
2639.5G75014648m46243O5384K78626q5297l62473o99691o38123m36325k68555j22146
2649.1G72299805k28424p87125n70068J8158l00522m81568l63769P7133L4027j93634
2658.8G69504013m6539l18146m68826l98484k17361l47290n16815l44544k05002m41207
2668.4G66199799k72065q010r59168o64215J31302J1444J37329J10703j9074n10025
$$ y = [785560608, 785197067, 785049438, 784941101, 784654617, 784291916, 784002991, 783965759, 783952026, 783961945, 784190826, 783628540, 782976837, 782962494, 783221283, 783096695, 782775803, 782679367, 782130508, 781768417, 781426620, 781096649, 780771408, 780304947, 780242538, 779976578, 779773636, 779460678, 779140244, 778845825, 778373032, 778109665, 777548370, 777467041, 777528458, 776989059, 776730957, 776690369, 776220169, 775513840, 775014648, 774568405, 774633789, 774912415, 774827118, 774464645, 773764954, 773126831, 772690506, 772421951, 772299805, 772071381, 771284256, 770714188, 770732346, 770431824, 769950256, 769586487, 769663620, 769697647, 769504013, 769457474, 769139328, 768670502, 768272018, 768054657, 767707367, 767190552, 766846008, 766641006, 766199799, 765927734, 765919724, 764960556, 764296341, 764427643, 764439087, 764576416, 764687119, 764668045, 764158020]
2678.1G64158020m20074m45023p76520l78570k8000m3030o35986l09449R2392l18908
2687.7G60894852l18070j67312J41525J80817J2512k29874m48914n03158m37012m91638
2697.4G58633728m44641m28619n76401K36511r2239n34821P1487l48587l76434l20740
2707G55819244j90658o7215m00086m93850m16031k00577n34973l84293p6523j86538
2716.6G52868500l60565l51258R8572j17950j94855k93121m12598r2087j75476p23953
2726.3G50245209r66797l23486k55509j90124L7765j4114J61743j36719j50528j83716
2735.9G48223724k38800j03607m86221o35987l92684l41797j27106j44806o66275k10266
2745.6G44876175j81503k64588M48761M5090l49503l21579j45034j02234l19443m93851
$$ y = [764158020, 763737946, 763292923, 762516403, 762137833, 762109833, 762066803, 761430817, 761121368, 761213760, 760894852, 760576782, 760409470, 760550995, 760731812, 760744324, 760514450, 760065536, 759562378, 759125366, 758633728, 758189087, 757760468, 757184067, 757420578, 757328339, 756793518, 756865005, 756516418, 756139984, 755819244, 755628586, 755561371, 755161285, 754667435, 754251404, 754050827, 753515854, 753131561, 753055038, 752868500, 752507935, 752156677, 752255249, 752137299, 751942444, 751649323, 751236725, 751144638, 750969162, 750245209, 749278412, 748954926, 748699417, 748509293, 748547058, 748532944, 748694687, 748557968, 748407440, 748223724, 747984924, 747881317, 747395096, 746759109, 746366425, 746024628, 745897522, 745752716, 745086441, 744876175, 744694672, 744430084, 744878845, 744923935, 744574432, 744252853, 744107819, 744005585, 743686142, 743192291]
2755.2G43192291n18265l35464l22952K63138q8730m31595J3885k10189O1111J38550
2764.9G41761780J11694n5923k66724l68729l99322k73438p71942m19540m30756m73709
2774.5G38413391N0202J0376K20947j38855l10974k50779P2022J09177l13721l43704
2784.2G37518082q31070l30735l74832o53305M9820o09817j099091m00162J17340j70593
2793.8G33215637j30768o408k97776m02145o99615q40378r32465o67877o27823o85425
2803.4G27924957n02472p77740m58603k23999k78549k58255m13132m37851l75442k52152
2813.1G23946762n58777q28247q27942q90960q25119p01752j028366j245270o34613
2821.8G16405716q469M1581n52979p73392q47015q27408o27060j267471j291886r60388
$$ y = [743192291, 742674026, 742338562, 742015610, 742278748, 742190018, 741758423, 741772308, 741562119, 741623230, 741761780, 741873474, 741817551, 741550827, 741182098, 740782776, 740509338, 739737396, 739317856, 738887100, 738413391, 738463593, 738473969, 738694916, 738556061, 738245087, 737994308, 738066330, 738175507, 737861786, 737518082, 736687012, 736356277, 735981445, 735328140, 735377960, 734768143, 733669052, 733268890, 733386230, 733215637, 733084869, 733078461, 732780685, 732378540, 731678925, 730838547, 729906082, 729238205, 728610382, 727924957, 727422485, 726644745, 726186142, 725962143, 725683594, 725425339, 725012207, 724574356, 724198914, 723946762, 723387985, 722559738, 721731796, 720840836, 720015717, 719313965, 718285599, 717040329, 716405716, 716397247, 716438828, 715885849, 715112457, 714265442, 713438034, 712810974, 711543503, 710251617, 709291229]
2831.4G09291229j000061j098099q83636m88739q31986p02896p90329j096878q56399
2840.1G01542206j034012j409149j614151j532212j729736j802902k005692k355270
2847.8F88059082k369614k139511j132126r38110j050186q05359m65927J21078k78701
2856.5F79000626n33982o36596o81992m28085n98450q40073j026916p65152r01642
2865.2F72587738j353912j167908j106949j301956j266632j138230j163253j474381
2872.9F62614517j977234j935730j791916j590499j387711j777802j680450j305847
2880.6F49167328j140900r91745p14798m80346m83780n64804j019364o73675m03290
2889.3F42694626q21839o87789o51703l81775l54576m60854k63061n64537l54157J46446
$$ y = [709291229, 708291168, 707193069, 706309433, 705820694, 704988708, 704285812, 703495483, 702398605, 701542206, 700508194, 699099045, 697484894, 695952682, 694222946, 692420044, 690414352, 688059082, 685689468, 683549957, 682417831, 681479721, 680429535, 679624176, 679158249, 679279327, 679000626, 678466644, 677830048, 677148056, 676719971, 676121521, 675281448, 674254532, 673489380, 672587738, 671233826, 670065918, 668958969, 667657013, 666390381, 665252151, 664088898, 662614517, 660637283, 658701553, 656909637, 655319138, 653931427, 652153625, 650473175, 649167328, 648026428, 647034683, 646319885, 645839539, 645355759, 644790955, 643771591, 643097916, 642694626, 641872787, 641184998, 640533295, 640151520, 639796944, 639336090, 639073029, 638508492, 638154335, 638300781]
2898.9F38300781p0534k23121n1613m37546p27081p50465j286431j295700r37614j076699
2908.6F31443977j018600p27539j246643j951256j675758j175766j141396j827316
2916.3F20679703k257653j474723j255951j686135j607627j718064j536751j152153
2924F07990646r82818l12348R079M2878q7662j25237P09954R18617L39241J39046P24334
2934.6F09365730R68895R30901J313553R29908J316414K354241K004928J493187K058258
2943.3F22736015K613831K407150K488899K195130J530266J561317J645279J441040
2951F38618927J491165J587982J331406J345596J321411J369248J666183K110749K050094
2959.7F52892761J830673K551194K184448J745834J553574Q39081J217193J599732
$$ y = [638300781, 638230247, 638007126, 637955513, 637517967, 636790886, 636040421, 634753990, 633458290, 632520676, 631443977, 630425377, 629697838, 628451195, 626499939, 624824181, 623648415, 622507019, 620679703, 618422050, 616947327, 615691376, 614005241, 612397614, 610679550, 609142799, 607990646, 607007828, 606695480, 606704559, 606747437, 606659775, 606534538, 607244492, 608163109, 608502350, 608641396, 609365730, 610334625, 611265526, 612579079, 613508987, 614825401, 617179642, 619184570, 620677757, 622736015, 625349846, 627756996, 630245895, 632441025, 633971291, 635532608, 637177887, 638618927, 640110092, 641698074, 643029480, 644375076, 645696487, 647065735, 648731918, 650842667, 652892761, 654723434, 657274628, 659459076, 661204910, 662758484, 663597565, 664814758, 666414490]
2967.4F66414490J308593R16749J214904J168747R72901J431350J785584K045669J335297
2976.1F78594284J447144J888198J506196J088409L92609P00454P12815O48422P06482
2984.7F87685013M45480R38873Q73261O92062J013031J493454J271668M38843L66973
2993.4F95218658L14026r4986j17569L62702K81372l04718n26505L739N59005J30082
3003.1F95825806j68152K5787K63062J81961O6070K23236n3405l94059n67855j018753
3012.7F94383698o92215O1492p90557r58405j53656k11029O4774k45667l61023j1215
3022.4F91086197m01688n13229m12903p90024j259536q09479o65512p69120r68856
3031F84495850j172333k79846m59214m56619K1439m22364m63562q10012q39310n18570
$$ y = [666414490, 667723083, 668639832, 669854736, 671023483, 671996384, 673427734, 675213318, 677258987, 678594284, 680041428, 681929626, 683435822, 684524231, 684916840, 685617294, 686330109, 686978531, 687685013, 688130493, 689069366, 689942627, 690634689, 691647720, 693141174, 694412842, 694851685, 695218658, 695532684, 695437698, 695320129, 695682831, 695964203, 695659485, 695132980, 695136719, 695695724, 695825806, 695657654, 695683441, 695946503, 696128464, 696194534, 696417770, 696364365, 695970306, 695402451, 694383698, 693691483, 693752975, 692962418, 692004013, 691850357, 691639328, 691704102, 691458435, 691097412, 691086197, 690684509, 690171280, 689758377, 688968353, 687708817, 686899338, 686233826, 685464706, 684495850, 683323517, 683043671, 682584457, 682127838, 682149277, 681726913, 681263351, 680453339, 679614029, 679095459]
3040.7F79095459j056290j321487j148071j344681j012497m3183k50549j321029j281281
3049.4F70316391p10602o56814l50190l83148o99234r97238j393661j514740j467972
3058F62142792n36728m64325j132355q60138m11072k78396r15375m76761m02756j233673
3067.7F55431213n46493r8877q72803j766357j370011j212463j199799p61795j256714
3076.4F46345901r45434j96152l89252j070404o47506k84348q42438p80487r25827
3085F40264053q47931j100006j211548j018829q68835n11818j340981j359634q34885
3093.7F31169586m62608o46553r78317k17095k83852k72178j266937k136307j342278
3102.4F23563461r26399p61452j002540n93109m80385m68865o61125j226806o70777
$$ y = [679095459, 678039169, 676717682, 675569611, 674224930, 673212433, 673169250, 672918701, 671597672, 670316391, 669605789, 668948975, 668598785, 668215637, 667516403, 666519165, 665125504, 663610764, 662142792, 661606064, 661141739, 660009384, 659149246, 658738174, 658459778, 657544403, 657067642, 656664886, 655431213, 654884720, 654785843, 653913040, 652146683, 650776672, 649564209, 648364410, 647602615, 646345901, 645400467, 645204315, 644815063, 643744659, 643097153, 642812805, 641970367, 641189880, 640264053, 639416122, 638316116, 637104568, 636085739, 635216904, 634705086, 633364105, 632004471, 631169586, 630706978, 630060425, 629082108, 628865013, 628581161, 628308983, 627042046, 624905739, 623563461, 622637062, 621875610, 620873070, 620279961, 619799576, 619330711, 618669586, 617442780, 616772003]
3111.1F16772003p14378p58286q29773q06846j075173j501388o84319j001968j267510
3119.8F08132362p67822o44340o76079p84683r11675j076164o57005n88074o87828
3128.4F01338692j029549j210823o05316n07393j191711j694260p96127n57366r35783
3137.1E92810364q16498o62155m44451q91380j070785j186066n91278m50707j234893
3145.8E85462151r03511j145401o86532m85878j314544p84645m96102n97038p26662
3154.5E78321838r89952q89549m77409l89481r82094j426429j053544o68373j045112
3163.1E70399895p65381l87802q00171j123429r42573p21092r80034p45049m51584
3171.8E63482780m30831p28112q43658l57094o33774j021919j280670j234513r23309
$$ y = [616772003, 616057625, 615299339, 614469566, 613662720, 612587547, 611086159, 610401840, 609399872, 608132362, 607364540, 606720200, 606044121, 605259438, 604347763, 603271599, 602614594, 602026520, 601338692, 600309143, 599098320, 598493004, 597985611, 596793900, 595099640, 594303513, 593746147, 592810364, 591993866, 591331711, 590887260, 589995880, 588925095, 587739029, 587147751, 586697044, 585462151, 584558640, 583413239, 582726707, 582240829, 580926285, 580141640, 579645538, 579048500, 578321838, 577331886, 576442337, 575964928, 575575447, 574593353, 573166924, 572113380, 571445007, 570399895, 569634514, 569246712, 568446541, 567323112, 566380539, 565659447, 564679413, 563934364, 563482780, 563051949, 562323837, 561480179, 561123085, 560489311, 559467392, 558186722, 556952209, 556028900]
3180.5E56028900o76842k96173o81305r98916o18172q11310j061477m05388o70357
3189.2E49808960o80084l2730p65610o17104p36465j237564q85430j266975r52644
3197.9E42634354l44963m90876m95910j54839o21605j175422l63694r7732r49593j489220
3207.5E36450500r61647q05854n74875k4338p18994q12607m71268n72776p12090n81779
3217.2E30214272j84517m35562o90842n35507m86718r28192p94983n37567r03778r40857
3226.8E23775749j124382n84602p744l83072m27437l05900k98615l36227p68471r50584
3236.4E18588715m34266n33905q17527q70629n25894m31328q67958J9951l40118q82111
3246.1E12904930O8321l62014o31142m14810m69284p04460p81518p40928o08902o1455
$$ y = [556028900, 555352058, 555055885, 554374580, 553375664, 552757492, 551946182, 550884705, 550479317, 549808960, 549128876, 549096146, 548330536, 547713432, 546976967, 545739403, 544853973, 543586998, 542634354, 542289391, 541798515, 541302605, 541147766, 540526161, 539350739, 538987045, 538889313, 537939720, 536450500, 535488853, 534682999, 534108124, 534083786, 533364792, 532552185, 532080917, 531508141, 530796051, 530214272, 530029755, 529594193, 528903351, 528367844, 527881126, 526952934, 526157951, 525620384, 524716606, 523775749, 522651367, 522066765, 522059021, 521675949, 521248512, 520942612, 520643997, 520307770, 519539299, 518588715, 518154449, 517620544, 516803017, 515932388, 515406494, 514975166, 514107208, 514127159, 513787041, 512904930, 512973251, 512611237, 511980095, 511565285, 511096001, 510391541, 509610023, 508869095, 508260193, 508198738]
3255.7E08198738n60799r72976o34880l27034l11814n88684k57568L6659j53770k78168
3265.4E04149704n55496j087418o67000n95932p52067r0981n72014o30760r7961L13110
3275D99413185K2202r83925n36995m48876k37541Q469o87904o68259m45671k52495
3284.7D95182190l29056m70428o63758p15599j59340m615l92418l29705K7352n06630
3294.3D91637993m12712J87530l20816o98662k89077l67356n37262j3084o33278o57806
3303.9D87895470K12173R3079L58162j49498j025315p09037j13106k41356n78537p81441
3313.6D84960594j014404j99280J24550m78287r09958l07884M12140l82347n43518
3322.3D81661606m03748l1433L96462j85929n85518q63723p05338o62346m75197n19676
$$ y = [508198738, 507637939, 506664963, 506030083, 505703049, 505391235, 504802551, 504544983, 504581642, 504427872, 504149704, 503594208, 502506790, 501839790, 501243858, 500491791, 500400810, 499828796, 499198036, 499100075, 499413185, 499435387, 498451462, 497914467, 497465591, 497228050, 497236519, 496548615, 495880356, 495434685, 495182190, 494853134, 494382706, 493718948, 493003349, 492844009, 492839394, 492446976, 492117271, 492144623, 491637993, 491225281, 491412811, 491091995, 490393333, 490104256, 489736900, 489199638, 489186554, 488553276, 487895470, 488107643, 488200722, 488558884, 488409386, 487384071, 486675034, 486561928, 486320572, 485742035, 484960594, 483946190, 483746910, 483871460, 483393173, 482483215, 482175331, 482587471, 482205124, 481661606, 481257858, 481226425, 481622887, 481436958, 480851440, 479987717, 479282379, 478620033, 478144836, 477625160]
3331.9D77625160o24542j640j40457J78184k37274j125374l57285l99742q80661n60035
3341.6D73476334l777J4305n52635p76596m26407m00810r99565l12081O42510j76354
3351.2D70484924q23326m98085k24724j48124j83258l22686o56128n31082m65316q79021
3360.8D65753174q68187q69408k365N67703o86645j088524k77901J95809l39127m99115
3370.5D61885414l07693n95703l76473n78384q08144q30460o72340l21999j65672N5504
3380.1D57284050o84814l19252M67147j83067k43645r7465l43476r42153r61876m03672
3389.8D53571777l929K33536j36681j49078l03726j87798L78380k93159q08907j81885
3399.4D52118530M08402R2811l090L07084p83158j157074j61094L3302J37329j20506
$$ y = [477625160, 477000618, 476998978, 476858521, 477036705, 476799431, 475674057, 475316772, 474917030, 474036369, 473476334, 473472557, 473486862, 472934227, 472157631, 471731224, 471330414, 470330849, 470018768, 470661278, 470484924, 469661598, 469163513, 468938789, 468790665, 468607407, 468284721, 467628593, 467097511, 466632195, 465753174, 464884987, 464015579, 464013214, 464580917, 463894272, 462805748, 462527847, 462723656, 462384529, 461885414, 461577721, 460982018, 460605545, 460027161, 459219017, 458388557, 457716217, 457394218, 457228546, 457284050, 456599236, 456279984, 456747131, 456564064, 456320419, 456222954, 455879478, 454937325, 453975449, 453571777, 453567848, 453801384, 453664703, 453515625, 453211899, 453024101, 453402481, 453109322, 452300415, 452118530, 452526932, 452619743, 452616653, 452923737, 452140579, 450983505, 450822411, 450855713, 450993042, 450872536]
3409.1D50872536l91541N3940L3569R8152O4431p3815L05100J87263k90756P5188L33328
3419.7D51267395o62346o78863k67373m25834K20451P81250P14607R8648j03988K15034
3429.3D51158981k3269j35918L46031K6550p51380r9831N38597L81279P858K16675
3439D51665573L56522k8305N86166J33514J94436R27085O18058N19027q11958k4567
3448.6D54135551O92635k5063Q59032M73480l85093R2354L28178L28026Q14514M74052
3458.2D57787666J3504O17066O05240M01001K31971P20215O38657j89972o8855K34069
3467.9D60990562P59736J07269K45399J297303N89332L42484L45611L09792L20740
3476.6D65308228K11677P73773N54161j11999Q61664J030616P2213M90417M58L14064
$$ y = [450872536, 450480995, 450534935, 450568504, 450666656, 450731087, 450657272, 450962372, 451149635, 450858879, 450934067, 451267395, 450605049, 449926186, 449658813, 449232979, 449453430, 450234680, 450949287, 451047935, 450943947, 451158981, 451135712, 450999794, 451345825, 451372375, 450620995, 450521164, 451059761, 451441040, 451448898, 451665573, 452022095, 451993790, 452579956, 452713470, 452907906, 453834991, 454453049, 454972076, 454160118, 454135551, 454828186, 454803123, 455662155, 456135635, 455750542, 455842896, 456171074, 456499100, 457313614, 457787666, 457801170, 458418236, 459023476, 459424477, 459656448, 460376663, 461015320, 460825348, 460756493, 460990562, 461750298, 461857567, 462102966, 463400269, 463989601, 464332085, 464677696, 464987488, 465308228, 465519905, 466293678, 466847839, 466735840, 467597504, 468628120, 468700333, 469190750, 469191208, 469505272]
3486.2D69505272R06639p1068N78957J057930N64003Q15735J367378L86886k55393
3494.9D74856339M07638j26190L80440Q86192O16074R33036O04668J13792L85476J007843
3504.5D80065308J280098Q18138Q6975J075859L51257j079025R97391J054039Q17718
3513.2D85467758Q60558P52868J099472L62893O47087J124649R97963O01082P88269
3521.9D92702599K46467j085472N58167J436080P62902k89269r6817Q54111J363411
3530.6D96452179J608314R58939P90596Q36372J330872J27258k73437J341781P23877
3539.2E03896751Q08449J028748J288299R11522M47502l25660l13111K172661K97318
3547.9E10212479J070175J531715J395607J808968j720352J392440J884804R77287
$$ y = [469505272, 470411911, 470340843, 470919800, 471977730, 472541733, 473357468, 474724846, 475111732, 474856339, 475263977, 475137787, 475518227, 476404419, 477020493, 477953529, 478558197, 478671989, 479057465, 480065308, 481345406, 482163544, 482250519, 483326378, 483677635, 482598610, 483596001, 484650040, 485467758, 486328316, 487081184, 488180656, 488543549, 489190636, 490315285, 491313248, 491914330, 492702599, 492949066, 491863594, 492421761, 493857841, 494620743, 494331474, 494234657, 495088768, 496452179, 498060493, 499019432, 499810028, 500646400, 501977272, 502104530, 501831093, 503172874, 503896751, 504705200, 505733948, 507022247, 507933769, 508381271, 508055611, 507742500, 509915161, 510212479, 511282654, 512814369, 514209976, 516018944, 514298592, 515691032, 517575836, 518553123]
3555.6E18553123J526452j02692J681251J139718j87073J04980K168808J535912R11522
3564.3E27332001N039100j030540l366318r003P30858M793587J843796J202774J743050
3573E38279305P25631n5198J164894K586250L62625K250404R92928R2354K966308K049256
3582.6E51414757K72598K93274M967384J628266l933564N53017l76701L726120L350487
3591.3E61895638L139419L58963n32150L262253j386643L932686M070702j8425K782402
3600E77504845o30684K97432K399292K185135J914024K768021J870346k450562N238762
3608.7E91096611r00345j317329R631614k65312m576874M167862o65664M858017M276275
3617.4F06304855j869087J111870k520752P95898M907914L178749K194481K874107
$$ y = [518553123, 520079575, 519976883, 521658134, 522797852, 522610779, 522715759, 524884567, 526420479, 527332001, 532371101, 531340561, 527974243, 527965240, 528696098, 533489685, 535333481, 536536255, 538279305, 539004936, 538949738, 540114632, 542700882, 543063507, 545313911, 546306839, 546399193, 549365501, 551414757, 551687355, 551980629, 556948013, 558576279, 554642715, 555195732, 554819031, 558545151, 561895638, 565035057, 565394020, 564861870, 568124123, 566737480, 570670166, 574740868, 574722443, 577504845, 576874161, 577171593, 579570885, 581756020, 583670044, 586438065, 588308411, 585857849, 591096611, 590196266, 588878937, 598510551, 598245239, 593668365, 597836227, 597170563, 602028580, 606304855, 604435768, 605547638, 603026886, 603822784, 608730698, 611909447, 614103928, 616978035]
3625.1F16978035K178001K015458P715797l361054j7029953P348061O890678O217118
3632.8F28952141N04989l348846K904663L839226J619339r01375J738548L060990K400436
3641.5F40770111J030579K98538K588272L761139N523605m048767o674576L965378
3649.2F47214279k464294k449875J202316P241287N733567M504470L729554j0600052
3656.9F54111252K666855O542740Q15887M19693M12445K228317P26853K82821J322709
3665.6F69529572R74884M385910K101516k311859o79626p689591L507996J0584640
3673.3F80403442J0476609k256852k5376205M971619J0091858M435730l345566N96695
3681F79997330M246673K458115J270142K86026P40356M306107N854721j1452561l938751
$$ y = [616978035, 619156036, 621171494, 628887291, 625526237, 608496284, 615844345, 622735023, 628952141, 629457130, 626108284, 629012947, 632852173, 634471512, 633570137, 635308685, 638369675, 640770111, 641800690, 642099228, 644687500, 648448639, 653972244, 649923477, 643248901, 647214279, 644749985, 642300110, 643502426, 650743713, 656477280, 660981750, 664711304, 654111252, 656778107, 663320847, 664136734, 664556427, 664968872, 667197189, 667924042, 668206863, 669529572, 670504456, 674890366, 676991882, 674680023, 674000397, 666310806, 669818802, 680403442, 690880051, 688623199, 663246994, 668218613, 678310471, 682746201, 679400635, 679997330, 684244003, 686702118, 687972260, 688258286, 688998642, 693304749, 699159470, 687706909, 683768158]
3689.7F83768158R295349o753693R63517O321106P55539K178192j30997j37863J442871
3698.4F97702179M87747L652115K619247p293090j539002O805344J595611p93533L45306
3707G03581924K465516L710784r975051L756103N302658j5102310N279617N646210
3714.8G04665451J291885J188050K827911J165009m424363J513520O012649m864120
3722.5G09375992m599457O292648J079331j721268l265762J151809M807053J194382
3730.2G14314728N940399m314041q166504J0198059j654739j3128052J335831M052505
3737.9G08578186R24301L756256M394684l294372M653091J2430954j8017120j7629624
3745.6F95796356J4400253Q282471O341019o153336j1925964J3472824o963501p701721
$$ y = [683768158, 693063507, 686309814, 687273331, 693594437, 694349976, 696528168, 696397171, 696259308, 697702179, 698189926, 701842041, 704461288, 697168198, 695629196, 702434540, 704030151, 703236618, 703581924, 706047440, 709758224, 699783173, 703539276, 708841934, 693739624, 699019241, 704665451, 705957336, 707145386, 709973297, 711138306, 706713943, 708227463, 714240112, 709375992, 704776535, 711069183, 712148514, 710427246, 707161484, 708313293, 713120346, 714314728, 720255127, 715941086, 707774582, 717972641, 716317902, 703189850, 704525681, 708578186, 709502487, 713258743, 717653427, 714359055, 719012146, 731443100, 713425980, 695796356, 710196609, 718479080, 724820099, 718666763, 706740799, 720213623, 713250122, 705548401]
3753.3G05548401P922897N581055L857803n158005K377091N697555r452743j449661
3761G14924393N404052K012253J233750L431244m736405m704437M291458N170517r29871
3769.7G26096954j0770721L543014N526276R55734N85785l05099J143799N75790K686768
3778.4G30038300j574631q411102M024963K641373J034317J634750m103165l16543
3786.1G24968262J689987J102829J140213l25699N8975L02124J355515J12762J402893
3794.8G31807861L229142o736603n429306L730774N827865P216416r400559j4730224
3802.5G15515366O091079N337601N558701N622558j1777344l009338O828995K523269
3810.2G32690887Q68760R98611m05426L15552N505142m430161j6841964P588196P495803
$$ y = [705548401, 713471298, 719052353, 722910156, 717752151, 720129242, 725826797, 716374054, 714924393, 720328445, 722340698, 723574448, 727005692, 722269287, 717564850, 721856308, 727026825, 726096954, 715326233, 718869247, 724395523, 725351257, 725937042, 725631943, 726775742, 727351532, 730038300, 728463669, 720052567, 724077530, 726718903, 727753220, 729387970, 725284805, 724968262, 726658249, 727761078, 728901291, 728575592, 728634567, 728936691, 730292206, 730404968, 731807861, 735037003, 728300400, 722871094, 726601868, 732429733, 739646149, 730245590, 715515366, 721606445, 726944046, 732502747, 738125305, 726347961, 723338623, 730167618, 732690887, 733559647, 734558258, 734152832, 734468384, 739973526, 735543365, 718701401, 726289597, 733785400]
3818.9G33785400N610428q9874k1563339M107742P868958L733367L114777m73556n533143
3827.6G30560760R32847L676452M104004J35803j0950164M341278P982177p727584
3835.3G33055573j29929Q760528j1520614m981232R403076n898590J679077Q927079
3843G39294968l596726m204483L488617J658783N32913K138901j540146L360596P715378
3851.7G48848801r540329P8659j7942200J864319J2164307p15561q16193K751846L784867
3860.4G40478516L938751q413162j412812O719590q045807l600159O899872O475754
3868.1G43040543N203476j2660294q912125O402207P803879K593612j2428741K800750
3875.8G33843307N652161Q88443L453674M302979j0099258q472596Q471375J314697
$$ y = [733785400, 739395828, 739305954, 717742615, 721850357, 729719315, 733452682, 736567459, 736093903, 730560760, 731493607, 735170059, 739274063, 739409866, 728459702, 732800980, 740783157, 733055573, 732925644, 741686172, 730165558, 725184326, 734587402, 728688812, 730367889, 739294968, 735698242, 731493759, 734982376, 736641159, 737174072, 739312973, 737772827, 741133423, 748848801, 739308472, 739387131, 721444931, 723309250, 735473557, 734757996, 733941803, 736693649, 740478516, 744417267, 736004105, 734591293, 741310883, 733265076, 729664917, 736564789, 743040543, 748244019, 735583725, 726671600, 733073807, 740877686, 743471298, 731042557, 733843307, 739495468, 740383911, 743837585, 748140564, 738041306, 729568710, 738040085, 739354782]
3883.5G39354782K282639N480194j6728821L216248O450881J816025N195465k849197
3891.2G44218216j1479187K204056M295578j281510K264328K251206K784042Q99201
3898.9G46155930j1968079O272812J804504n811691O235962m946213k216568J370010
3906.7G36896667K039414L205948l75824N6381l99628L42331K94571r5978K361680
3915.3G44325562K163772m968109m304047N443726m26331m463501L647232J629639
3923.1G43047943j23215k434845j479721L129807J683426M01077k570724n37491K818756
3931.7G43935013k885513j573258J699753L08456R49250O65206O7368Q80814o5308
3940.4G43981781J250534K15607n486908J8081K507096J930084J145020l772965L05100
$$ y = [739354782, 741637421, 747117615, 730388794, 733605042, 740055923, 741871948, 747067413, 744218216, 732739029, 734943085, 739238663, 737957153, 740221481, 742472687, 745256729, 746155930, 734187851, 740460663, 742265167, 736453476, 742689438, 737743225, 735526657, 736896667, 738936081, 742142029, 741766205, 741822586, 741422958, 741765289, 742059860, 741963882, 744325562, 746489334, 741521225, 737217178, 742660904, 742234573, 737771072, 741418304, 743047943, 742924728, 740489883, 739010162, 742139969, 743823395, 744224472, 741653748, 741116257, 743935013, 741049500, 739476242, 741175995, 741484451, 742433701, 743098907, 743166275, 744047089, 743981781, 745232315, 745447922, 739961014, 739979095, 742486191, 744416275, 745561295, 741788330, 742093430]
3949.1G42093430J06048j999969K877044L07999j341476M47616J169052M30222r61456
3957.8G43128510P91778o4239L2959L04870j665954L08914J083221R3765n48706m39910
3967.4G43025208M79431k99607p0495J281433o5537j217422J99127Q42667R3918n7526
3977.1G44211197O85882M29841j86005l29208m50516j6785k86636m40979R9716M26865
3986.7G44143372j16196m74320N19104m9667n39551M73252N79300m5090o93207l52707
3996.3G43444290J21002J06278K07443N91660
4000.2G44470673
$$ y = [742093430, 742199478, 740199509, 743076553, 743384552, 742043076, 742490692, 743659744, 744089966, 743128510, 743920288, 743856049, 743889008, 744193878, 742527924, 742836838, 743920059, 744013824, 743465118, 743025208, 743504639, 743205032, 743134537, 744415970, 744350433, 743133011, 743332138, 744174805, 744268723, 744211197, 744897079, 745326920, 745140915, 744811707, 744361191, 744344406, 744057770, 743616791, 743716507, 744143372, 744027176, 743552856, 744071960, 744022293, 743482742, 743955994, 744535294, 744490204, 743796997, 743444290, 743565292, 743671570, 743879013, 744470673]
##END=$$ End of the data block
