##TITLE=$$ Begin of the data block
##JCAMP-DX=5.00 $$ ACD/SpecManager v 10.08
##SPECTROMETER/DATA SYSTEM=Varian
##DATE=20 Nov 2012 15:00:10
##DATA TYPE=INFRARED SPECTRUM
##DATA CLASS=XYDATA
##ORIGIN=
##OWNER=
##NPOINTS=3735
##FIRSTX=399.26403809
##LASTX=4000.35498047
##MAXX=4000.35498047
##MINX=399.26403809
##MAXY=83.05551147
##MINY=42.56847763
##XFACTOR=1.0000000000
##YFACTOR=0.000000100000000
##FIRSTY=66.08827209
##DELTAX=0.96440572
##XUNITS=1/CM
##YUNITS=TRANSMITTANCE
##XYDATA=(X++(Y..Y))
399.3 660882721 672445221 684300308 671944427 661259308 658961411 651021500 645523148 646331482
407 646331482 654253006 663723068 671694489 679150848 675987549 671079178 672788086 672385941 667850800
415.7 667850800 663006821 667201767 690316315 683292389 666635818 664824066 658234634 659562531
423.4 659562531 667277374 663192825 664263306 666257706 659233475 653355331 654299850 656727524 654722061
432.1 654722061 652444382 647613449 648256454 655909042 656239166 656454544 659705048 660770035 656122742
440.7 656122742 654897842 662367630 664369507 666223297 662979889 655999146 654346390 653358536 657964325
449.4 657964325 664993134 667124252 667998734 672435303 675606079 676651230 677263107 672075272 665661011
458.1 665661011 662561874 659597473 658184433 654463730 654334946 657817841 660865326 662156677 660665970
466.8 660665970 661844482 667841797 669233932 664045334 662094421 651457062 641286469 644954224
474.5 644954224 644362183 645156937 642292938 635336189 639016418 644713593 646629410 646895447 648876190
483.2 648876190 652021027 652154694 651213226 649837875 646591415 641512375 639368134 636086159 633810730
491.8 633810730 636813316 639903412 644630051 646113663 645579147 646803284 647078629 647253265 644752197
500.5 644752197 639843597 638199425 638579941 636436958 634745369 632881966 631924133 633243713 633064842
509.2 633064842 631557007 630178261 632505989 635286446 634592133 630905762 627706604 625076714 620340919
517.9 620340919 616947060 612139969 610393410 611348763 611174850 612875786 615503426 617073593 614136162
526.6 614136162 614737968 616728745 617206383 619510994 616329880 611886864 611245613 612039261 613709183
535.2 613709183 614659729 615909424 617024117 619316864 623733749 628218231 632591324 636028252 636582451
543.9 636582451 635637283 635012665 632700768 629870110 629942436 629190559 627150841 626987228 626785698
552.6 626785698 628029633 630622177 630575943 629018669 628164787 628550911 626761093 623373184 620241432
561.3 620241432 615956802 614468842 612807274 610085754 608105965 605770683 605461426 604674110 604624710
570 604624710 604114075 602303734 599542007 596593056 595785103 593411713 592532616 593395004 594356117
578.6 594356117 595445824 597734528 601925812 605001945 608749313 611789742 616165085 620305099
586.4 620305099 621707764 623385201 623779182 623400040 622832680 621353607 621487198 623121529 622600365
595 622600365 620625534 621628609 624333229 626282043 626494789 627281647 628800964 629476128 629257317
603.7 629257317 626880493 624622841 623546104 623061562 622080421 621412239 622051849 622384071 624355965
612.4 624355965 626619110 628707314 630574379 631814995 633490677 633703156 633833237 633693352 633430519
621.1 633430519 633959541 634319191 635377808 635916939 637160339 639636955 641871262 644821701 647921219
629.8 647921219 650112457 651196060 651299210 651079330 650206375 649002609 649241562 649105530 647995377
638.4 647995377 648522720 649787598 651104050 652499161 654611588 657817078 660114288 661206055 662110596
647.1 662110596 662500687 660922852 658513336 657939606 658003311 657296371 656440353 656921539 658192596
655.8 658192596 660651627 663616943 664912796 666071396 667690506 668817825 668407669 666872559 665774841
664.5 665774841 664825516 665747147 665945206 658630524 661859894 665351410 667899399 670065231 671211624
673.2 671211624 672104950 673678665 675058594 675790405 675854034 674178772 672956543 672883835 671991959
681.8 671991959 671175690 671585770 672750473 673815842 675398712 677523422 679084549 680414200 680792007
690.5 680792007 680225449 680023880 678890228 676461792 674118195 671921616 669663696 667536621 667288895
699.2 667288895 667732925 668277512 670141068 671037292 670389175 669560928 669374008 668635025 666790848
707.9 666790848 665637894 664225311 662101135 660616989 660983353 662164078 663378448 665635300 668318329
716.6 668318329 671426392 674578476 677700500 680536423 682318268 684007721 684594269 684946518 684963608
725.2 684963608 684860764 685789337 686553802 688298798 690293045 693037109 697094269 701196365 704924164
733.9 704924164 706322861 706935043 706936417 705761719 704749527 704409790 704270248 703187714 702253952
742.6 702253952 701760025 701669464 702830734 704531479 704828339 705030060 706954269 706863861 704654770
751.3 704654770 702601776 699033279 694079056 690320969 688196945 685967789 683387375 682845154 683473511
760 683473511 683816452 685350113 686621857 686906738 686512299 685854492 686930161 687470779 686344757
768.6 686344757 685611801 685930099 687050323 688458252 690616302 693579483 697513351 702095490 706835709
777.3 706835709 711509552 714915390 717770004 720358429 722284546 722818222 722825928 722429123 721043167
786 721043167 721028442 722661591 725765991 728727570 731245346 734151382 736632156 739293060 740946884
794.7 740946884 742170410 742664108 742831802 742960968 741270065 740448227 741490173 742467880 742744827
803.4 742744827 744377213 747058487 749303207 752187881 755013733 757136154 758427658 758930435 758180389
812 758180389 757432480 756340179 754165268 752033234 750230179 751018829 752543335 753462677 754528961
820.7 754528961 756310043 758739700 758615952 758043137 758485260 758573151 756637192 753059540 750643463
829.4 750643463 748110809 745306320 743064270 740746307 738807678 738239059 738864746 739935760 739629059
838.1 739629059 738835144 738743820 736828384 734555511 732031708 729284134 727797394 725517197 722309723
846.8 722309723 720307999 719896698 719398346 720488434 721707306 721931763 723199921 722618637 720600662
855.4 720600662 717742767 714910355 712518005 708880615 705218887 702724838 703269653 705361862 708021240
864.1 708021240 711795502 715563126 720321884 725049133 729302216 733561783 737333069 739596939
871.8 739596939 740380707 741203308 741782227 742507858 743150101 744231644 745154572 745665054 746349869 747483063
881.5 747483063 749278641 748835831 747819748 747692108 746847229 744127121 739610214 735726700 732757263
890.2 732757263 730202560 727486343 725305328 724539261 724964371 725143051 725173340 725727692 725142746
898.8 725142746 724065475 722377243 720288773 717579422 714169388 711763077 708849411 705318146
906.5 705318146 702367172 700731277 699518280 697763062 695796509 693715134 691848679 691300278 691094131
915.2 691094131 686170807 679675903 675783157 671746902 667126236 662761841 660348969 659164734
922.9 659164734 658232727 658481979 659719086 660952072 661260376 661297836 661827011 662984161 663060379 661565094
932.6 661565094 660426712 659865952 660601883 661793976 661967926 662295227 663973999 667397690 670975952
941.3 670975952 673538284 676136017 678185272 678653717 677875671 675367661 671961365 668675079 664204407
949.9 664204407 659438171 655719147 652192307 648137894 644471588 640794220 637829094 634714012
957.7 634714012 629715500 625187836 619734230 612767105 605627480 599005318 592948418 585245972
965.4 585245972 577058296 570209579 563840294 556970940 550379028 543532867 537023201 530511894
973.1 530511894 523464127 516520462 508454132 500893250 492935104 485198135 478485413 471992645
980.8 471992645 466203804 460760040 455867310 450782051 448390961 446616364 444160042 441993103
988.5 441993103 439759483 438218460 436129723 435652313 434442253 433194237 432363815 431333885 432060471
997.2 432060471 431988716 432277222 432330589 433234825 434161720 434833145 436103477 436135712 436440010 435514412
1006.8 435514412 435180283 434145317 432599640 431778908 429880180 429005241 427531967 426772614 425983391
1015.5 425983391 425684776 425739288 425730782 427367783 428047180 429190063 429269524 430342140 431956291 432218742
1025.2 432218742 432999115 433721542 435743179 436473808 438153343 440226402 442274857 445761032 448211403
1033.8 448211403 450096321 450627670 451978569 452867622 453186455 452269211 451064110 451564178 450658836
1042.5 450658836 452019882 453167610 453457069 454081459 454969063 456317482 456764946 459462242 460988388
1051.2 460988388 462370796 463990746 465849953 468044167 469625473 473074188 474970856 478737488
1058.9 478737488 483553772 488244019 493116455 496203766 500388184 505177612 510882950 514522209
1066.6 514522209 516401596 516771164 515106277 511877823 505576973 499957314 494037285 489066277
1074.4 489066277 484241753 479221382 476649361 474874573 475577660 475688972 476203880 476264763 477267113
1083 477267113 479069977 478637428 479785805 481086655 483763390 485477943 487624054 490887146 493542862
1091.7 493542862 497540436 500462112 504362640 507103195 509436913 511617279 512880440 514497032
1099.4 514497032 514678116 514972191 513807297 514364128 515700302 515604553 515972328 516721191 519045181
1108.1 519045181 519812660 521516495 523940010 526851120 530050201 531017418 532281609 532752609 533924522
1116.8 533924522 535010109 536131821 537467880 538038330 540222549 541870384 543562279 544813881
1124.5 544813881 546627731 549802513 550997047 550876961 551273804 552906761 554660950 556316414 557788467
1133.2 557788467 559337921 560710487 562007599 562926254 562827530 562606888 560638084 558281708 555627785
1141.9 555627785 551916580 547298164 542854576 541273041 537860756 533880653 530931320 528297768
1149.6 528297768 527190094 525370483 524244270 523113823 523060722 522823334 522167549 522228622 521832085
1158.3 521832085 522514839 522570801 523545189 524705811 526177101 527979889 529711380 533320351 536832428
1166.9 536832428 541576614 545975800 550387611 555692635 560804443 565559425 569723930 574280853
1174.6 574280853 578113441 582392082 586507111 591714821 597611771 602419930 608011932 612748146
1182.4 612748146 617447395 622405281 627221336 631261902 634162025 637166786 639310036 640968781
1190.1 640968781 642403030 643827133 644843445 645139999 645671463 646509399 647990417 648817215 649290848
1198.8 649290848 650031128 650690689 651623383 652145081 652734375 652873077 652534714 652533112 652766876 653560867
1208.4 653560867 654581833 656034393 657360306 658843079 661367416 663994446 666413498 668263550
1216.1 668263550 669592438 670881271 671298141 671364746 671788101 672321320 672519302 671862488 671144485
1224.8 671144485 671348114 671764908 671744995 671958160 672201309 672535172 672796860 671884537 670454330 669263763
1234.4 669263763 668591614 667697220 666178894 665431061 665082397 664488068 664443359 664770508 665274887 665891571
1244.1 665891571 666585770 667199173 667549057 667842865 667643585 667464371 667737198 667568665 667228851 667320251
1253.7 667320251 667982788 669038925 670070419 670885162 671709213 673010788 674249039 674795609 674886398
1262.4 674886398 674218979 673576889 673602753 673646622 673577194 673903122 674799347 676080093 677563782 678727341
1272 678727341 679859543 681415939 682683563 683345947 683527145 683622131 683246613 682517242 681653824 680684052
1281.7 680684052 680279083 680050507 679703140 679492340 679873886 680647049 681284409 681730957 681745071 681302948
1291.3 681302948 680748825 680386963 679489365 678246689 676728592 675204773 674515152 673621368 672764664
1300 672764664 672444305 672366791 672555389 672673492 672290955 671633835 670970764 669702225 668410339 667228775
1309.7 667228775 666025848 665001297 663541183 662434616 662193451 662106857 662070618 662276840 662300949
1318.3 662300949 661798553 661896896 662523727 661989594 660736465 659716034 658355713 656889954 655248032
1327 655248032 653139648 650968552 649615707 648815460 647627029 646506653 645446472 644961853 644131851
1335.7 644131851 642537003 641668472 640512085 638301468 637036896 637951012 638648224 638890800 639186592
1344.4 639186592 639318275 639367828 639767227 640620575 640797882 641127167 641611404 641377945 641038589 640494995
1354 640494995 639867554 639170837 638380470 637286415 636495819 636534081 636147308 635579720 634490395 633292732
1363.7 633292732 634654922 635980110 635788498 635626831 634804573 633661804 633303986 632249908 632054253
1372.3 632054253 631707420 630012856 629887466 631649055 633373108 633678551 634316826 635262260 636392021
1381 636392021 637330360 637651825 638195190 638545113 639307289 638919792 638196526 640942612 643352585 644378357
1390.7 644378357 645580902 647566833 648940582 647959061 646018982 647595749 649015884 648527222 646474838
1399.3 646474838 646316605 647212524 646611710 646189270 645545425 643167877 642972336 643931274 644230347
1408 644230347 643960190 643804245 643603973 643329468 643084793 642764053 641708145 640314941 639014091
1416.7 639014091 638149834 637570763 632079811 633415031 636843567 638049850 638252983 637828712 640008545
1425.4 640008545 641776505 641872940 642340851 641665039 640475006 640906754 641870651 641116562 640726395
1434.1 640726395 642499161 642772446 638674164 640555191 645265732 647572479 648558121 649621658 649851074
1442.7 649851074 650303955 649793396 649817429 649493408 647410583 645059662 645880966 647130585 646244583
1451.4 646244583 646012268 646465378 647304077 646637268 644713287 639586906 635274506 639682579 641664658
1460.1 641664658 644422379 644687958 644590149 645943375 643214569 645152130 647386627 650305252 652872543
1468.8 652872543 656241989 659991989 659684143 660440903 663375397 669934006 673582001 673685608 677319412
1477.5 677319412 681638260 684698029 686512375 688310776 690544510 694990540 697969666 700467834
1485.2 700467834 703372345 703409882 705553894 706365128 702740707 702032318 706920166 710733795 711543121
1493.8 711543121 712957153 711939087 708230515 712688446 714998779 715887070 719035263 720364761
1501.6 720364761 720589752 722342834 723366318 722823334 711799927 704223862 710522232 714535294
1509.3 714535294 717373581 720295486 721411362 721483078 724755554 725782928 724898987 722383881 720385284
1518 720385284 727286072 730116501 724165192 717882080 718869247 724433823 726076660 723900375 724755936
1526.6 724755936 726604614 726476059 729740372 733916779 734452286 734986420 732098770 727583542 730497055
1535.3 730497055 732357254 733973541 734140167 725380402 712679520 720409012 723118896 723313370
1543 723313370 728727493 729628220 730377502 734711304 737211227 738495483 736254349 732626724 734836121
1551.7 734836121 736270142 735850601 730978699 730853653 735793686 738165970 725939331 714187317
1559.4 714187317 723611450 733959503 739030380 741360855 740862122 736923141 737025452 738445206
1567.1 738445206 738808975 736763535 728877182 732167740 735494537 736466675 737327499 738419724 737022552
1575.8 737022552 728771515 732549438 735999527 736398621 735810928 734503021 733287888 731743774 730659943
1584.5 730659943 729725342 729095078 729040070 728489304 728022842 727260513 727163315 726873169 726387253 724758377
1594.1 724758377 722289047 721180725 719302063 717966690 715840225 713773804 712236481 711201859
1601.9 711201859 710836945 709660110 709922791 709392319 708171997 706826630 705786591 703529129 700648956
1610.5 700648956 699969406 697643661 695962524 693901825 693069916 690214996 679202805 683401031
1618.2 683401031 685699463 686309357 685401382 685339432 682749329 675930481 677907028 678402710 678012772
1626.9 678012772 673755188 671117554 671917038 671007004 670412292 669339142 670101547 671189499 663665848
1635.6 663665848 660725327 663248901 666019516 667689667 668070145 667240829 667381973 665928268 666327667
1644.3 666327667 666779099 661863937 660449295 659869385 664544601 668439636 671897659 675728455 673257370
1653 673257370 659459457 665747223 672529373 675862656 677261963 677948990 678883133 680061340 681415176
1661.6 681415176 681127777 681325836 686259232 689670792 692005463 694780197 695875854 692744675 695079498
1670.3 695079498 698499832 699071503 702119675 705505600 703746338 701399460 706412048 710711517
1678 710711517 713153687 714356842 715034332 720020447 724281845 721036835 712187653 718814392 726563263
1686.7 726563263 729949570 729845505 730491562 731085587 733762894 736389008 738504868 741490326 741330872
1695.4 741330872 733587646 739202118 746185684 753065338 750971375 738506012 746813431 752456894
1703.1 752456894 753334351 751128922 750918884 749814758 752464676 756377869 757281189 757996674 760294571
1711.8 760294571 762519836 763803482 761167526 759444122 761935349 759187851 751535263 759086151
1719.5 759086151 764150391 765877380 766924362 766756821 767113419 769954605 772213898 773253326 774745865
1728.2 774745865 775691986 772211761 771682281 775577469 776584396 768536224 761656113 769444046 774425659
1736.9 774425659 775533218 777595596 775667114 774692001 780327682 782461319 780179367 781137161 784224777
1745.5 784224777 784770126 783602829 781672134 781094818 784812927 783268661 782940292 787941971 790495071
1754.2 790495071 792614212 793944778 791535110 793282089 796061707 797686920 799152069 795136414
1761.9 795136414 794710770 797602692 798249664 798650818 799655380 799209442 796209793 799485092 802920456
1770.6 802920456 801039581 797153625 798172531 803781509 805241623 803656235 805278244 805568237
1778.3 805568237 805737534 803774490 801262665 803251953 805800171 807214508 806248932 806764145 809158173
1787 809158173 810198288 810852127 812040558 810728455 808775864 805186691 804874802 808430557 808233566
1795.7 808233566 807062073 809038467 810780869 809651413 808906860 811631775 811536789 812571106 814618073
1804.4 814618073 814511871 814692078 813955841 812957306 813434601 813290482 811495361 812021561 813158875
1813 813158875 813760681 814809799 815401382 816491165 816580582 817323990 818211670 817617035 817600098 816308212
1822.7 816308212 816655350 816611938 812367172 813189545 815738525 817405319 815784531 811749954 815270996
1831.4 815270996 818873672 819414368 819491730 819703217 819705505 818620911 817525177 818061218 817870102 818005753
1841 818005753 817959976 818712997 817308273 811598358 816130676 819712372 819576721 819671173 820484009 820835876
1850.7 820835876 820214539 820001755 819318466 818989182 818882141 818945923 819670410 819423370 819395905 819662476
1860.3 819662476 820223694 820835114 821513596 821859818 821591568 821266785 819746933 818686981 815955658
1869 815955658 814797134 817366791 818619461 819117203 819803925 820618286 820927963 821225662 821668472
1877.7 821668472 822078171 822289200 822126999 822371826 821714478 821064911 820312653 819669571 820218735 820525665
1887.3 820525665 821398239 820458298 818550644 820831070 822849503 823115616 823552933 822588806 820805130
1896 820805130 821305695 821817703 821602478 821129913 820982208 821246872 821345749 821840668 821999359 822437820
1905.6 822437820 822947998 822901917 822626343 822120132 821753845 821928635 822218704 821602020 821860809 821890564
1915.3 821890564 821945496 822466812 819364395 819324341 821781540 823143845 823376389 821152878 821009750
1923.9 821009750 822769547 823351898 822763138 822111359 821680832 821485062 821607208 821664505 821774979 821615601
1933.6 821615601 822096329 822794876 823253708 823395081 822997742 822777557 822600937 823329849 821752472
1942.3 821752472 819404755 821325150 821800613 820651169 820444489 821166763 821948471 822244415 822983475
1951 822983475 823738022 823846436 823529205 823157501 822637177 822193527 821941147 821933746 821970825 821524277
1960.6 821524277 821208954 821241074 821826477 822415390 822677460 822653046 822077560 822593460 823728943 824053192
1970.2 824053192 823618240 823141708 822622147 821850891 821536942 821909714 822207947 822108078 822237320 822279129
1979.9 822279129 822553558 823153305 823246994 823359146 823347778 823263702 823173904 822520905 821393204 821193695
1989.5 821193695 822074356 821653519 820342865 821194916 822629013 822851257 822893143 823196030 823624420
1998.2 823624420 824011688 823337708 822596970 822180328 822162552 822010498 821367722 821329727 821043854 821145859
2007.8 821145859 821657944 821768188 822280197 822554474 822546310 822690887 822875137 822454300 821119385 819952621
2017.5 819952621 819695358 819714737 819698181 819744644 819649277 819845886 820360031 820758438 820901337 820985641
2027.1 820985641 821064453 820811844 820769501 820505600 819782867 819052124 818665085 818626633 818220901 818224869
2036.8 818224869 818679352 818680267 818886414 819418182 819076080 818868179 819345093 819194794 819241714 818924942
2046.4 818924942 818150406 817881699 817547150 817293549 817066956 817079010 817045822 817322998 818176880 818769302
2056.1 818769302 819015350 819038315 818994827 818297119 818018265 818252029 818306961 818405533 817356567 816443710
2065.7 816443710 816355743 816674957 817449265 817928009 818274918 818507004 818791428 818683319 818634338 819011841
2075.4 819011841 818728790 818027191 817704010 817625961 817144852 817058105 817261276 816962967 816946411 817551727
2085 817551727 818348236 818656845 818678360 818935471 819172363 818853607 818539200 818471909 818154068 817969666
2094.6 817969666 817700119 817357101 817093048 817283783 818023758 818491745 818858337 819050674 819155045 819179230
2104.3 819179230 819012146 819103241 819077911 818658905 818107147 817677155 817686615 817666245 817318497 817698975
2113.9 817698975 818075943 818330383 819192810 819592133 819952774 820042114 819807739 819658203 819152145 818721390
2123.6 818721390 818251953 817968826 817731934 817607269 817601013 817805405 818536072 818895187 819063416 819234085
2133.2 819234085 819620972 819769440 819370422 819209747 819126282 818943787 818369217 817831039 817279816 817186050
2142.9 817186050 817654266 817763519 818208466 818850327 819499664 819871521 820036087 819982529 819403534 819043198
2152.5 819043198 818756104 818444824 817934265 817851410 817752686 817505875 818036270 818538055 819155350 819341888
2162.1 819341888 819654846 820097580 819953461 820194092 820237274 820233231 819709320 818956375 818798523 818883820
2171.8 818883820 818945389 818298569 818170090 818935242 820038605 820828857 821028366 821246796 821503830 822031631
2181.4 822031631 821747971 820869827 820499191 820468597 820463409 820218430 820048370 820076065 820416107 820801010
2191.1 820801010 821540909 822250137 822438660 822836685 823001099 823016586 822892914 822353516 821686401 821182556
2200.7 821182556 820741653 820647125 821013870 821129074 821728973 822281647 822497787 823114624 823689346 824200516
2210.4 824200516 824294586 824168472 823793030 823164062 822532349 822237244 822287064 822023621 822119446 822503204
2220 822503204 823041153 823429184 823722992 824448853 825025482 825224457 824492722 824073868 824285736 824035187
2229.7 824035187 823538208 822849579 822556992 822502289 822676926 823108902 823554916 823972626 824571304 825488052
2239.3 825488052 825889053 826036301 825821152 825303879 825033951 824787521 823918152 822687988 822535248
2248 822535248 822939911 823487549 823926010 824535599 825335846 825457001 825735397 825797043 825592346 825318527
2257.6 825318527 825256805 825499344 825105133 824322968 823283539 822996826 823222885 823543930 824287643 824819183
2267.3 824819183 825233536 825556259 826173859 826688919 826799622 826325531 825555191 825226517 824763184 824366760
2276.9 824366760 823827209 823777237 824232330 824542389 824962769 825454941 826065750 826217499 826577148 826647339
2286.5 826647339 826380768 826346359 825753021 825601273 825538559 825230408 824484787 824230576 824710770 824727097
2296.2 824727097 825341415 825830612 826313400 826792984 826966476 827205658 827318802 827747498 826952972 826177368
2305.8 826177368 826049118 825615158 825468597 825410767 825916672 825949020 826140976 826519165 827096252 828163300
2315.5 828163300 828106766 828437653 828681107 828726425 829190521 828901672 827990417 826152191 825570145 826756668
2325.1 826756668 827989578 828202972 828292694 828932266 828875351 828939896 828959579 828950729 828327789 827575760
2334.8 827575760 827794724 827156906 826664963 826530228 826269379 826172180 826223145 826834946 826941986 827641830
2344.4 827641830 828481140 827146835 825132599 825116425 827286224 828838730 828514938 828783112 829234695
2353.1 829234695 829163742 828615265 829138184 830555115 829182739 827850647 827487411 827257233 828606873
2361.8 828606873 829753647 828832092 827358398 826729965 825676804 825130844 824796371 824818039 824932480
2370.4 824932480 823864136 823660660 823734055 823588104 823588638 823370132 823730698 823890381 823263321 822347794
2380.1 822347794 821488647 820976181 820514755 820031357 819831696 819624329 819461975 819729919 820310440 820638733
2389.7 820638733 820454483 820619965 820769577 820606537 820430527 819811707 819446182 819115829 818817139 818810959
2399.4 818810959 818742752 818910751 818982849 819082947 819003906 818972015 819481430 819730225 819369354 819087753
2409 819087753 819125824 818470688 817880554 817713089 817257843 816818466 816428604 816363678 816507339 816687393
2418.7 816687393 816600037 816739807 816887665 816643524 817076645 816974792 816379471 815949478 815431061 815210571
2428.3 815210571 814767914 814418564 814250717 813999939 814006271 814453201 814565735 814341812 814398422 814342957
2438 814342957 814537277 814527283 814226456 813690414 812892838 812461700 812242737 812131042 811659546 811915283
2447.6 811915283 812299576 811878281 811994934 812027817 811910248 811682816 811617966 811480408 810929794 810878983
2457.2 810878983 810459366 809706650 809212646 809063797 809105453 809050140 809197540 809337845 809340591 809583511
2466.9 809583511 810106506 810095444 809867325 809193039 808400879 808243790 807568588 807309799 807179260 806751022
2476.5 806751022 806718979 806397018 806277618 806415176 806978073 807681732 807692184 807228394 806754074 806514435
2486.2 806514435 806315689 806003265 805369644 805136032 804876175 804231110 804227371 804453812 804633636 805023880
2495.8 805023880 805470352 805257416 805041199 805124512 804611816 804019547 803585968 803532944 803403320 802994614
2505.5 802994614 802691269 802499084 802587051 802480545 802793884 803400726 803547134 803411484 803296890 803469543
2515.1 803469543 803102341 802303391 801610031 801111298 800981522 800949249 800868912 800851517 801089249 801097412
2524.7 801097412 800939865 801387939 801975098 801819687 801200562 800636063 800132599 799694138 799390488 799281693
2534.4 799281693 799150543 799087219 798986053 799017715 799140625 798961792 799168777 799364090 799390259 799148331
2544 799148331 798183212 797266312 796919785 797054443 796698227 796008682 795648880 795792542 796161804 796245880
2553.7 796245880 796408768 796308212 796398926 796523056 796282959 795748520 794766159 794537277 794518890 794191818
2563.3 794191818 793635635 792989197 792749786 792834244 793155212 792996216 793345184 793880234 793714066 793465958
2573 793465958 792827530 792406540 792119141 791911469 791784286 791647644 791646500 791449585 791424408 791179352
2582.6 791179352 790946732 790765228 790532532 790636673 790418549 789897232 789470139 789297028 789049606 788853531
2592.2 788853531 788728714 788594666 788947067 789332962 789245300 788689957 788645096 788887863 788559341 788229370
2601.9 788229370 787914047 787541275 787223358 787025299 786795349 786657486 786569901 786501007 786389847 785789871
2611.5 785789871 785585022 785689926 785693588 785607758 785320587 785065231 784601517 784406662 784147263 783716202
2621.2 783716202 783586960 783520126 783273849 782621231 782276230 782232895 782260895 782290573 782153168 781565323
2630.8 781565323 780492401 780183029 780148087 779786377 779302063 778810806 778532639 777961273 777486954 777117310
2640.5 777117310 776931000 777201920 777385788 777197266 776516266 776122055 776013412 775617905 775201569 774576340
2650.1 774576340 773937607 773881607 773904495 773428879 772861404 772604370 772469940 771980286 771685333 771852875
2659.8 771852875 771491928 771098709 771178131 770897675 770314407 769915695 769760208 769603653 769120178 768711395
2669.4 768711395 768303528 767666016 767407303 767393799 767326660 767122955 767275314 767726669 767296677 766541214
2679 766541214 766173935 765893707 765361099 764963226 765148926 764970016 764279251 764018326 764217377 764067917
2688.7 764067917 763803787 763718796 763433990 763214722 763140106 763005295 762225876 761518402 761708984 761474533
2698.3 761474533 760489273 759986954 760340729 760370789 759883804 759594116 759504318 759385071 759102173 758925858
2708 758925858 758734360 758320999 757620316 757319412 757346420 756839447 756328506 755745544 755211029 754943466
2717.6 754943466 755103531 755434189 755020142 754752579 754759445 754476089 754167709 754025040 753504715 752414169
2727.3 752414169 751978531 752057114 751770706 751327896 751399612 751568680 751419754 751381683 751394806 751403198 750846329
2737.9 750846329 750152359 749755478 749426651 749283371 748792877 748191376 747934113 747960510 747545166 747301865
2747.5 747301865 747836533 747910919 747830429 747742691 747673721 747506714 747020187 746640778 746170425 745809937
2757.2 745809937 745311584 745022354 744927826 744571915 744554901 744645081 744510651 744229965 744337082 744680786
2766.8 744680786 744859238 744776382 744389648 743923721 743138123 742665482 742465286 742229538 741912460 741440582
2776.4 741440582 741540146 741620102 741535416 741535339 741441116 741232605 740854568 740497894 739750443 739215469 738953476
2787 738953476 738419113 738330765 738154678 737377167 736684875 736405029 736443634 736461411 736215210 735921783
2796.7 735921783 735719910 735172272 734113083 733215637 732420731 731418915 730871353 730410919 729753189
2805.4 729753189 729552689 729527054 729240265 729082794 729098969 728687973 728072510 727286758 726537170 726007462
2815 726007462 724781189 723451767 722959747 722643204 721695023 720745316 720379562 720137939 719711914 718879623
2824.7 718879623 718066330 717269669 716659851 716103134 714973526 714248276 713499222 712059860 710672607
2833.3 710672607 709552841 708496017 707481003 706969376 706454239 705669022 705156097 704193573 702364273
2842 702364273 700609131 699087677 697508698 695731735 693689194 691803131 689519882 687172318 685498886
2850.7 685498886 684243164 683459473 682573624 682024307 682207260 682315979 681748657 680878983 680508804
2859.4 680508804 679862213 679105301 678589554 677461929 676091919 675020294 673757858 672626190 671994247
2868.1 671994247 670878296 669573975 668140488 666570358 665409698 663995590 662281265 660428696
2875.8 660428696 658917236 657367935 655399399 653403854 651628723 650893707 650300446 649510651 648568039
2884.4 648568039 647538605 647129593 646523285 645758591 644921036 644325027 643802948 642914658 642413177
2893.1 642413177 641918182 641592712 641393585 641120300 641155777 641318130 641121368 640614471 640404968 640026474
2902.8 640026474 639695435 639248886 638060379 636612587 635520935 634386673 632634048 631738052 630821762
2911.4 630821762 629229622 628059654 626559792 624863205 622786522 620932121 619810905 618277740
2919.2 618277740 616087646 614277267 613561172 612533150 611074295 609855652 609348068 609194565 608694725
2927.8 608694725 609051437 609701958 609779625 609478264 609759407 610954094 611838150 612510262 613302460 614631042
2937.5 614631042 616244736 617664833 619301872 621256599 623271790 625384941 627795258 629945107
2945.2 629945107 632213631 634439278 636132164 638068924 640005569 641573029 642976608 644275894
2952.9 644275894 645303650 646449356 647897949 649378967 651154709 653449936 655912247 657956619
2960.6 657956619 660009918 662088394 664085999 665629196 666201096 666920853 668307190 670261230 672138138
2969.3 672138138 673211899 674090805 675316315 676728897 678456879 680235291 681685257 683268661
2977 683268661 684573288 686032791 687436371 688282013 689459534 690210800 690660172 690894318 691351776
2985.7 691351776 692515717 693451996 694552383 695657806 696703949 697693634 698404770 698804550 699302826
2994.4 699302826 699971848 699961853 699928055 699679642 699511261 699521408 699224930 699299393 699426117 699878540
3004 699878540 699934769 699865265 700361557 700493546 700672379 700496445 700050430 699830475 699129944 698021927
3013.7 698021927 697512512 697354813 697017288 696614609 695697708 695498581 695847473 695600281 695343170 694995270
3023.3 694995270 694678345 694113922 693162155 692287674 691717377 690889893 689775467 688940964 687857513
3032 687857513 687104111 686766129 686684875 686518173 685728760 685134277 684642639 684256668 683356094 681815567
3041.6 681815567 680762787 680048370 679256363 678162079 677400131 676836166 675737915 674914246 674712219
3050.3 674712219 674272385 673640518 673234940 672527695 671830826 670742340 668791656 667412109 666500854
3059 666500854 665326385 664232483 663485641 663047028 662539749 661809464 661511383 661398163 660674973 659709091
3068.6 659709091 658729935 657631760 656445160 655503464 654545059 653169403 652206345 651568985 650529480
3077.3 650529480 649626846 649127731 648515625 648160477 647448425 646160431 645743866 645165329 643570480
3086 643570480 642126160 641530228 641135712 640317001 639307289 637916527 636761513 636276703 635868111
3094.7 635868111 634781342 633635521 633398476 633003731 632194290 630957680 629734459 629054108 628218842
3103.4 628218842 626958580 625541801 624675293 623752327 622799873 622069893 621283875 621105042 620517578
3112 620517578 619308624 618429337 617661209 616596260 615487022 614487877 613448257 612646523 611883316
3120.7 611883316 611035385 609829597 609002571 608789444 608263741 607638855 606686363 605815353 604743385
3129.4 604743385 603268471 602507401 601707153 600030251 598834190 598809128 598254166 597410431 596883888
3138.1 596883888 596255798 595577965 594580956 593890228 592605896 591250801 590561867 589544182 589028130
3146.8 589028130 588427200 587418251 586170006 584741211 583708115 582872124 582476082 582165489 581498795
3155.4 581498795 580603638 580045853 579491043 578263588 577104568 576316605 575549545 574747467 574337883
3164.1 574337883 573524094 571837883 570538940 570077057 569825096 569363937 568558464 567393723 566566124
3172.8 566566124 565583305 564493523 563776970 562981644 562303085 561390762 560885773 560148544 559082260
3181.5 559082260 558657875 557990685 557641449 557021561 555817833 554661064 553871918 553554764 552537880
3190.1 552537880 551644707 551116753 550469055 549813728 549097710 548285141 547256699 546331329 545466614
3198.8 545466614 545255623 545049591 544414825 543758736 542869949 542294655 541656723 540757179 539758606 539103966
3208.5 539103966 538371849 537417641 536948547 536158905 535560913 534879341 534167938 533797684 533186874 533072739
3218.1 533072739 532417755 531113091 530581551 530373611 529738426 529003601 528254776 527394943 526692963
3226.8 526692963 525613785 525036430 525050087 524551926 523846970 523473740 523355904 522748909 522214203 521883163
3236.4 521883163 521241798 520290222 519271202 518645134 518050346 517262154 516650887 516591301 515785866 514910355
3246.1 514910355 515086479 514766273 514524002 514159546 513494263 513061333 512472115 511872139 511006432 510541649
3255.7 510541649 510280609 509514694 508474274 507893867 507866287 507418480 507037392 506894302 506484184 505952797
3265.4 505952797 505832787 505588379 504436150 503272858 502750969 502540169 502088470 501684685 501387062
3274 501387062 501438904 501527481 500913506 500316849 499437256 499082642 499379463 499010811 498230133 497746964
3283.7 497746964 498270073 498206177 497188988 496317215 495530663 495153465 495001221 494956856 494760475 494901657
3293.3 494901657 495144691 494323044 493500900 493173904 492641563 492296600 492151108 491541595 491034050 490834732
3303 490834732 490419922 489962692 489805603 489871864 489834213 489900398 489611816 488832245 488233070 487542038
3312.6 487542038 486318016 485572701 485708809 485590706 485716896 485732956 485353699 485238037 484624329 484148369
3322.3 484148369 483957939 483819962 483656731 483305931 482965698 482245026 481563225 480581398 479871407 479825706
3331.9 479825706 479321175 478817940 478645477 478420525 477654800 476884003 476825027 476881485 476539803 476208115
3341.6 476208115 476043091 475649834 475381012 474914513 474063683 473109512 472539864 472473946 472315178 472293510
3351.2 472293510 471617737 470733337 470637512 470787125 470940247 470688095 470132217 469253616 468365784 467503166
3360.8 467503166 466601219 466073723 465628242 465283852 464735222 464260216 463849030 463644905 464169998 464242783
3370.5 464242783 463486786 462836533 462697983 462376022 461909790 461229553 460448074 460255699 459862099 459442215
3380.1 459442215 458958740 458497353 458665047 458797569 458466949 457834473 457410316 456914864 456660423 456149750
3389.8 456149750 455177231 455348892 455361290 454764175 454741669 454902382 455101891 454953423 454428329 454146004
3399.4 454146004 454055405 453984756 454392014 454756660 454421463 453911781 453527641 453340950 452943153 452374496
3409.1 452374496 452279167 452224236 452178001 452581215 452868004 452943916 453077469 453043938 452791519 452617073
3418.7 452617073 452866287 452309875 451208954 451471977 451708450 451392975 451862984 452479820 452638397
3427.4 452638397 452474670 452228012 452565079 453014793 453087425 453074760 453254776 453319702 452516708 451836624
3437 451836624 452152252 453126717 453453140 453950005 455475426 455366325 455378456 455770073 455659256 456403122
3446.7 456403122 455483322 455315018 456557541 457021675 457069511 456686249 456724892 456840668 457296867 457948151
3456.3 457948151 458663940 459508629 459784851 460612411 461355286 461307602 461108818 461511536 461750870 461595039
3466 461595039 462087746 462485237 463164902 463611603 464052048 464674149 465066910 466232529 466579132 466640587
3475.6 466640587 467322350 467340469 467378769 468310051 469245949 469411736 469312401 469368248 470840950 471956329
3485.2 471956329 471860390 472707901 472945023 472813911 473836823 474805374 475803604 476995354 476977158 476666870
3494.9 476666870 476861534 476786690 477704811 478824310 479497032 480024757 480505981 481186714 481287994 481895142
3504.5 481895142 482945900 483800812 484842186 485997925 485662308 484744759 485907593 487135468 487942467
3513.2 487942467 488236923 488717537 490145760 490970192 491524849 492134705 492697983 493588753 495316162
3521.9 495316162 496037941 495102196 495055351 495788460 496924858 497144089 497618332 498293343 498965378 500175133
3531.5 500175133 501339531 502638664 503108063 504590034 504652176 504049263 506129990 507211151 507936058
3540.2 507936058 507892380 508800354 510158539 510587082 511367149 510745430 511576920 511797218 513415413
3548.9 513415413 515647469 517350731 519550056 517957191 519065132 520657768 521147346 522128220 521622429
3557.6 521622429 523471642 525304832 525569038 525437775 527963486 529910431 530659866 535614243 534521141
3566.2 534521141 532108154 532174263 531753731 535928497 537838936 539449959 541004753 541579857 541820641
3574.9 541820641 543354568 545770149 545783386 548050423 549666481 550721169 553353767 555340729 555873451
3583.6 555873451 555196762 559076576 559466782 556405182 558074532 556684914 560431480 564694328 568343811
3592.3 568343811 568750114 568490562 572159386 570593872 574180603 578736229 578931427 581392746 580877533
3601 580877533 581259270 583678856 585271912 586754608 589956703 592558861 590711632 594744568 592499695
3609.6 592499695 592014618 601911850 601576004 597327881 601147652 600443687 605954208 610859756 608472786
3618.3 608472786 608294296 606439590 607851524 612612305 615799065 617594185 620242767 622683640
3626 622683640 625037460 632746353 630947227 615442848 620682678 626904221 633186188 633122787 629832764
3634.7 629832764 633098907 636991463 638758736 638045425 639481964 642349548 644661942 644780502 644545212
3643.4 644545212 647150879 650804062 656656723 652528915 645030670 650140610 648762894 644831467
3651.1 644831467 646319656 654201660 659737549 664028397 667700500 657425461 660369949 666264191
3658.8 666264191 667034149 668481369 669146500 670969543 671377487 671956482 673639297 674431763 678706512
3667.5 678706512 681199646 679287796 676864700 668987122 673523712 683722992 693866501 692771912
3675.2 692771912 667130508 670612335 681069794 686440201 682923279 683051910 687035675 689232559
3682.9 689232559 690653458 691495361 691957703 696049805 702691116 689973755 684721680 694368439
3690.6 694368439 688755722 690239639 696965790 698006592 699884491 700068588 699656067 700948486 701888123
3699.3 701888123 705222168 707817535 700524826 698792114 705444336 707059631 706261215 706385193 709203644
3708 709203644 712597733 702544708 706604462 710148010 694926987 701793823 707804184 708548737
3715.7 708548737 710121994 713295670 714123383 710232010 712065964 717802277 712363510 707599945
3723.4 707599945 713566742 714621429 713700943 710103607 710945053 716118393 717666473 723540192 718997726
3732.1 718997726 710621414 720821304 719279022 705081711 706093216 710291290 712590485 717050858
3739.8 717050858 720363998 716169128 720963821 735342407 721510086 700309219 713180008 721015472
3747.5 721015472 728275452 722639160 708553619 720030746 713674164 708001862 716145477 722781067
3755.3 722781067 726136322 719250870 721791611 728062363 719451981 718503189 724380875 726435928
3763 726435928 727196884 729827271 725377350 721888962 725943832 730955124 730326767 719934616 723035126
3771.7 723035126 727407074 727607040 728703918 729076004 729640427 730085373 733502808 732189560 722765503
3780.3 722765503 726507263 729946136 731206436 733382797 729556503 728191986 729673996 731098022
3788 731098022 732531052 732455521 732821426 732589264 733148117 733023376 734177475 737271423 730858765
3796.7 730858765 726605606 730198669 735505676 742355652 731387711 717523422 723765030 729607849
3804.4 729607849 735802078 741005402 728537064 725458298 732951813 735668411 736147385 737121582
3812.2 737121582 737589798 738899002 743776627 738383026 721913071 729481583 736838150 742493439
3819.9 742493439 742936630 720852585 725377350 733430710 736456223 738748932 738031387 733037796
3827.6 733037796 733836060 737446518 741739426 741383743 730488434 735906601 744658051 736360931
3835.3 736360931 736462860 747049026 735437851 728606873 737772675 731513367 733007660 742155762
3843 742155762 738596954 733524094 737533188 740397491 740706635 742556458 740548553 742975464 750686417
3851.7 750686417 740091019 737751160 722637405 726505890 738429947 736958160 736250229 740179214
3859.4 740179214 743944855 746959305 739372253 738304291 745832901 738395157 732635803 738956070
3867.1 738956070 745902100 753111038 741192398 729470367 735923996 744484024 747550430 733617630
3874.8 733617630 735823441 741716003 742737350 746267548 750384903 740198212 732324829 741696320
3882.6 741696320 743290787 744646835 749031677 732296295 735979462 742399063 744539413 750168762
3890.3 750168762 747288513 736392670 739102249 743133392 742158966 744252472 744994812 747560959
3898 747560959 749352112 737706451 744002075 745646515 739634781 745328598 740803375 739005432
3905.7 739005432 740311890 742569351 745472946 745112457 745810013 745274277 745022964 745556259 745670395
3914.4 745670395 747849884 749624176 744111023 740415344 746261444 745873108 741041870 743995743
3922.1 743995743 745680389 746337738 743971329 741848907 744989548 746537094 747210312 745780182 745929642
3930.8 745929642 748884583 744999847 743011475 744723740 744689941 745645065 746229782 746129303 746660767
3939.5 746660767 746926651 748775482 748743362 743049698 742663879 744518433 746375656 748028412 745007935
3948.1 745007935 745957642 746025314 743504028 746371078 747051926 746166153 746198654 746175385 746147385 746022339
3957.8 746022339 747291183 747117310 747776642 748330154 746530228 746785736 747429810 747466965 746955948
3966.5 746955948 746407394 746620026 745951233 746104736 747674332 747768021 746947021 746618271 746609497 746960678
3976.1 746960678 746897888 747357635 747732544 747464981 747546387 747645111 747994308 747803268 747192307 746553040
3985.7 746553040 746902008 747708206 747673492 748472061 748582840 748064423 747723389 747608948 748000031 746957169
3995.4 746957169 746584396 747156677 747381592 747774887 748332291
4000.2 748332291
##END=$$ End of the data block
