##TITLE=$$ Begin of the data block
##JCAMP-DX=5.00 $$ ACD/SpecManager v 10.08
##SPECTROMETER/DATA SYSTEM=Varian
##DATE=20 Nov 2012 14:50:36
##DATA TYPE=INFRARED SPECTRUM
##DATA CLASS=XYDATA
##ORIGIN=
##OWNER=
##NPOINTS=3735
##FIRSTX=399.26403809
##LASTX=4000.35498047
##MAXX=4000.35498047
##MINX=399.26403809
##MAXY=82.56989288
##MINY=39.78812790
##XFACTOR=1.0000000000
##YFACTOR=0.000000100000000
##FIRSTY=61.78781891
##DELTAX=0.96440572
##XUNITS=1/CM
##YUNITS=TRANSMITTANCE
##XYDATA=(X++(Y..Y))
399.3 617878189 621251450 624805565 630392113 627900047 616490517 606830521 607483902 619558372
407 619558372 618987427 613873177 621302071 624736633 621460686 615606995 612746849 619290657 625532761
415.7 625532761 621540451 612692261 610188179 611291122 612531776 622117157 625573692 618469276
423.4 618469276 619424210 615268593 607618942 608269501 608261108 607941017 610401535 615713730 616520767
432.1 616520767 615596733 615927353 613944092 612277870 605770378 599981232 600209274 608272858 613600121
440.7 613600121 606466293 605264816 611617355 618627014 621690826 619891281 618383141 615653267
448.4 615653267 614188957 615933800 619643593 618151894 617657471 622923241 625068893 628016434 624131012
457.1 624131012 617430687 622018433 622473831 619009819 616996803 620186996 620663643 618050079 613357773
465.8 613357773 609737740 609269142 605402527 605433655 606889801 606231728 603541451 601019745 603480186
474.5 603480186 607503281 613799706 611974449 604819603 601617813 599864655 598181419 595356903
482.2 595356903 594467468 591774025 595494156 603368797 601880455 600737534 601812363 601009941 600799675
490.9 600799675 597982368 593841171 592500000 593545609 595881767 597602577 597509766 598040314 597346573
499.6 597346573 595692291 594994621 592305527 590552330 589490662 590055695 592774353 590817795 586131897
508.2 586131897 585763397 587384109 586110497 582687721 580500984 578176880 575055809 575140190 574588203
516.9 574588203 572411194 572307816 570517960 568906746 567574425 566684532 564253159 562922211 566055412
525.6 566055412 565351524 565179749 565289879 564021454 565926437 567800980 568074493 568154297 566896935
534.3 566896935 566053200 569202347 571236725 572103882 574218979 576950951 579902000 580277786 582081070
543 582081070 584590378 585638466 585154991 584934578 586900177 586638641 586339340 586274071 585071983 584102783
552.6 584102783 583918228 583554497 581538467 580449333 577879791 575931511 574683228 572991066 574027596
561.3 574027596 573719635 572385826 568131866 565001984 565061989 562733612 559640694 554768066 553059883
570 553059883 552364540 550523682 549555283 548744011 550498276 550825424 550805931 550339432 549932747 551216698
579.6 551216698 553484039 557332306 559625854 562461319 566248703 569817352 571980324 572958336 574288063
588.3 574288063 575386124 577303658 579083023 580068665 580870552 580831375 580751762 581585121 582443771 582635651
597.9 582635651 582164345 581789131 581490555 580183640 580124512 580860481 581138077 581341553 580992584 581362381
607.6 581362381 580843277 581053467 582177162 582237129 582716370 582503700 583434982 584983406 586014481
616.3 586014481 588408699 590466080 590305023 590025330 591543579 592734680 593710556 594953499 597133865
624.9 597133865 600013428 601990509 604097710 604541092 604619217 606181831 606735687 606531143 607123222
633.6 607123222 607702255 607962227 608745880 609937363 611932220 613739586 614603462 614137306 613173065
642.3 613173065 613957481 614721680 614423103 614654350 616605186 619773636 622172661 621941032 619830284
651 619830284 619349365 619705582 619631004 619277649 618832550 620201187 622117310 624323807 626270294 626635513
660.6 626635513 626425056 625480232 624245148 623858299 625073586 627375641 628395958 623150482 624925003
669.3 624925003 628996086 630831032 630002213 630174294 632048378 632551727 631290359 629861603 629586372
678 629586372 631101913 633637505 635690308 636476250 637264481 638884048 639493103 638357506 637853889
686.7 637853889 638450928 638616714 638533440 639563026 640997543 640818024 640189056 640504608 640873108 640116577
696.3 640116577 637925797 635302315 633502274 633172760 633273735 632859192 632788124 633532867 633852348
705 633852348 632446022 630444641 629319496 628774376 627523003 626533890 627555656 629604454 632557526
713.7 632557526 635356903 637331429 639616432 640728226 641419525 643416138 645068741 645514450 646610641
722.3 646610641 648835526 652014160 655935898 659102631 661823196 664297409 665671844 666638718 667519608
731 667519608 667168121 666893311 667757263 669358673 671629028 673737106 676701279 678554077 677969284
739.7 677969284 677557831 677362900 676447144 675203247 674730453 673648834 673833237 676171570 676653824
748.4 676653824 675205383 673536835 672486267 670551834 667846146 665483322 663062134 660816574
756.1 660816574 659515152 660071945 659638062 658273468 657468033 655286102 653406982 653281326 653260498
764.8 653260498 651856689 650781631 651173706 652619553 655711212 658584900 661495438 664955139 667439270
773.5 667439270 668770065 670331573 672749023 674736404 677442551 680782013 684158249 687921600
781.2 687921600 691696701 694838409 696795425 698268204 698988266 699588089 700622635 701883011 702821426
789.9 702821426 704856796 707873230 709914780 713026199 714948196 714846573 715483246 716528625 717192841
798.5 717192841 717535172 719226074 720949249 721833344 724097290 727425995 729158936 729491577 729450531
807.2 729450531 728876419 728696671 728120804 727596436 727871017 729274673 730815353 731394501 732143478
815.9 732143478 732931061 732977829 731029129 729744568 728941116 727315369 726717682 726534195 727429581
824.6 727429581 727721481 727801437 728408279 728222733 726791077 723312149 720378189 717388916 714770889
833.3 714770889 713990784 713527069 712982864 712374725 711648102 710009079 708104782 706406326 705186234
841.9 705186234 703157501 700550232 699032059 697417145 697342758 697655792 696435089 695736923 695567093
850.6 695567093 694192047 691708145 689708099 687450104 685412216 683916397 682098389 679968948
858.3 679968948 678314133 678279114 679133224 680602722 682152939 684040375 686281967 687835388 690296097
867 690296097 693806763 698206406 703372040 708482742 712385941 715645523 719724960 722485275 723848114
875.7 723848114 724419098 725636673 726644592 726657944 726891479 726616364 726698380 726136856 725390091 723490067
885.3 723490067 720202789 717619019 714668427 711402740 708732758 707211609 704845047 702172394
893 702172394 700304718 698782578 697107849 694288101 692744980 691477661 689741440 687737427 684668884
901.7 684668884 682404556 680835495 679545517 677643127 674998856 671942749 668748703 665663147
909.4 665663147 661925735 658536224 654695587 650511856 647055740 643308411 639724388 636526527
917.2 636526527 633510132 630490494 627475052 625030289 622581711 621162949 620319099 619046326 618792343
925.8 618792343 618549957 618563156 619566002 620359077 620615349 620622826 621473045 622787132 623235588 623946953
935.5 623946953 625203552 626052628 626913490 628243675 630769539 632818222 633432236 635122070 637370872
944.2 637370872 638004074 636776123 634837265 632676353 630278015 627231483 622991791 618537216 613960800
952.8 613960800 608975792 604064560 598589249 592630463 586341705 580163116 573927994 567210884
960.6 567210884 560390129 553295021 546952667 540265045 533500557 526561470 519166183 512453423
968.3 512453423 504855995 497374306 489531059 481734581 474233055 466871986 459632721 451746445
976 451746445 445534782 439497719 434022141 428610497 423452492 418371925 413157272 409934464 406461754
984.7 406461754 404503517 402269096 400458717 399607468 398782578 398784332 397881279 398711319 398570251 399189606
994.3 399189606 399340401 398281021 399174614 398720894 399002304 398895721 400103264 401424942 402109642
1003 402109642 403281441 402534485 402797127 402098312 401665115 400671234 400337448 401311874 400685883 401108437
1012.6 401108437 399974709 399269485 398723145 398561211 398785820 398537483 399898834 400356903 401893425
1021.3 401893425 402369080 403378906 405478973 406356201 407447548 408363266 410649376 411614037 412545319
1030 412545319 413346634 414380112 415573311 416061821 418306236 419062462 419865685 419915047 420444794 421531868
1039.6 421531868 421619072 421631050 420125389 421124306 421686897 422216759 422581558 422665787 423880920 423323174
1049.3 423323174 424561653 425365601 426759529 427904091 429506645 432924156 435218544 438363457
1057 438363457 440346870 444067078 447262917 449887085 452936859 455590591 460244484 463490791 467866936
1065.7 467866936 471375999 473902626 475471764 475245132 474141808 469434242 465407524 460918694
1073.4 460918694 457110252 453509865 449679184 448419800 447073288 447491226 446891441 447333488 448194122
1082.1 448194122 448810234 450117722 450253334 452159500 453832054 456577530 459224815 462312279 465034142
1090.7 465034142 466877670 470012207 471316757 473392715 474790459 476780167 479218140 480311813
1098.5 480311813 481717949 482086411 482812233 482640190 482777100 482462158 482935333 484192314 484194908 485321884
1108.1 485321884 485513153 486637421 487010307 488220749 491221085 493263245 495945740 497487717 499204254
1116.8 499204254 499879341 501041794 503119545 505041237 506891556 506896057 507974091 508916588 510401573
1125.5 510401573 511650429 512511101 513419113 513994255 516538620 517859230 520179329 522267113 523240967
1134.1 523240967 525075493 526117783 526929893 525998764 524768639 522381744 519993706 518242493 515271645
1142.8 515271645 512662964 509532814 507292976 504687729 502447128 499651642 496476479 494949989
1150.5 494949989 492692566 491394119 489627342 489359779 488936043 487838821 487763710 486939468 488397026
1159.2 488397026 488766518 488967361 489810829 490830536 492409782 494000397 497524757 500709190 504368324
1167.9 504368324 507461472 511453590 516208954 520493393 525691605 529820328 534939194 540106812
1175.6 540106812 545289421 550526619 555257454 560360947 565580788 571393166 575850296 580487061
1183.3 580487061 585301094 588945274 593093300 597531586 601521072 605150223 608603706 611203842
1191 611203842 613576622 615526466 616719284 617808228 618496017 619384880 620089340 620788689 621816406
1199.7 621816406 622412071 623285980 624243240 624754181 625183220 625274277 625576172 627169342 628428993
1208.4 628428993 629074593 630608063 632382545 634341011 636617393 638803902 640101929 640933914 642106628
1217.1 642106628 643104324 643986816 644708328 645869751 647536087 648676147 649313965 649546127 649705048
1225.8 649705048 649290085 648059387 647098923 646268082 645745010 645386276 645144272 645228195 645129547 644732819
1235.4 644732819 644230423 643862152 642845917 641762314 640915298 639799500 639478188 639744072 640410843
1244.1 640410843 641140900 641816177 642764587 643085327 643162613 643296509 643583221 644007492 643889999 644199677
1253.7 644199677 645526276 646986618 648035660 649215393 650235519 650270309 650153122 650414810 650374527
1262.4 650374527 649733276 649951477 651070862 652152634 653401718 654713364 656412735 657968750 658754196
1271.1 658754196 658699646 658479843 658539734 658399277 658552475 658739853 659367676 660468750 661385422 661888275
1280.7 661888275 661875458 661516876 660355225 659279938 658481064 658334122 658596954 658461380 658967209
1289.4 658967209 659624481 660134354 660296631 659919586 659158707 657835312 656118851 654252701 652967606
1298.1 652967606 652602539 653060379 653083878 652765884 652880173 652429428 651207199 649592667 648132553
1306.8 648132553 646487961 644996796 644253159 643802109 643581848 643732529 644079971 643887024 643361511
1315.4 643361511 642565689 641463165 640210724 638266106 636888924 636617622 636620903 636550751 636264801
1324.1 636264801 635818596 635075035 633691101 631413841 628718643 626000175 623445320 621558723 620422478
1332.8 620422478 619600830 619420319 619443130 619003677 617885742 616752472 615750618 614438477 613858910
1341.5 613858910 613514442 612962265 612781906 613647423 614955177 616125259 616933479 616722794 616043434
1350.2 616043434 615375366 614309578 613086472 613000832 613035622 612241554 612613029 613279800 613309097 613195152
1359.8 613195152 612589340 611633682 610623550 608740807 608129120 608299713 607847633 608129311 608268242
1368.5 608268242 608394623 609486198 609610748 609768372 609657631 608762970 607897644 608185310 609245949
1377.2 609245949 609436378 610090103 610928383 612107506 613222618 613822861 614403572 614818306 616130943
1385.8 616130943 616979752 617028809 618281479 620195236 622300262 624095001 625472870 627086563 627920609
1394.5 627920609 625676575 625694962 626049271 625543404 623659630 622417030 623014183 623036880 623443298
1403.2 623443298 624206200 623420792 621777039 621370125 620751381 618878365 617333374 616205444 615856323
1411.9 615856323 615661545 615647316 616133041 616274567 616203308 615380745 615896034 612348404 610611153 612113304
1421.5 612113304 612642479 613055038 611290703 612030373 613832359 614137573 615062447 615636940 615131569
1430.2 615131569 614201126 614816437 615211220 615519028 617365990 618495369 616348114 616851540 619778099
1438.9 619778099 620517616 620695114 621280098 621156616 621800919 621956406 622880363 623517036 623842468 623268814
1448.5 623268814 623483391 624489136 623895836 623332291 621896362 622343330 623189430 622734337 620616493
1457.2 620616493 616086922 618297806 618279495 620281982 620905952 621292152 623730087 621965027 622126236
1465.9 622126236 623642273 626356735 628377533 631500969 635975189 638710785 642028580 641817627
1473.6 641817627 646757584 650990143 653009644 655154343 658187180 661694107 664502792 667814636
1481.3 667814636 669614716 672744980 675372162 677379990 680041199 680621948 682831039 685124512
1489 685124512 686862793 686798782 689607925 692988434 694889984 697899628 699711609 697691879 699354401
1497.7 699354401 701293106 700417786 702341461 704229660 704284439 706624451 709718170 713516464 710685883
1506.4 710685883 705541534 708162155 708989334 710519638 712220306 713916092 713218460 715373840 717617187
1515.1 717617187 718816605 720848007 715454712 718498993 721319733 719642563 718067703 717356796
1522.8 717356796 721252441 723757706 722847824 722745209 725262680 724872360 724555740 726312485 726771011
1531.5 726771011 728597336 727934341 724082184 726226349 728116608 730418854 733698730 734961777
1539.2 734961777 725048523 728715515 730452118 728928452 730811920 730347748 728163834 729987411
1546.9 729987411 731555405 732732086 732125702 728619080 730033035 732086258 733766556 731398926
1554.6 731398926 729322815 734110718 738410721 734149857 733692245 724938126 728037338 729993210
1562.3 729993210 731176147 731181793 728037796 727139969 727932053 729509735 730778732 725672379 725421677
1571 725421677 726638107 726323929 725801544 726854782 727245026 718898697 719955139 721564026 721689758
1579.7 721689758 721615143 720959320 720461655 718922958 717440948 716206360 715055923 714254150 713501053
1588.4 713501053 713010941 711768341 711524734 710788040 709660034 708480148 706414719 704684219 702318420
1597 702318420 700829391 699271011 698544235 697636414 696294250 695447311 693472061 692502670 691326981
1605.7 691326981 689866486 686618423 684225159 682181854 679085693 678335495 676563187 675993805 675630112
1614.4 675630112 676484528 676209869 664547348 665012589 664631500 663592453 661807175 662093048 662509384
1623.1 662509384 657069397 657439346 658147736 658753967 655746613 652710648 652271729 650883942 650017395
1631.7 650017395 649145660 650615997 652099380 646634445 645824509 648180161 647906265 648087158 648382645
1640.4 648382645 647142181 647437210 646763840 648227463 651142349 651531754 652506866 651666565 653180237
1649.1 653180237 655078278 658883514 663828354 662654572 652182159 655887527 660349503 662926025
1656.8 662926025 665264435 667341614 669517365 672108688 675203552 676703186 675050659 676964569
1664.5 676964569 678755035 680342712 683154526 686544571 686489487 688069305 692391129 693302155 696016998
1673.2 696016998 700572586 701728973 698095398 700536270 703761063 706662369 709254303 709911423
1680.9 709911423 714393768 720742950 722628174 715767517 718077393 722584763 725125046 725618744
1688.6 725618744 727464218 728434677 730736771 733982010 736731491 741019363 743747177 737801590
1696.4 737801590 740854187 745125427 750127869 748453522 739503632 745803833 750442047 753154602
1704.1 753154602 754752579 756806717 755367889 755257492 757194672 757476501 756465759 756815948 758295135
1712.8 758295135 760238266 760517273 760642700 765163956 767886429 759968643 760810776 762665405 763298569
1721.4 763298569 763800125 763920898 763599091 764676132 765980682 766917572 768455658 770457230 769640045
1730.1 769640045 767742004 770327377 772763748 769408875 762543106 766259766 770441437 772215958
1737.8 772215958 775397797 775450668 771100922 773592758 775410233 773911209 773137360 775287933 776817169
1746.5 776817169 778024902 779580688 780136490 783724365 783405533 780793915 782954865 783839798 784684296
1755.2 784684296 786320801 785019760 785198059 787403183 789690018 793210831 792458420 791215363 793359070
1763.9 793359070 793802872 793829651 794343796 795007782 792269135 794088211 798581772 800089264 799423294
1772.5 799423294 796376572 799206085 800865555 798649750 799420929 799829788 800808182 800753708 799595947
1781.2 799595947 800709686 802563858 804289932 803475418 802913818 803916321 803805084 803173828 804262085
1789.9 804262085 805114288 805463943 803746033 802891617 806364059 807616043 806538086 807118301 808628006
1798.6 808628006 808264008 805973969 807075653 806463623 806211395 807392731 808274918 809879608 810370636
1807.3 810370636 810137482 810447617 811355972 809835434 808591003 808744659 808626480 809691391 810432816
1815.9 810432816 811533203 811644211 811626587 812601700 812630157 812874908 811843719 811935272 812553940 809676743
1825.6 809676743 810230331 812971191 815599976 816500397 811956940 811577835 813522797 813289032 812910080
1834.3 812910080 813053207 813516388 813709564 813204727 814205551 814630508 814916153 815194244 816501465
1842.9 816501465 817824020 812523041 812833862 814675522 814675674 814290771 815022049 816089859 815868225
1851.6 815868225 815878372 815711288 815709686 815444031 815205765 815463638 815314331 815568924 815569458 816065216 816034317
1862.2 816034317 816066055 816309204 815942764 816133652 815862579 816691513 815520477 813659363 815096741
1870.9 815096741 816219254 816876755 816986618 817259598 817056351 816763077 816771240 816649017 816562958 816346130
1880.6 816346130 816948853 817218781 817891769 818378830 817725449 817342987 817374649 818871613 818880692 816485138
1890.2 816485138 816868210 817796860 817802734 818724442 819208298 818117447 818398285 818351364 817822876 817638702
1899.8 817638702 817680130 817980270 817922058 818361359 818366776 818412094 818845901 819020538 819193344 819121628 818324661
1910.4 818324661 817618561 818068848 817688217 817657089 817919006 818686676 820918884 819170914 817512054
1919.1 817512054 818600159 819161072 819540024 818299408 817294846 817911987 818585815 818773422 819086075
1927.8 819086075 819199371 819385910 819472961 818951187 818739395 817961884 817602463 817596893 817912445 818584442
1937.5 818584442 818651962 818901291 818750153 819912109 820164642 817454910 817579346 818184357 818027344
1946.1 818027344 817880707 818015289 818503571 819046021 819351501 819260864 819166718 818845978 818411484 817877274
1955.8 817877274 817851715 818086166 818227768 818648376 819044647 819397278 819144974 819255600 819599762 819486465
1965.4 819486465 819385529 818644409 817993240 817959976 818325806 818807602 819488297 820151901 820120087 819729309
1975.1 819729309 819402695 819418182 819095917 818615265 818489990 818556290 818544006 818621674 819403534 819949875
1984.7 819949875 820028687 819816742 819532623 818964233 818193893 818569260 818767166 817981262 818024826 818832169
1994.3 818832169 819431229 819674225 819636230 819246140 818853531 818301849 817826538 817598114 817689667 817890320
2004 817890320 818139725 818682556 818954468 819119110 819012146 818812027 818565292 817872467 817205353 816787262
2013.6 816787262 816735992 817005157 817462616 817242737 817283783 817973251 817873077 817426453 816747437 816323929
2023.3 816323929 815893707 815322342 815336075 815503693 815916824 816308136 816331177 816053543 816120682 815791626
2032.9 815791626 814705124 814461060 814465103 814178772 813678207 813488922 814229279 815023270 815257568 815241547
2042.6 815241547 815242615 814824524 814269867 813596725 813229828 813375931 813558502 813915634 814118423 814205017
2052.2 814205017 813812256 813641586 813920822 813840179 813795776 813456955 813090363 812610474 812346802 812769470
2061.9 812769470 813479156 814423065 814459534 813935776 813860779 813692017 813489304 813492279 813232193 813004913
2071.5 813004913 813063660 813078232 813319855 813539200 813931274 814089661 814037247 814011154 813385696 813133087
2081.1 813133087 813142014 813392181 813728333 813635559 813435135 813330536 813856888 814249268 814237900 813710403
2090.8 813710403 813332977 813354187 813080521 813220596 813079910 812959595 813442307 814225082 814705505 814477997
2100.4 814477997 814553223 814612579 814536285 814164352 813875809 814009476 814207153 814651031 814588776 814478073
2110.1 814478073 814710388 814910583 814778671 814525528 814351807 814018478 814032898 814219742 814615936 814659805
2119.7 814659805 814505768 814506454 814338226 814409180 814328766 814521790 814526138 814715500 815289917 814922485 814547119
2130.3 814547119 814506912 814669189 814719162 814861908 815148849 815092392 814984741 814859543 814995117 814753342
2140 814753342 814374619 814077530 813909760 814278488 814638138 814908218 814857101 815088120 815178680 815031357
2149.6 815031357 814917526 814470367 814706268 814864883 814771194 814800949 814892502 815222626 815462570 815628586
2159.3 815628586 815527267 815656815 815556412 815191727 815147705 815078812 815289993 815720749 815931320 815927048
2168.9 815927048 816213837 816367722 816450119 816777725 817039719 817106934 816872482 816939316 816806183 816929855
2178.5 816929855 817324600 817483215 818050995 818247299 818288116 818052750 817693558 817743835 817933578 818411865
2188.2 818411865 818672104 818520737 818293228 818630753 818908157 819095306 819471054 819533539 819398956 818901749
2197.8 818901749 818874207 818879013 819042816 819623642 819814301 820057678 820129852 820271378 820358582 820412903 820274429
2208.4 820274429 820376129 820818787 820729599 821049500 821052551 821144333 821369705 821529312 821991043 821514206
2218.1 821514206 821438446 821479263 821388702 821457291 821344757 821690521 821918945 822285004 822570877 822822647
2227.7 822822647 823015976 822863159 822504807 822052841 821937408 821845932 822069855 822136612 822440491 822855988
2237.4 822855988 822998810 823408737 823174896 823100815 823045120 822739029 822446213 822216110 822465210 822724304
2247 822724304 823054352 823236771 824081268 824621506 824224472 823992081 823518906 823102722 822516098 822495728
2256.7 822495728 823064346 823666077 824037781 824053574 824411850 824511108 824505768 824050827 823721085 823468475
2266.3 823468475 822946243 823109283 823106842 823424759 823895493 824261475 824577255 824807434 824863358 824336472
2275.9 824336472 824044418 823375168 823157578 823533554 823882980 824118271 824511261 825523453 825628052
2284.6 825628052 825698929 825326004 824675903 824330292 823881683 824411926 824373093 824691772 824710159 824307785
2294.3 824307785 824797897 824715424 824776306 824461975 824366226 824192352 823724518 823206940 822421265 823147430
2303.9 823147430 823856354 824443436 824463120 824148178 824230499 823617554 823580322 822824936 822243576 822748108
2313.5 822748108 823240128 823403397 823477783 824168396 823973083 823694916 822874756 821329727 821040039 821589661
2323.2 821589661 821763535 821615143 822306290 822107010 822047806 822586746 823270340 823194351 821601181 821547089
2332.8 821547089 820923767 820895844 821974564 821734161 821462479 821479416 821487122 820513763 820019226 819174271
2342.5 819174271 818613358 819392624 819440155 819899063 819599228 819862289 821329041 821750565 821105042 820961609
2352.1 820961609 821666412 821787338 820394592 819367065 819099121 818928757 818614120 817949371 818583221
2360.8 818583221 818053360 816208038 816377029 817435379 818233414 817363586 816931992 818108063 819126282
2369.5 819126282 819206314 818582535 818844376 818992691 818922119 819246292 819774628 820044098 820062714 820049667
2379.1 820049667 819677887 819744492 819833908 820190125 820681381 820736389 820940857 820845413 820830154 820567856
2388.8 820567856 820225296 820182953 819987793 819881668 819817047 820010834 819645538 819604721 819968033 819611740
2398.4 819611740 819433517 819288940 819279022 818901367 818609543 818604736 818273849 818545151 818941650 818983154
2408.1 818983154 818452835 817887192 817708969 818015060 818412094 817973785 817641602 817361374 817308960 817355576
2417.7 817355576 817152100 817290726 817096024 816491089 815957947 816111069 816227112 815791397 815544205 815250549
2427.3 815250549 814957047 815099182 815438995 815185089 814703751 814207382 813935242 813868561 813658371 813868713
2437 813868713 813570404 813278732 813519592 813451004 813078766 812406464 812159882 812094269 811987152 811891861
2446.6 811891861 811490707 811001663 810755997 810764999 810906525 811206360 810686111 809993515 809684906 809111328
2456.3 809111328 809193115 809691010 809547424 809127655 809115448 808874512 808648300 808711700 808360825 807856750
2465.9 807856750 807297668 807164688 807290573 807554626 807684937 807163315 806790619 806654968 806504440 806095886
2475.6 806095886 805901413 805821686 805643997 805536346 805445709 805821228 805412216 804814682 804809799 804439163
2485.2 804439163 803990860 803755417 803807068 803644638 803790512 803956299 803661957 803549576 803636093 803965607
2494.8 803965607 803659821 803253632 803224106 803044586 802605286 802020493 801914597 802073059 802234726 801934509
2504.5 801934509 801946793 802229156 801993713 801908798 801547012 801121979 800699463 800609741 800660782 800330734
2514.1 800330734 800526810 800631180 800772018 801228714 801312790 800776215 800006104 799691467 799634323 799425201
2523.8 799425201 798957825 799023819 799441223 799508209 799344025 799357758 799556961 798880005 797795868 797164917
2533.4 797164917 797103882 797300568 797277298 797137680 797065659 797352371 797404099 797146988 796843033 796434097
2543.1 796434097 796022797 795490799 794950027 794477844 794366455 794526291 795070724 795405807 794913559 794393311
2552.7 794393311 793972778 793496399 792796936 792493362 792524796 792262115 792302475 792810669 793107300 792640915
2562.4 792640915 792283173 792076035 791560440 790792999 790103073 790020752 790108490 790274658 789996338 789926376
2572 789926376 790274124 790294724 790462418 790103302 789404068 788647919 788129425 787815094 787448273 787651215
2581.6 787651215 787693176 787652740 787532730 787341080 787443924 787586823 787278671 786371994 785818100 785478973
2591.3 785478973 785569229 785650558 785715866 786312866 786207047 785949783 785848160 785567551 785050583 784691620
2600.9 784691620 784867859 784737778 784217453 783681107 783482666 783351440 783938065 784395065 783594666 783272781
2610.6 783272781 782850723 781968307 781499710 781467285 781478119 781356354 781123123 780526810 780488129 780258789
2620.2 780258789 779573669 779405136 779377441 779228592 778701401 778271027 777918472 777569275 777382660 777278137
2629.9 777278137 777141495 776661911 776322861 775959473 775577087 775048447 774160538 773873672 774167709 773803635
2639.5 773803635 772888260 772761688 772657166 772002411 771590195 771436996 770852127 769739304 769569855
2648.2 769569855 769894257 769550552 769160309 768860855 768493652 768339157 768000412 767436676 767279816 766819077
2657.8 766819077 766241531 765850296 765505600 765475922 765102158 764831314 764709625 764296036 763613739 763030701
2667.5 763030701 762920914 762498169 762168427 761970673 761531143 761288452 761183395 761049423 760866547 760863800
2677.1 760863800 760593033 760066910 759579010 758903351 758375778 758274994 758306198 758053055 757775269 757758331
2686.8 757758331 757567062 756794281 756394196 756404266 755814514 755343399 755047836 754509888 754096451 754113693
2696.4 754113693 754122772 753844376 753672409 753090820 752226028 751752625 751769791 751759872 751315308 750721207
2706 750721207 750609589 750893784 750354080 749797897 749445038 748690720 748092422 747574310 747432327 747189102
2715.7 747189102 746891174 746801147 746639404 746532288 746184235 745891571 745733261 745646744 745257339 744739914
2725.3 744739914 744127579 743525467 743617172 743318710 743004913 742752380 742386551 742426376 742017593 741759949
2735 741759949 741791687 741528168 740835342 740351868 740490494 740358200 739962158 739458771 739227066 739197922
2744.6 739197922 738925171 738658142 738644104 738471680 737954636 737954483 737989807 737597656 737074203 736655884
2754.3 736655884 736712875 736837311 736322021 735609589 735723648 735657959 735521774 735849762 735613327 735070419
2763.9 735070419 734471741 734116974 733933716 733715820 733306046 733022614 733538284 733609619 733006363 732647934
2773.5 732647934 732625198 732303009 731843796 731657181 731126938 730490494 729978409 729813843 729750595 729539490
2783.2 729539490 729204178 728665237 728684769 728898239 728593292 727755280 727108688 726765366 726300049 725703659
2792.8 725703659 725002975 725030441 725138245 724890137 724394379 723799286 723291779 721953430 720856247
2801.5 720856247 720571060 720600052 720057526 718970261 718642273 718192673 717958984 717848129 716808319
2810.2 716808319 715671844 714940796 714223175 713183670 712335129 711804733 711545486 711015701 710168304
2818.9 710168304 709529266 708784485 708255920 707690201 707068176 706083450 704663773 703721085 702687759
2827.6 702687759 701938705 701755295 701313400 700497513 699622192 698903732 697499466 695612030 694521484
2836.2 694521484 693730774 692584686 691589661 690757065 689890594 688817749 687442017 686005325 684379425
2844.9 684379425 682615356 681012726 679446182 677465210 675715561 674830933 673991013 672596130 671006699
2853.6 671006699 669990082 669006653 667955017 667245178 666429901 665859070 665258865 664509659 663660812
2862.3 663660812 662579498 661729355 660796204 659705811 658431702 656829453 655042419 653116074 651165314
2870.9 651165314 649582520 648585739 647152405 645123138 643580856 642349167 640652237 638676949
2878.7 638676949 637219772 636340065 634901352 633039780 631944275 631233292 630526505 629599152 628790016
2887.3 628790016 628355141 627525864 626917191 626457291 625826721 625248032 624991646 625405464 625208893 624372673
2897 624372673 623877144 623817329 623542252 623019562 622614098 621832275 621535568 621498299 620960350 620243530
2906.6 620243530 619716911 619498177 618795204 617833672 616533699 615232887 614025764 612446976 611015434
2915.3 611015434 609343719 608047371 607117538 605934639 604242935 602182274 601056328 600232735 599324074
2924 599324074 598234215 597285843 597090912 596749763 596498871 596567726 596758270 596963768 597758560 598902893
2933.6 598902893 599170341 599669762 601220436 603002014 604085617 605313110 607660141 609875031 611720428
2942.3 611720428 613713188 615683479 617657890 619636536 621384964 622756577 624257736 626241455
2950 626241455 628364487 630533409 632434235 633976707 635549812 637358398 639396248 641063461 642670746
2958.7 642670746 644176025 645696793 647706985 649345779 650794449 652133102 653874664 655907974
2966.4 655907974 657640762 659326477 660448380 661660538 662761078 663902206 665337372 666971970
2974.1 666971970 668707733 669503174 670890656 672586670 673894348 675023575 675897446 677069092 677185440
2982.8 677185440 677531052 678878937 680198746 681327133 681914825 682559662 683433533 684674454 685455856
2991.5 685455856 685709839 685793610 685687637 686106567 686815414 687509232 687679062 687802582 687726212 687690201
3001.1 687690201 688245697 688236618 687824707 687367706 687552872 687623138 687114182 686843338 686392365 686227570
3010.8 686227570 686320877 686224136 685661850 685062943 684351654 683760529 683262177 682089310 682111740 682204514
3020.4 682204514 681261520 680395966 679633713 679411011 678668976 677329025 676535645 676723633 676256180
3029.1 676256180 674907837 674313507 673485489 672775269 672050400 671000443 670150757 669124756 668293610
3037.8 668293610 667493210 666765137 666136780 665283051 664062271 662933960 661945572 661161957 660867615
3046.5 660867615 660022430 658874969 657577133 656519394 655909653 654902725 654123306 653610306 652915192
3055.1 652915192 651811066 650546951 649353180 648374710 647253418 645916138 645453110 644988480 644198532
3063.8 644198532 643066559 641927643 641083679 639693565 638619156 637644501 636841965 635936127 634620514
3072.5 634620514 633761940 632870598 632160530 631224136 629905586 628969383 628453217 627558937 626451874
3081.2 626451874 625687332 624243011 623392448 623041534 622090111 621312370 620270309 619017448 617699623
3089.9 617699623 616314812 615141068 614552879 613947449 613031998 612279015 611039314 610064850 609335098
3098.5 609335098 608383713 607466965 606067123 604278107 603031197 602729645 602188072 601429520 600436172
3107.2 600436172 599430885 599226494 598495522 597290230 596162949 594932442 593833961 592994080 592216110
3115.9 592216110 591339417 590519104 589319954 588207779 587507515 586729851 585581360 584397926 583690262
3124.6 583690262 582941971 582005157 580867882 580033836 579327965 578030510 577045364 576707726 575780411
3133.3 575780411 573956490 572925835 572318497 571566620 571304665 570639496 569554443 568466148 567237015
3141.9 567237015 565833321 564856224 564282265 563492584 562937012 562357979 561671982 560772057 559597855
3150.6 559597855 558771858 558026886 556973038 555840530 554860840 553658791 552588196 551950645 551355095
3159.3 551355095 550773735 550184517 549512444 548688507 547874489 546833458 545680847 544642792 543971138
3168 543971138 543205070 541771164 541085434 540692406 539952202 539280357 538671799 538338623 537538605 536307983
3177.6 536307983 535097961 534425087 533767204 532879753 532000198 530657730 530023193 529682159 529406090
3186.3 529406090 528940811 527627373 526798592 525894547 525081596 524547348 523662338 522792702 521886215
3195 521886215 521425476 521137810 520386276 519514771 518894806 518165169 517646027 517306519 516594009 515909195
3204.6 515909195 514646873 513545494 513063736 512227821 511594849 511471901 511173820 510230484 509474297
3213.3 509474297 508499374 507294197 507154503 506975937 506590004 506061020 504779282 503901596 503397026
3222 503397026 502503510 501964645 501607323 500761032 500234222 500023727 499540100 498923950 498073006 497377548
3231.6 497377548 497243652 496638641 495801620 495680580 495164032 494180908 493328323 492647285 492273941 492032776
3241.3 492032776 491814194 491277046 490756416 490017548 489164314 488965302 488702965 487840233 486723633
3249.9 486723633 486187477 485822716 485396423 485131836 484586754 484319344 484125748 483634872 482926674 482090607
3259.6 482090607 481279144 480871468 481099930 480638771 479620285 479363861 479394493 478865929 478475609 478317986
3269.2 478317986 477680511 477205734 476800117 476393433 475869179 475272293 474957771 474099045 473705750 473889580
3278.9 473889580 473230362 472290688 472089043 472245178 471923256 471468430 470951996 470316315 469952087 469643135
3288.5 469643135 469027977 468536148 468513145 468138542 467495155 467126389 466878815 466472778 465946808 465509949
3298.2 465509949 464742851 464172821 463913193 463395004 463145905 462852821 462099991 461306458 461166992 461729813
3307.8 461729813 461258850 459943275 459496689 459392586 458798752 457632141 457359962 457632942 456773758
3316.5 456773758 456218948 455900993 455406723 454815292 453601456 452895050 452364502 452152367 451972237
3325.2 451972237 450871086 450237465 449759026 448960228 448401070 447732391 447144012 447060852 446551476 445400200
3334.8 445400200 444945107 444475632 443486824 443135719 442717094 441625481 440883369 440655899 440459366
3343.5 440459366 439813843 438872871 438573151 438180885 437206497 436193657 435278397 434771690 434352455
3352.2 434352455 433745155 432961388 432134323 431330338 430599136 429848595 429279289 429426727 428987274 427976608
3361.8 427976608 427164078 426223946 425592270 424927521 424447327 424384384 423712387 422216606 421147194
3370.5 421147194 420823669 420183334 419269066 418368263 418001823 417728500 416940002 416460915 416015701 415489044
3380.1 415489044 414969597 414414558 414295769 414134979 413369827 412803307 412652550 412558899 412469025 411475906
3389.8 411475906 410682526 410691986 409907799 409113960 409029770 409161797 408779945 407771263 407315445 407233047
3399.4 407233047 407054253 406710663 405990982 405325890 405146103 405275078 405061455 404343719 403863182 403577271
3409.1 403577271 403553543 403855286 403821678 403449097 402582436 402217941 402629509 402664185 402416039 402266884
3418.7 402266884 402381058 401675377 400930824 400992851 400880699 401037750 400891724 400825691 401392212 401363068
3428.3 401363068 400738335 400465012 400704308 400886536 400750771 400553856 400872116 401197968 401643753 402042503
3438 402042503 401851387 401770668 401735954 402448807 402835464 402540474 402671165 403249931 404297409 403511658
3447.6 403511658 403023262 403645744 403915329 404681358 405202141 405577698 405575829 405850677 406611900 407128601
3457.3 407128601 407513161 407349167 407829704 408543243 408863983 408997765 409379272 410049324 410520973 411372452
3466.9 411372452 411568680 412010384 412507629 412183228 412837906 413683357 414154205 414572105 415023499 415583801
3476.6 415583801 416049156 416715584 417756233 418866653 419718933 420000420 419419022 419574471 420237160
3485.2 420237160 421070137 422430573 422765923 422771187 423453674 424323540 424876976 425433426 426453018 427376633
3494.9 427376633 427933121 427813835 428006821 428996811 430095406 430779648 431760216 433169403 433393097
3503.6 433393097 433457222 433736916 433943481 434523354 435797424 436543694 436186104 437258492 438521347
3512.2 438521347 439416466 440122910 440680618 441739120 441943893 442272263 443229103 443783073 444811935
3520.9 444811935 446774750 447357941 446154861 446927185 448642540 449513969 449810486 450414085 450975113
3529.6 450975113 451921272 453351479 454314728 454987030 455235901 456977806 457986183 457307281 458176613
3538.3 458176613 458840675 459799728 460587234 461521111 463007088 464690971 465627823 465163002 466671295
3547 466671295 466732635 467449570 469161110 470607834 472911644 472178535 472853546 474067001 475178795
3555.6 475178795 477150040 477570496 479072342 480237465 480411072 480399818 482934608 485052948 485907898
3564.3 485907898 491407509 492174988 490244293 490086632 489079933 492698021 494484024 495953255 497521973
3573 497521973 498889008 499971313 501057434 503492241 503642159 505836334 508072128 508457298 510226822
3581.7 510226822 512157173 513673706 514355049 518927650 521487160 519685287 520931053 518911095
3589.4 518911095 522139816 526398239 530009155 531377945 532030449 536310539 534636345 536962624
3597.1 536962624 540736313 540149231 542822609 543812943 544806442 546768723 548357849 550217476 553743439
3605.8 553743439 557283707 555218964 559102821 558283043 557321701 567429619 569143715 565514488
3613.5 565514488 569778900 568982086 573263435 577916679 577323265 579046860 577396202 577879066 581367264
3622.2 581367264 583909912 585735855 588264427 591290855 594003296 601774178 602419472 587179298
3629.9 587179298 591419983 597713852 604932747 605508575 601446991 603959198 607626038 610561028
3637.6 610561028 610928078 612269363 615288773 618031044 618305931 617474556 619745140 624318047 632716560
3646.3 632716560 632620049 626755638 632756500 632181740 627472878 625784607 631520462 635660286 640068817
3655 640068817 646357651 635726433 636476822 642401428 643556061 645120316 646586456 648955460 649227524
3663.6 649227524 649893570 651191940 651992493 657198029 660279465 659600754 659938660 651367493 653894196
3672.3 653894196 664121170 674942627 674512863 652083435 655014648 663920822 669064102 665945816
3680 665945816 665318832 668487473 670696030 672556992 673031235 673294754 678025055 685726166 675429459
3688.7 675429459 670701675 681381607 674739838 673870316 679876938 679892883 681933365 682558441 682328339
3697.4 682328339 684149933 684651642 687886505 691324921 685024338 681846848 686494293 688255157
3705.1 688255157 688933029 689487381 692472610 698349304 691149292 695223465 700771179 683626633
3712.8 683626633 688062057 692969971 692447662 693053513 696202316 698389053 694636230 695792923 703310776
3721.5 703310776 699397964 693092499 699626694 701600113 700620117 696809692 697075195 701937027 703275681
3730.2 703275681 710742874 708036804 698329926 709981308 712394028 700330658 699174576 701140289
3737.9 701140289 701686325 704708786 708499298 704305420 708460541 723313217 710212555 690471878
3745.6 690471878 703608322 710914459 719079742 715730133 702454681 716928253 709888153 699089813
3753.3 699089813 705744781 711864395 716982498 710478439 711988831 718562317 708821106 706179581
3761 706179581 711363297 713117065 714056320 719084320 716124649 710260849 714621353 721362305 722304916
3769.7 722304916 711125259 712678680 716313553 716282043 717369308 717275085 718118362 718936386 722592087
3778.4 722592087 722616119 713030319 715765533 718496780 719779129 722815018 719307251 717802582 719296722
3787.1 719296722 720404968 721235352 720933075 721384430 721104736 721585236 721250076 722675476 727954865
3795.8 727954865 724227753 718537979 720840988 726887512 735710220 728589935 714930496 717925644
3803.5 717925644 721367569 727847519 735303879 722102661 715191422 721636200 724542236 725354309
3811.2 725354309 726211166 726318283 728478851 735518875 733385696 716212692 723000946 731298828
3818.9 731298828 737586212 739677963 716762543 718180847 724706345 727123871 730747528 731851807
3826.6 731851807 726385040 725613556 727997437 733061218 735752411 724513168 727782745 736697159
3834.3 736697159 729234772 729521866 740863800 729735794 722896652 733311768 726811142 726070251
3842.1 726070251 734773026 732316742 726822205 728977814 730585861 731332703 734259872 733308487 736373672
3850.7 736373672 744857712 736096649 736259918 717790680 719376144 733123322 731982727 729734955
3858.4 729734955 732516479 735098038 738500443 732304687 732685699 741817322 733802338 726025772
3866.2 726025772 731284485 738774109 748453140 739117661 725911789 729849548 736912537 741600571
3873.9 741600571 729753342 730676804 735383224 734779892 737863770 745342484 739442825 727981186
3881.6 727981186 735333633 737467651 739502716 746169968 729226303 729748993 734644165 735897369
3889.3 735897369 742341156 742234879 731336365 732411194 736069260 734576340 736195984 737660522
3897 737660522 741106644 743865509 731355515 737477493 740603485 733573837 740465851 737653580
3904.7 737653580 734693756 734990921 735393677 737990112 737669220 737629547 737854919 738303757 738493042
3913.4 738493042 737716522 739508133 743207550 739520111 734576797 739950867 739779587 734379120 737566376
3922.1 737566376 740618439 742642517 739628906 734767456 736507874 738858414 740910645 739554672
3929.8 739554672 738909988 741093369 737560730 736353302 738203812 737868576 738055420 739156342 739857788
3938.5 739857788 739758377 739135513 740889969 742704010 737764893 736573868 738162384 739231644 741335068
3947.2 741335068 738979721 740558014 741856003 738404160 740173645 740168457 739205170 739873734 740052032
3955.8 740052032 739920731 739256058 740310440 740163803 740699234 740980148 739173965 740193710 740605392
3964.5 740605392 739964523 740181580 740597916 741105728 740415039 739985275 740817795 740554810 739865341 740753403
3974.2 740753403 741473465 741144867 740592957 740990677 741381454 740961227 741236038 741421204 741321259 741194077
3983.8 741194077 741267319 741747665 742015457 741928482 741483841 741568985 741511383 741143570 741020432 741094360
3993.5 741094360 741362534 741196060 741275101 741512527 741820526 741797791 740941238
4000.2 740941238
##END=$$ End of the data block
