##TITLE=$$ Begin of the data block
##JCAMP-DX=5.00 $$ ACD/SpecManager v 10.08
##SPECTROMETER/DATA SYSTEM=Varian
##DATE=20 Nov 2012 14:50:32
##DATA TYPE=INFRARED SPECTRUM
##DATA CLASS=XYDATA
##ORIGIN=
##OWNER=
##NPOINTS=3735
##FIRSTX=399.26403809
##LASTX=4000.35498047
##MAXX=4000.35498047
##MINX=399.26403809
##MAXY=82.70000458
##MINY=39.77000809
##XFACTOR=1.0000000000
##YFACTOR=0.000000100000000
##FIRSTY=61.63778305
##DELTAX=0.96440572
##XUNITS=1/CM
##YUNITS=TRANSMITTANCE
##XYDATA=(X++(Y..Y))
399.3F16377831Q414077P458191m737854r235306k037544j880340n127411K357444
407F11589088O918183k25487J355782m66843o89774j3465m448700P1029J22147j635018
416.6F12576942m677658p493477P703972K840271O134415P675781r06868o721000q141976
425.3F08990402m367027L080597N019188n33791l121147J801567K416382j305809J71509
434F12151871K437553k526550n099335J519623J612320n75028L225403M637375j131592
442.7F16251640k587356J794586K97012p9384J386567j440545m80957k60543J931190
451.3F16812210M416466P63092j614075J173630P480965r06563j1219597M799805k857628
460F18848305m664727N017357J151162j758309k712097m367561K551307K225304r463234
$$ y = [616377831, 624791908, 632250099, 627512245, 618276939, 616239395, 614359055, 609231644, 611589088, 618507271, 618281784, 619637566, 619170723, 618480949, 618467484, 614018784, 614089813, 614211960, 612576942, 607899284, 600405807, 608109779, 610950050, 617084465, 624760246, 623853378, 617132378, 608990402, 604623375, 607703972, 612723160, 612189369, 609068222, 610869789, 613286171, 611980362, 612151871, 614589424, 612062874, 606963539, 608483162, 610095482, 609520454, 612745857, 617383232, 616251640, 613664284, 615458870, 615755882, 615676498, 617063065, 615622520, 615141563, 614881020, 616812210, 621228676, 621991768, 620377693, 621551323, 629032288, 628125725, 616906128, 621705933, 618848305, 614183578, 619200935, 620352097, 618593788, 615881691, 611514130, 614065437, 616290741, 606827507]
468.7F06827507n674324M283829N588608Q13827l073730l484574o14128N745430l950310
477.4F06462135p682953j340141m057159j780930K837906J884041P16591N852279K490197
486.1F05381966l437500J646614J511268k276878j429482q53691o080703l425789M680404
494.7E95716209J262894P92580J236419r51919k8916r67292k068215l805847r48639
503.4E90237274r07974j110725P42073O92939L46337j217003j221733k572365k579804
512.1E82409019N2376k6283j447029k443352k125892k226296r80148j035118j992608
520.8E70184669j668930l11851J227341m42238j728478k270889m50287M27857p81022
529.5E64186172P71256K207565l31459j235313L97377K79007K099266K009125J421051
$$ y = [606827507, 601153183, 605437012, 611025620, 611839447, 608765717, 605281143, 604667015, 610412445, 606462135, 598779182, 597439041, 593381882, 591600952, 594438858, 596322899, 597039490, 602891769, 605381966, 601944466, 603591080, 605102348, 602825470, 601395988, 600542297, 594461594, 591035805, 595716209, 596979103, 597771683, 599008102, 598056183, 598027267, 597059975, 594991760, 591185913, 590237274, 589329300, 588218575, 588960648, 589653587, 589999924, 588782921, 587561188, 584988823, 582409019, 582461395, 582435112, 580988083, 578544731, 576418839, 574192543, 573212395, 572177277, 570184669, 568515739, 568203888, 569431229, 568988991, 567260513, 564989624, 564539337, 564967194, 564186172, 564957428, 567164993, 566833534, 565598221, 565995598, 566274605, 568373871, 570382996, 571804047]
538.1E71804047K643165K457466L445511K268677J190109O87371J29356N11360J55411
546.8E85292473L18642n61600j80741L16048K67258L49540p96966q84705k313766j715622
556.5E80090561j612244k755851l25890l08876j027756j094818j413841k697411k104912
565.1E66748962j166801l797684l095588l413697k974701q80088p70951o4926J11427
573.8E50695953K59781l29361l36685p68013o76117J340790L629341M370842L957977
582.5E62144508L265267K238006K948876K022476M43497j47248J811219L305740J472359
591.2E79504700M75998J40037P81861M64744K83737R70955j41373n44586j303558q32710
600.8E79799805P17010L67661M23774M24118q03070j454506K37122J544685R77898
$$ y = [571804047, 574447212, 576904678, 580350189, 582618866, 583808975, 584496346, 584625702, 585137062, 585292473, 585611115, 585049515, 584868774, 585184822, 585452080, 585801620, 585004654, 584119949, 581806183, 580090561, 578478317, 575722466, 575396576, 575087700, 574059944, 572965126, 571551285, 568853874, 566748962, 565582161, 561784477, 558688889, 555275192, 552300491, 551420403, 550649452, 550584526, 550695953, 550955734, 550626373, 550289688, 549521675, 548845558, 550186348, 553815689, 558186531, 562144508, 565409775, 567647781, 570596657, 572619133, 573062630, 572915382, 574726601, 578032341, 579504700, 579980698, 580120735, 580902596, 581367340, 581651077, 582622032, 582480659, 581936073, 580632515, 579799805, 580516815, 580884476, 581308250, 581732368, 580929298, 579474792, 579711914, 581256599, 582234497]
609.5E82234497N57289M25301k92702q0948J186295J354751J290284J139373J180687
618.2E88994827J153641J733131J971512J071434O45523K89116K296524K873383J611595
626.9F02640686J296883l74527l12882J416588K838821K012635L56178J907J88218
635.5F10064507J414909P77359J83983J585846Q38852j588135r04198J128121J817512
644.2F15318756J591454R7389P92465K023048O37208m78211j51176R39293J448516
652.9F22218742M56086j142769r60465J44921J292457K547302K203064Q38280m20761
661.6F27176857j418114j550407Q278Q36220J533546M62723p769699N478439N343399
670.3F30101242J330948o16112k41470N44891L06244L10326m42009N16433J903077
$$ y = [582234497, 582791786, 583217087, 582924385, 582843437, 584029732, 585384483, 586674767, 587814140, 588994827, 590148468, 591881599, 593853111, 594924545, 595570068, 595859184, 598155708, 601029091, 602640686, 603937569, 603563042, 603250160, 604666748, 607505569, 609518204, 609874382, 609876289, 610064507, 611479416, 612256775, 612440758, 614026604, 614865456, 613277321, 612373123, 613501244, 615318756, 616910210, 617007599, 617800064, 619823112, 620460320, 619982109, 619830933, 620770226, 622218742, 622674828, 621532059, 620571594, 620716515, 622008972, 624556274, 626759338, 627597618, 627176857, 625758743, 624208336, 624216614, 625052834, 626586380, 627049103, 619279404, 624757843, 630101242, 631432190, 630816078, 630574608, 631119499, 631425743, 631736069, 631294060, 631810493, 633713570]
678.9F33713570J784935K616157J814690N1689Q6479Q21915p08618j140519j51252
687.6F38889046l46108L9215O0654O77643N75218J227455J809006l30048j233978k667313
697.3F38700790l131637j224137J71967q2626o48690M63791M6807p73888r37576q90389
706.9F31694412q66203j488953j115646m39644J047936J684455K143784K610588K151108
715.6F37421837K703743J216583K37732R55658J508102J964341R94644J397323L505173
724.3F51905136M528809L788223K829208J718521Q14744P03811R72748J449585J110916
733F69821701L76358N02014J844177L373948L308487O06155o49719M36859q12454j550370
742.6F77257156j87606j29471p98569J43509Q84705k90452j670837j069870j51672
$$ y = [633713570, 635498505, 638114662, 639929352, 639981041, 640067520, 640889435, 640180817, 639040298, 638889046, 638542938, 638582153, 638642807, 639320450, 639895668, 641123123, 642932129, 642602081, 641368103, 638700790, 635569153, 634345016, 634516983, 634434357, 633785667, 634249458, 634296265, 633522377, 632584801, 631694412, 630828209, 629339256, 628223610, 627783966, 628831902, 630516357, 632660141, 635270729, 637421837, 640125580, 641342163, 641579895, 642535553, 644043655, 646007996, 647002640, 648399963, 651905136, 656433945, 660222168, 663051376, 664769897, 665584641, 666288452, 667261200, 668710785, 669821701, 670198059, 670700073, 672544250, 675918198, 679226685, 679832840, 679183121, 679619980, 678807526, 677257156, 677069550, 676940079, 676141510, 676285019, 677169724, 676879272, 675208435, 674138565, 673986893]
751.3F73986893j597596l228759l919220k071991q01850j531295k13242R0561l27683
760F60385818j616516k656173q18405r88541j393738o03714k31628O11343J390533
768.6F54078979K392273K501679K780914L738556K618561P50732J705246K641602K242203
777.3F75450745L043441L547287L970871L426667K704086K456360K476806J913834
785F98990097O27213J576004J246414R43603N67322J255035L036499K489243L384934
793.7G14116364J385574L38821J402054K05002k83356l23715K823105L595352R60617
802.4G24219818J404266K831574K099228P21969J09711o59103p00073j260300r2545
811.1G28674545O42243J89819J008682J089783J527557M31519j40915j165771k303544
$$ y = [673986893, 672389297, 669160538, 665241318, 663169327, 662367477, 660836182, 660622940, 660713501, 660385818, 658769302, 656113129, 655294724, 654306183, 652912445, 652308731, 652077103, 652688446, 654078979, 656471252, 658972931, 661753845, 665492401, 668110962, 668861694, 670566940, 673208542, 675450745, 678494186, 682041473, 686012344, 689439011, 692143097, 694599457, 697076263, 698990097, 699617310, 701193314, 702439728, 703383331, 703950653, 705205688, 708242187, 710731430, 714116364, 715501938, 715840759, 717242813, 717447815, 717164459, 716840744, 719663849, 723259201, 724219818, 725624084, 728455658, 730554886, 731276855, 731386566, 730727463, 730027390, 728767090, 728674545, 729316788, 729506607, 730515289, 731605072, 733132629, 733564148, 733423233, 732257462, 729953918]
819.7G29953918p77587p53251j037368n4703J234360N64041M9896l93906j439743j144409
829.4G26201248k397537k325134k332764k963181k044448j300812P4692R8114q31681
838.1G12178497j099929j857148k823562k032700j094818k251740k899780j317596
845.8F96801224M99878P5836o89011o07834l66211q46481j602859j942826l106384
854.5F88215332k223434j608048k297134j866455n94635J004791N95093Q61282N74722
863.1F82661514O27976K886123K322083K609253L614426M438018N326004M265442L814697
871.8G12565536M027710L758316K253037K121124J323929N79376O68564k42920k59399
880.5G26795273l89862O34765j03607j560669j904373k770157k575912k873154k990799
$$ y = [729953918, 729176331, 728423080, 727385712, 727331009, 728565369, 729129410, 729179306, 728785400, 727345657, 726201248, 723803711, 721478577, 719145813, 716182632, 714138184, 712837372, 712912064, 713010178, 712178497, 711078568, 709221420, 706397858, 704365158, 703270340, 701018600, 698118820, 696801224, 697301102, 697376938, 696687927, 696080093, 695713882, 694867401, 693264542, 691321716, 688215332, 685991898, 684383850, 682086716, 680220261, 679625626, 680630417, 681225510, 682086792, 682661514, 683289490, 686175613, 688497696, 691106949, 694721375, 699159393, 704485397, 708750839, 712565536, 716593246, 720351562, 722604599, 724725723, 726049652, 726629028, 727297592, 727054672, 726795273, 726405411, 727040176, 726936569, 725375900, 723471527, 720701370, 718125458, 715252304, 712261505]
889.2G12261505k922287k898483k497711j509171r67178k116623k588349k008361j362610
897.9F93390732k029877k746963k479172k255554k000733k015915j289825j529389
905.6F77043304k722549k485809k304383l140640m163361l525390k758255l759003
913.3F52183914m122391l795013l614578l767624l986244l062477k324791k395668
921F25115128k945443j966209n02281k37198o867q02002n62438Q64181J519966M76074
930.7F20952911k09274J156235J375503N27420K69280R44786J106148O39076J085472
939.3F27847557K365990K669906J272393J477050J640931M42466l76663j893692k724419
948F32721519k909011l332253l732376m775619m926148m771652n103150n282096n324555
$$ y = [712261505, 709339218, 706440735, 703943024, 702433853, 701466675, 699350052, 696761703, 694753342, 693390732, 691360855, 688613892, 686134720, 683879166, 681878433, 679862518, 678572693, 677043304, 674320755, 671834946, 669530563, 666389923, 662226562, 658701172, 655942917, 652183914, 648061523, 644266510, 640651932, 636884308, 632898064, 629835587, 627510796, 625115128, 622169685, 620203476, 619701195, 619463997, 619457130, 618655128, 618092690, 618956871, 620476837, 620952911, 620743637, 621899872, 623275375, 623802795, 624072075, 625016861, 626123009, 626762085, 627847557, 630213547, 632883453, 634155846, 635632896, 637273827, 637716293, 637339630, 635445938, 632721519, 629812508, 626480255, 622747879, 617972260, 613046112, 608274460, 603171310, 597889214, 592564659]
956.7E92564659o140137o991767o782990n926018n773430p025833o748924o542816
964.4E40632744o580811o882324p714386p583580p301674o959038q186302p468567
972.1D81956062p292823p469635p377701q398934n857734n500527n539055n868721
979.8D28650932n973968n423355n009766k685280l311615j728439j682663j970291
987.6D00865555n41496q82721q56476q58155O43921n00869m6959j22719M92401J476784
997.2C99669266m13819J018715K30980J836472J190185n10864J77765r87511O85807
1005.9D02896996o49529l85284n43099m06914M40560n14298L47710j378555K34642
1014.6D00042229j72081l40195L48129r36813P86171N51872J374016N37720J225929
$$ y = [592564659, 586424522, 579432755, 572649765, 566723747, 560950317, 553924484, 547175560, 540632744, 534051933, 527169609, 519455223, 511871643, 504569969, 497610931, 489424629, 481956062, 474663239, 467193604, 459815903, 451416969, 445559235, 440058708, 434519653, 428650932, 422676964, 417253609, 412243843, 409558563, 406246948, 404518509, 402835846, 400865555, 400324059, 399441338, 398584862, 397726707, 398370628, 397869759, 397822800, 397700081, 398192482, 399669266, 399255447, 400274162, 400505142, 402341614, 403531799, 403020935, 403198700, 402211189, 402896996, 402247467, 401862183, 401319084, 400912170, 401352730, 400838432, 401186142, 399807587, 400042229, 399870148, 399529953, 399878082, 398941269, 399727440, 400279312, 401653328, 402191048, 403416977]
1023.2D03416977J247482M32739J573983J221542K602692Q72650J591301J350365L38554
1031.9D14648285J706009J123543J333198J74713J173592K3765M02108P46879j061630
1040.6D20270462L90625Q1368J615448L22227k16904l77884n04036J280900L60870
1049.3D23223076J626663O04553K107048J743660O86608K913398K475892K964477J738014
1058D40083389K722588K698212L824043L997955K345085L964272L755226N153923L191986
1066.6D71736679K326927J417160l77121r46273m659615m685783n255585l192825k973099
1075.3D53390465l555870j322632k067070P40890j95350J2359P45392J204491J672363
1084D50625038r6359K301750K121849J854553J527863L607368L362618J359863L088608
$$ y = [403416977, 404664459, 405097198, 406671181, 407892723, 410495415, 411368065, 412959366, 414309731, 414648285, 416354294, 417477837, 418811035, 418985748, 420159340, 420183105, 420585213, 421332092, 420270462, 420661087, 420742455, 422357903, 422680130, 422463226, 422085342, 421581306, 422862206, 423223076, 424849739, 425454292, 427561340, 429305000, 429991608, 432905006, 435380898, 438345375, 440083389, 442805977, 445504189, 449328232, 453326187, 455671272, 459635544, 463390770, 468544693, 471736679, 474063606, 475480766, 475103645, 474157372, 469497757, 464811974, 459556389, 456363564, 453390465, 449834595, 448511963, 446444893, 447185783, 446990433, 447002792, 447748184, 448952675, 450625038, 450528679, 452830429, 454952278, 456806831, 458334694, 461942062, 465304680, 466664543, 469753151]
1092.7D69753151J706467K387619J452255J674652J538315N66330K021141J073303
1100.4D82173233J342087k52609K13203k17018o91528Q82873J66016J125869O96831
1109.1D85438957J921463J425553J349945K405243J874542K279320J146049K053223
1116.8D99894295Q48922J146965J849900R88731J491318M13093J395188O13670J323929
1125.5E09966011J594963N87578J292038M33655J642151K468032L066101J732026J240844
1134.1E24023399J710472M07067j99318j400452l25660j160698j973763k520485l618584
1142.8E14941978k232284k399826k031593l544083k933464k150002k822685j702232
1150.5D95125809k187500j296158j845513p15599p18460q98552J66054l48663J122169
$$ y = [469753151, 471459618, 473847237, 475299492, 476974144, 478512459, 479078789, 481099930, 482173233, 483515320, 483262711, 483475914, 483258896, 482567368, 483450241, 483616257, 484742126, 485438957, 487360420, 488785973, 490135918, 492541161, 494415703, 496695023, 497841072, 499894295, 500743217, 501890182, 503740082, 504728813, 506220131, 506633224, 508028412, 508642082, 509966011, 511560974, 512148552, 513440590, 513874245, 515516396, 517984428, 521050529, 522782555, 524023399, 525733871, 526140938, 525941620, 524541168, 524215508, 523054810, 521081047, 518560562, 514941978, 512709694, 510309868, 508278275, 504734192, 501800728, 499650726, 496828041, 495125809, 492938309, 491642151, 489796638, 489081039, 488362579, 487464027, 487630081, 487281418, 488403587]
1159.2D88403587J2131R73244R64775J225738K499581J303558K379265K769623M093857
1167.9E04625359L728904L929062M375839M633561N221939L978386N170211M506913
1175.6E40170174N242004N711937M779510N351029M614181N435181N413666M645958
1183.3E81363640L794861L801231M715424M263305L823891L148499L155937K998886
1191F11065674K517700K076225J365433Q22907K04505Q50525J304436J063004R24873
1199.7F22195282P61299Q57926M38919J98898J51901L74756P21588J039963J416550
1208.4F28157082J210403J457710J811714J718712J958046K290535J802902J098481
1216.1F41505585J108017J139145O88629R18808J329498J029739J120224J144867L92075
$$ y = [488403587, 488415718, 489388962, 490353737, 491579475, 494079056, 495382614, 497761879, 500531502, 504625359, 508354263, 512283325, 516659164, 521292725, 526514664, 530493050, 535663261, 540170174, 545412178, 551124115, 555903625, 561254654, 565868835, 571304016, 576717682, 581363640, 585158501, 588959732, 593675156, 597938461, 601762352, 604910851, 608066788, 611065674, 613583374, 615659599, 617025032, 617847939, 618052444, 618902969, 620207405, 621270409, 622195282, 622956581, 623814507, 624253426, 624452324, 624604225, 624978981, 625700569, 626740532, 628157082, 629367485, 630825195, 632636909, 634355621, 636313667, 638604202, 640407104, 641505585, 642613602, 643752747, 644441376, 645360184, 646689682, 647719421, 648839645, 649984512, 650376587]
1224.8F50376587l07465n50766r98916j248780q27179m96749n57709m03214L434K16903
1234.4F45206146k02255n93262p26547r82285p19833r51614j102104l91121J34811
1243.1F39671936Q01773P06177P25021J330643N34668p7515J53733N6304K73438O12793
1252.8F44788971O23779R31397J448059J296997R59244P52716K70462l07007j51978
1261.4F50612640J99891o25000j40076R59015J095886J616669J508255J366424J163635
1270.1F57757339O90690M36782J19934J3123r7351J84936M41971P73926Q77686J004257
1279.8F62203293M49295o92902m25644o02722j054840j002197m17404k1363L7995P11288
1289.4F59184799P98722O19201j52o02570j104202j608887j391678j253815j035995
$$ y = [650376587, 650069122, 649518356, 648519440, 647270660, 646443481, 645946732, 645389023, 644985809, 644989243, 645206146, 645003891, 644410629, 643684082, 642701797, 641981964, 641030350, 639928246, 639537125, 639671936, 640473709, 641179886, 641904907, 643235550, 643770218, 643692703, 643846436, 643902740, 644176178, 644788971, 645412750, 646344147, 647792206, 649089203, 650048447, 650801163, 651071625, 650764618, 650612640, 650812531, 650187531, 650047455, 651006470, 652102356, 653719025, 655227280, 656593704, 657757339, 658448029, 658884811, 659004745, 659017868, 658920517, 659105453, 659547424, 660321350, 661199036, 662203293, 662652588, 661959686, 661534042, 660931320, 659876480, 658874283, 658456879, 658435516, 658473511, 659184799, 659983521, 660602722, 660602570, 660000000, 658895798, 657286911, 655895233, 654641418, 653605423]
1298.1F53605423o69937J35193J72500k13165q3542o25305q76846j295166j745224
1306.8F48403931j852112j565476l84750J66245j15052j91726q5144j57929n00259
1315.4F43717728r53522j156387j178666j505165j180381l23029l81241o20384j21002
1324.1F36297951k18811q84857j436577k028199k427291k601242k343789k119255j670341
1332.8F20567589j006584k58179K62642P973r04808q74558j159286j885872q96492
1341.5F13852425l46604j79024K13089R77517R80720P97386J038552K98957p20443
1350.2F16912575j043244j000709j225815o02798k24228k73400P18308M29153L01895
1358.8F13991737L84789p07665j320228j140976j994934r64928j19057m08363P07512
$$ y = [653605423, 652935486, 653070679, 653243179, 653030014, 652946472, 652321167, 651444321, 650149155, 648403931, 646551819, 644986343, 644601593, 644767838, 644652786, 644461060, 644375916, 644217987, 643717728, 642764206, 641607819, 640429153, 638923988, 637743607, 637420578, 637039337, 636418953, 636297951, 636079140, 635194283, 633757706, 631729507, 629302216, 626700974, 624357185, 622237930, 620567589, 619561005, 619302826, 619565468, 619573441, 618668633, 617794075, 616634789, 614748917, 613852425, 613505821, 613326797, 613539886, 614517403, 615498123, 616295509, 617334061, 617633018, 616912575, 615869331, 614868622, 613642807, 613040009, 612815781, 612542381, 613260689, 613689842, 613991737, 614376526, 613668861, 612348633, 611207657, 609212723, 608247795, 608128738, 607720375, 608427887]
1367.5F08427887M38042q1482R48906L0403J28822K02675k91634q42056j70364Q00590
1377.2F09591789J97563Q27256P89985Q21686R66721Q59832Q20199N11398J356888
1385.8F16743317O44493m37317J180343K324715K165566J561126J726876J742248N95246
1394.5F28246613k241250l24363N9852k09961j468620j288299O23588p1030O32554
1403.2F23959084R32464j518669j928177m51736l55645j130790j237374j187973n61065
1411.9F16520119n05905k96250R957P5759O89621m45709K14844l423081j615181J291695
1421.5F12515869J28479M35906r72557P74574J336174L89175J345597L82957q66165
1430.2F15470009o46591R72366K58408q4534J577530J139717j037521j08605K598686
$$ y = [608427887, 608865929, 608784447, 609733353, 609763756, 609892578, 610095253, 609803619, 608961563, 608791199, 609591789, 609789352, 610616608, 611406593, 612228279, 613195000, 614054832, 614875031, 615386429, 616743317, 617387810, 616950493, 618130836, 620455551, 622621117, 624182243, 625909119, 627651367, 628246613, 626005363, 625681000, 625740852, 625530891, 624062271, 622773972, 623397560, 623326530, 623959084, 624891548, 623372879, 621444702, 620992966, 620637321, 619506531, 618269157, 617081184, 616520119, 616014214, 615717964, 615727921, 615803680, 616493301, 616047592, 616262436, 612839355, 611224174, 612515869, 612644348, 613080254, 612107697, 612882271, 614218445, 614607620, 615953217, 616336174, 615470009, 614823418, 615795784, 616054192, 615969658, 617547188, 618686905, 617649384, 617540779, 620139465]
1438.9F20139465J161309L16238K68097n76325O49987J37481Q25119J276436R97315
1447.6F25195122j237984l96843J013413q12416o07110j034278N56488P18116j220092
1456.2F22174416k102395k776832K448234m41360J710320O97784J52244J860161j570930
1464.9F22151642O44913J102294K551308K057419K884827M696731L284226L543281
1472.6F42916641j45569M528046L981552J755142K356339L467407L756180K893143
1480.3F65508881L153457J588440K994614K524719K068482K674102M50745K091751
1488.1F83055191K632675K330551n31692K520065L328781J899796K904739J714630
1495.8F99854736j729202J404800J673966o27289K207565K239075J90888K138061K987213
$$ y = [620139465, 621300774, 621617012, 621885109, 621308784, 621958771, 622096252, 622921371, 624197807, 625195122, 623957138, 623560295, 624573708, 623761292, 623154182, 622119904, 622676392, 623394508, 622174416, 620072021, 617295189, 619743423, 619302063, 621012383, 621710167, 621862411, 623722572, 622151642, 622796555, 623898849, 626450157, 628507576, 631392403, 636089134, 639373360, 642916641, 642771072, 647299118, 651280670, 653035812, 655392151, 658859558, 662615738, 665508881, 668662338, 670250778, 673245392, 675770111, 677838593, 680512695, 680963440, 683055191, 685687866, 688018417, 687486725, 690006790, 693335571, 695235367, 698140106, 699854736, 698125534, 699530334, 701204300, 700577011, 702784576, 705023651, 705214539, 707352600, 710339813]
1504.5G10339813M885407p49436q059082K170639R75647J781693J664505J486511r14993
1513.1G13580704J895904J945725R83734J838303m600907L774872L665009k21711k824096
1521.8G20037537k836533L919601L059998K69089K08511J758499j227340k19117K151184
1530.5G27121429O38886J640854j007462l440017K395782J978912K168045K849427
1538.2G34345856Q52813j1223449M971237K681045k557830J654739j73340j801529
1545.9G28749542J579437J699601J659164m48379l670273P02362J627197J622772k016678
1554.6G31504745j376495M811783N034103o92443k474213j1655350L552094J861648
1562.3G30565872P69806M12293k269440p84531N07279J232834J197128n241089j26801
$$ y = [710339813, 715225220, 714475784, 706416702, 708587341, 709562988, 711344681, 713009186, 714495697, 713580704, 715476608, 717422333, 718406067, 720244370, 715643463, 719418335, 723083344, 722861633, 720037537, 717201004, 721120605, 724180603, 724449692, 724658203, 726416702, 725189362, 724970245, 727121429, 727760315, 729401169, 728393707, 724953690, 727349472, 729328384, 731496429, 734345856, 735198669, 723975220, 728946457, 731627502, 729069672, 730724411, 730551071, 728749542, 730328979, 732028580, 733687744, 733239365, 729569092, 730271454, 731898651, 733521423, 731504745, 730128250, 734940033, 739974136, 739281693, 736807480, 725152130, 728704224, 730565872, 731335678, 731747971, 729478531, 728694000, 729201279, 730434113, 731631241, 726390152, 726263351]
1571G26263351J388398m43879p23266J301880L98483r355621J367035J838913K52380
1579.7G22287674l32184o33774j58462j408692j099319j297073j251221o95725j157226
1588.4G14253998p39060j212768k65503q31146r45435j194763k463150j548920k014541
1597G03038712j327134j669845r75800j076736j304322l70101j838227j229858j425858
1605.7F91820831j734008l150864k169342k067719l158569n13763j538697r00039q98362
1614.4F75689468O95267J72348j0591659R4451j040267j278916j252670O74972j69525
1623.1F62993469n744781O66351N11704O78405k398758l028946p85293j307526p26089
1631.7F50858536j261063J419830K040864n489655j905746K312393J17263J5488N84183
$$ y = [726263351, 727651749, 727207870, 726484604, 727786484, 728184967, 718829346, 720196381, 722035294, 722287674, 721955490, 721321716, 721163254, 719754562, 718655243, 717358170, 716106949, 715411224, 714253998, 713514938, 712302170, 712036667, 711205521, 710260086, 709065323, 706602173, 705053253, 703038712, 701711578, 700041733, 699065933, 697989197, 696684875, 696314774, 694476547, 693246689, 691820831, 690086823, 686935959, 684766617, 682698898, 679540329, 679026566, 677487869, 676587830, 675689468, 676384735, 676557083, 665965424, 666059875, 665019608, 663740692, 662488022, 663162994, 662993469, 657248688, 657915039, 658426743, 659105148, 656706390, 653677444, 652892151, 651584625, 650858536, 649597473, 651017303, 653058167, 647568512, 645662766, 647975159, 648092422, 648107910, 648692093]
1640.4F48692093m98505L07083p81784J450730K348480p25555J938171q6441J430740
1649.1F54075012K305908L997956M349823j739273p725067K290649L879776K562485
1656.8F63997269K093124J968231K673645L048554K816086O62384j454468K465057
1664.5F78269882J955719J474686K556152L043823P56226K173386L561935P22962K896881
1673.2F97411652M127502K54822l218689L035049L635407K942581K364426P26394M343872
1681.9G15623016O653595K976685r354935K885742N020066K970047O76651J721115
1689.6G29171982J072540K101364L049698K634583M416656L524628n676041J868134
1697.3G42163544L541946M674072j701355p487869O049881M461441L003311J215744
$$ y = [648692093, 648193588, 648500671, 647718887, 649169617, 651518097, 650792542, 652730713, 652644272, 654075012, 656380920, 660378876, 664728699, 662989426, 655264359, 657555008, 661434784, 663997269, 666090393, 668058624, 670732269, 673780823, 676596909, 677259293, 675804825, 678269882, 680225601, 681700287, 684256439, 687300262, 688056488, 690229874, 693791809, 694514771, 697411652, 701539154, 701793976, 698575287, 701610336, 705245743, 708188324, 710552750, 711279144, 715623016, 722276611, 725253296, 715898361, 718784103, 723804169, 726774216, 727450867, 729171982, 730244522, 732345886, 735395584, 738030167, 742446823, 745971451, 740295410, 742163544, 745705490, 750379562, 748678207, 741190338, 747240219, 751701660, 754704971, 755920715]
1705G55920715J491165j062316p9117J828308M31595j057587M94232J766052J814576
1713.7G61547623K62527K9373M299698K417908q184433J438064K253495Q09631J50833
1722.4G65024719l50494k54440J410217J243896N67704J820755K332534j200561k357941
1731.1G68236389K928848L824158k711792r002762L219223M300232K368775L050079
1738.8G76213150n62592l687896K949676K048188j488190j220169K095184J742172
1746.5G78089523J307755J637192R6893L543930k18277k769089K425308J030808R17358
1755.2G86061401J663056j402588m2572K021942K367935L290177q28782q54492J968766
1763.9G94244843L74450J16043O76575J263123k524033J247635M025497P36466p77054
$$ y = [755920715, 757411880, 756349564, 756270447, 758098755, 758530350, 757472763, 757966995, 759733047, 761547623, 761810150, 761839523, 766139221, 768557129, 760372696, 761810760, 764064255, 764873886, 765024719, 764674225, 764419785, 765830002, 767073898, 767641602, 769462357, 771794891, 770594330, 768236389, 771165237, 774989395, 772277603, 763274841, 766494064, 770794296, 773163071, 776213150, 775650558, 771962662, 774912338, 776960526, 775472336, 774252167, 776347351, 778089523, 779397278, 781034470, 781131363, 784675293, 784457016, 781687927, 784113235, 785144043, 786061401, 787724457, 786321869, 786279297, 788301239, 790669174, 793959351, 793130569, 792276077, 794244843, 794619293, 794735336, 795411911, 796675034, 794151001, 795398636, 799424133, 800160599, 799383545]
1772.5G99383545k062988L085250J586457k485352N99976L20511J276169N93872j129990
1781.2H01167450N49087J402588J918717l41568o18820R66949j02920p00608J008759
1789.9H05249634J078720Q23974k011718j333618L337936J205444j042099L23792J223068
1798.6H08855133k4109j782608J010971r39102j37253J694794P14798J074524N58548
1807.3H11025696m0665L61633O95572j684494r05456M23507j5869J031266O50787Q11005
1816.9H12352982j59378K14843J067581k52151K1896j018142N21545J410370k488937
1825.6H11670609K288K380982K603302R18045m539414l52554J787796k25983k87551
1834.3H13957520N1345O39572N32837m66766O77795J89820L92151K00576J324387J301041
$$ y = [799383545, 797320557, 800405807, 801992264, 799506912, 800106888, 800427399, 801703568, 802297440, 801167450, 801716537, 803119125, 805037842, 804696274, 804077454, 805044403, 804941483, 804240875, 805249634, 806328354, 807152328, 805140610, 803806992, 807144928, 808350372, 807308273, 807632065, 808855133, 808831024, 807048416, 808059387, 807120285, 806983032, 808677826, 809392624, 810467148, 811025696, 810985031, 811346664, 812042236, 810357742, 809452286, 809875793, 809859924, 810891190, 811541977, 812352982, 812193604, 812408447, 813476028, 813223877, 813245773, 812227631, 812749176, 814159546, 811670609, 811672897, 814053879, 816657181, 817575226, 813035812, 812683258, 814471054, 814245071, 813957520, 814008865, 814648437, 815181274, 814714508, 815392303, 815582123, 815974274, 816174850, 817499237, 818800278]
1843.9H18800278n539551O88629J658630l49273o7597Q84247R48334m95300l128R7961
1853.6H16623230N8365k21176l91159P705k68020L99627L73841M17862p4463K44598
1863.2H17170410L63770k58179R4986k03247J077881o38962j883087O09207P58514
1871.9H17091293N10636K42767M92249m00010l56979o2103j24741n3024r4376P51496
1881.5H17997208l7995O86951O82144n54275j83258j58692J233978n6839k435913J65634
1891.2H17338943R15299L29819R85794N53741r12628J93634k08359l33252J76087j18866
1900.8H18920212k1134j24359M08859p0495N4626N51453K93655J38398m71039r44443
1910.4H18735733l66211O76270j83487N6991K47040N34515J809464j423874j070633
$$ y = [818800278, 813260727, 813949356, 815607986, 815258713, 815191116, 816075363, 817023697, 816528397, 816525269, 816623230, 816681595, 816460419, 816069260, 816076965, 815808945, 816208572, 816582413, 817000275, 816925812, 817170410, 817534180, 817276001, 817370987, 817167740, 818245621, 817606659, 815723572, 816332779, 817091293, 817601929, 817844696, 818336945, 817936935, 817579956, 817517853, 817393112, 817340088, 817245712, 817997208, 817959213, 818646164, 819328308, 818774033, 818590775, 818432083, 819666061, 819609222, 817173309, 817338943, 818254242, 818584061, 819569855, 820123596, 819210968, 819404602, 819196243, 818862991, 819039078, 818920212, 818899078, 818774719, 819183578, 819113083, 819167709, 819719162, 820012817, 820151215, 819680176, 818735733, 818369522, 819045792, 818862305, 818919296, 819166336, 819700851, 821510315, 820086441, 819015808]
1919.1H19015808J005402M08859M10538j337204j341858N15442Q83636L02658J93100
1927.8H20056381o1950n8899K10495j17340k00654p51266o0883J56632O2637L30582
1937.5H19565735J3046K38648N6533J283875l3722k816696L02200P30133l96957r1171
1947.1H18851624K49023J60446O30036M62341J43051J69296n41534m29154m10156k06299
1956.7H19078674j86157m3564N99518L33862L98789J53351J95312j27792k27051K06223
1966.4H20381165q94165q16346J32828N25284L13644N30701Q44879J3123l02277p0801
1976H20658035J27487m70733n58396j40380j64109K05918L52401M34113L70407K48108
1985.7H21062851k32773l61328l18298o19660K83814J31759j116333j09100J183777
$$ y = [819015808, 820021210, 820430069, 820840607, 819503403, 818161545, 818676987, 819560623, 819863281, 820056381, 819994431, 819935532, 820146027, 820028687, 819828033, 819076767, 819015884, 819172516, 819235153, 819565735, 819578781, 819817429, 819873962, 821157837, 821124115, 818307419, 818609619, 819339752, 818942795, 818851624, 819100647, 819261093, 819891129, 820353470, 820496521, 820665817, 820124283, 819695129, 819284973, 819078674, 818892517, 818848953, 819448471, 819782333, 820181122, 820334473, 820529785, 820401993, 820174942, 820381165, 819487000, 818670654, 818803482, 819328766, 819642410, 820173111, 821017990, 821031113, 820728836, 820658035, 820785522, 820314789, 819756393, 819616013, 819451904, 819657822, 820010223, 820444336, 820814743, 821062851, 820830078, 820468750, 820150452, 819530792, 819814606, 819946365, 818830032, 818720932, 819904709]
1994.3H19904709Q67004O1646j25275l00064n73502n79299j03455j78757k21100J05133
2004H18857040L33558N51147K56424K76489p8735m14124l47595n18494m38308n31693
2013.6H17945709k68478K95868M05273l9291L81470O75277k80380m74243n35126n74112
2023.3H17531967o42776o34232p4997L05557M50821L53241K56729J47095J10169o91224
2032.9H17112350j066055l18832k89154n10941l98559M45938P38373L05328j29013
2041.6H15889435m0436L56751m13437m47464n06897m71421N951l07464L2425M39605
2051.2H14537048M93470O485K92816K57721o74591k23694l80783n14603p0572L30811
2060.9H14054108L18908J28022N29022O5002j25122R2087l1967l45383n27038j63498
$$ y = [819904709, 820771713, 820833359, 820708084, 820408020, 819834518, 819255219, 819151764, 818973007, 818751907, 818857040, 819190598, 819741745, 819998169, 820274658, 820195923, 819781799, 819434204, 818915710, 818477402, 817945709, 817677231, 817973099, 818378372, 818339081, 818720551, 819395828, 819115448, 818641205, 818106079, 817531967, 816889191, 816254959, 816179962, 816485519, 816936340, 817289581, 817546310, 817693405, 817803574, 817112350, 816046295, 815727463, 815438309, 814927368, 814528809, 814974747, 815713120, 816018448, 815889435, 815848999, 816205750, 815792313, 815344849, 814837952, 814366531, 814372482, 814065018, 814097443, 814537048, 815030518, 815037003, 815329819, 815587540, 814912949, 814689255, 814308472, 813793869, 813723297, 814054108, 814373016, 814501038, 815030060, 815095062, 814969940, 815062027, 815030060, 814684677, 814157639, 813994141]
2070.5H13994141K4261J65939K97089M79126J25046k442P9880r7732M7378k01492j17111
2081.1H14794083o7292J00937J04981l60108r9716l7002k671M78592M71573l97644
2090.8H14985733k53296p7286m27017J02158o6300l5934K96402N09796K88849j12915
2100.4H15210190L21121K15073J12686k97470l08380l4562O9733N30701j10855j02234
2110.1H15606003K55203k5711j19019L7537p1716m52194j81351J08414M67529J60751
2119.7H15785446K99225N31845k76947l16162j02997J36414l79715k5406M89960m29383
2129.4H15712280k05154J74484K30866m1809K51998M81644j73721k35367k28195J32904
2139H16099930j94550m66614j63803J06736L19976j5335K77558K58102J26495l1585
$$ y = [813994141, 814018402, 814184341, 814481430, 814960556, 815085602, 815083160, 815163040, 815065308, 815112686, 814911194, 814794083, 814726791, 814827728, 814932709, 814572601, 814472885, 814435883, 814433212, 814911804, 815383377, 814985733, 814732437, 814655151, 814228134, 814330292, 814263992, 814228058, 814524460, 815034256, 815323105, 815210190, 815531311, 815746384, 815859070, 815561600, 815253220, 815218658, 815288391, 815819092, 815708237, 815606003, 815861206, 815835495, 815716476, 815754013, 815682297, 815230103, 815048752, 815157166, 815624695, 815785446, 816084671, 816616516, 816339569, 816023407, 815920410, 816056824, 815677109, 815651703, 816141663, 815712280, 815507126, 815681610, 815912476, 815870667, 816122665, 816604309, 816430588, 816195221, 815967026, 816099930, 815905380, 815438766, 815274963, 815381699, 815701675, 815686340, 815963898, 816222000, 816348495, 816316910]
2148.6H16316910l09983k54364p1411L40271j45645j53808K25677J94168P4158J01547
2158.3H16317520K88010N646J27410k03323j30463L43247M2877O2409K55355L27530
2167.9H17436218K3194j32141l94898p7972N45349M72641K84042j5869J70898j07574
2177.6H18203888J31149L47519J82343N92270k9908j09100j7776K3498o638j39160
2187.2H19178085L90244J89895M7608N2338L06625K12021N3634K5864k91901J7930
2196.9H20182343j76926q6517j58539K14157J006393O12183M5929k96326J83869j34125
2206.5H21392441j7929K54516k85873L7155O6299N71824M54864J24970J35421k5024
2216.1H22708664J04141L433L99704j16119k08130l3493j95999K61002L97949P69348
$$ y = [816316910, 816006927, 815752563, 815681152, 816021423, 815875778, 815721970, 815947647, 816141815, 816215973, 816317520, 816605530, 816611176, 816738586, 816535263, 816404800, 816748047, 816790924, 816853333, 817108688, 817436218, 817459412, 817327271, 816932373, 816854401, 817399750, 817872391, 818156433, 818140564, 818311462, 818203888, 818335037, 818682556, 818864899, 819457169, 819427261, 819318161, 819300385, 819323883, 819317245, 819178085, 819568329, 819758224, 819805832, 819858170, 820164795, 820376816, 820430450, 820456314, 820164413, 820182343, 820005417, 819918900, 819760361, 819974518, 820980911, 821593094, 821639023, 821342697, 821526566, 821392441, 821374512, 821629028, 821343155, 821380310, 821446609, 822018433, 822473297, 822598267, 822733688, 822708664, 822812805, 822816238, 823215942, 823099823, 822891693, 822858200, 822662201, 822923203, 823321152, 824090500]
2225.8H24090500L10745k11944m33045j9836L22952k70844l59878m84772K72141M98199
2235.4H23714218L22647L05863J71051M14276m7608j56860n43060k00806j33514m50058
2245.1H23396149K74124L95202O91376K26135M09317L01590m83093j81656m78744k84119
2254.7H24266281j54190K90985L40271p9956J09482K49405M43268j68686o8665j66626
2264.4H25061569j05438R8648k92435J51673L3340K67182M05502L20816J23978J23291
2274H26188126J24435n89294k83738n29632k39029J10321J42670L51181M98275J160813
2283.7H26934128O5918k94495m87594n38178j27335l47671M85077j94016J43586O44989
2293.3H26284409K29339o4316n72357L40882j19782r5673k27966m43420k84348n52521
$$ y = [824090500, 824401245, 824189301, 823756256, 823736420, 824059372, 823788528, 823428650, 822943878, 823216019, 823714218, 824036865, 824342728, 824513779, 824928055, 824880447, 824723587, 824180527, 823979721, 823846207, 823396149, 823670273, 824065475, 824756851, 824982986, 825392303, 825693893, 825210800, 825029144, 824550400, 824266281, 824112091, 824403076, 824743347, 824663391, 824772873, 825022278, 825465546, 825296860, 825228195, 825061569, 824956131, 825054779, 824762344, 824914017, 824947357, 825214539, 825620041, 825940857, 826064835, 826188126, 826312561, 825723267, 825439529, 824909897, 824670868, 824781189, 824923859, 825275040, 825773315, 826934128, 827000046, 826705551, 826217957, 825679779, 825552444, 825204773, 825689850, 825495834, 825639420, 826284409, 826513748, 826449432, 825877075, 826217957, 826098175, 826002502, 825774536, 825331116, 825046768, 824494247]
2302.9H24494247O76880L50724M53491j62964m41437M25797o10581m06189r90753m60739
2312.6H23328476K93579K46887O40946J32751O15692J71509J16425n56183j220551
2321.3H23769531l74908o62003k49939k74734Q2702K59324O96868Q53272L41949j06659
2330.9H24335403j344451l37601K10266K87094k70691r59015j47781j3199L52478O1722
2340.6H22174225K43683q95996j385498m25339k91443J125488L64609N11627J725693
2349.2H23147049O48727r51843m53567O7062p33795j472168n98602N97229j041184
2357.9H19208908j665726L7690J409454J90887j577148P66754J062012p12357j302948
2366.6H17417526j03531J172867M89502M60816Q31375J188583P02286J68304m08783
$$ y = [824494247, 825171127, 825521851, 825975342, 825812378, 825370941, 825796738, 825186157, 824779968, 823789215, 823328476, 823622055, 823868942, 824509888, 824642639, 825258331, 825429840, 825546265, 824990082, 823769531, 823394623, 822732620, 822482681, 822207947, 822290649, 822549973, 823246841, 824100113, 824442062, 824335403, 822990952, 822653351, 822863617, 823150711, 822880020, 821921005, 821773224, 821760025, 822112503, 822174225, 822417908, 821521912, 820136414, 819711075, 819419632, 820545120, 820909729, 821421356, 823147049, 823795776, 822843933, 822390366, 822457428, 821723633, 820251465, 819652863, 820250092, 819208908, 817543182, 817580872, 818990326, 819181213, 817604065, 818370819, 819432831, 818720474, 817417526, 817313995, 818486862, 818976364, 819437180, 820268555, 821457138, 822159424, 822327728, 821918945]
2375.3H21918945p65381m46777m13589K38876K00195l1967L08228K51083K73819M27017
2384.9H21960449K21482k26670j99737j26725J8845k06222l13263K12173Q2474P6828
2394.6H21499634j97373j66549L11203j39923m00467j72348j95313m10309J05744M9591
2404.2H20283890m10843O2332K53067k9602k65732j65176l73154p2479K07977l65753
2413.8H19124527m64478j97906K95715j19018k84882J82114n3711n34287o60476J72119
2423.5H17459717J20621k04926j80359l90777k56119j32523O1875j59760j51672l50952
2433.1H15815125j87836J84860k89764k61002n42374k18582L10364k2049o56738p38220
2442.8H13393784J28326J62201J57699l08685p00378l05329q4152l9673m86374n1498
$$ y = [821918945, 821153564, 820706787, 820293198, 820532074, 820732269, 820700302, 821008530, 821259613, 821533432, 821960449, 822181931, 821955261, 821755524, 821628799, 821647644, 821441422, 821128159, 821340332, 821422806, 821499634, 821302261, 821135712, 821446915, 821306992, 820906525, 820734177, 820538864, 820128555, 820234299, 820283890, 819873047, 819935379, 820188446, 820158844, 819893112, 819727936, 819354782, 819282303, 819490280, 819124527, 818660049, 818462143, 818757858, 818638840, 818353958, 818536072, 818482361, 817948074, 817287598, 817459717, 817580338, 817375412, 817195053, 816804276, 816548157, 816415634, 816477509, 816317749, 816166077, 815815125, 815627289, 815812149, 815522385, 815261383, 814719009, 814500427, 814810791, 814788742, 814132004, 813393784, 813522110, 813684311, 813842010, 813533325, 812832947, 812527618, 812443466, 812403793, 811917419, 811865921]
2452.4H11865921j02310m52881j67313j79672r7961j09864k3193k87628j59302k14310
2462.1H10071487r0332K88392l70331l88260n05829l35999k56652j18561N76019j83563
2471.7H08686371l90473o3705l50266m34417m9057q2321k81144J47858K518j55487
2481.3H07029877m05426l79563k05230k42234J9150k28119k19497n6687P5302j18942
2491H05268631K7771J98059k53296N5390m20838l37066J96151k46582m84695p53327
2500.6H03250198j45111J92948J99508M37851Q0948j92642k11411n4245k22625o90766
2510.3H02644653q56170q164N42374P629j1902J70060K7618j12991k19574m04129j99585
2520.9H01579819j79596l19062l35998m57611R1629J49612J58692J21765q1864J21079
$$ y = [811865921, 811763611, 811310730, 811143417, 810963745, 810865784, 810755920, 810732727, 810445099, 810285797, 810071487, 809981155, 810269547, 809899216, 809510956, 809005127, 808669128, 808412476, 808293915, 808869934, 808686371, 808295898, 808232193, 807881927, 807447510, 807398453, 807316132, 807034988, 807182846, 807185364, 807029877, 806624451, 806244888, 806039658, 805797424, 805816574, 805588455, 805368958, 805312271, 805387573, 805268631, 805296402, 805494461, 805241165, 805296555, 804875717, 804538651, 804734802, 804488220, 804003525, 803250198, 803105087, 803298035, 803497543, 803935394, 804016342, 803823700, 803612289, 803558044, 803335419, 802644653, 801788483, 801780319, 802322693, 802330322, 802318420, 802488480, 802516098, 802403107, 802183533, 801779404, 801579819, 801400223, 801081161, 800745163, 800287552, 800379181, 800528793, 800687485, 800809250, 800727386, 800848465]
2530.5H00848465m75464q35342p79038j63421J20315j34430J47934J16043K66953j42517
2540.2G98969498m10691l32107o26068n19867m94080k58026k73666l45078J45645P68280
2549.8G96623840J77765o73523k40707m51660n11246l27988l30581j99967m07104p248
2559.5G93651581L95660J88675m04129k29111J29395m47617q93402q00781k69318j07727
2569.1G91213226M3640L13111M25567j3046k85721K61612m23126r70612p08389l43323
2578.7G89512939n4245l36074n3788J49308R0027N2490R3689O027l30582l75900n49164
2589.4G88204727n71441l77579J34582J10398j39618L0899l18299q4533M76913K48642
2599G87714691m93164n99823n13077p29751k03553L53394L13339k98156p7820K52304
$$ y = [800848465, 800373001, 799537659, 798758621, 798595200, 798715515, 798581085, 798729019, 798845062, 799112015, 798969498, 798558807, 798226700, 797600632, 797080765, 796586685, 796328659, 796054993, 795709915, 795855560, 796623840, 796801605, 796128082, 795887375, 795435715, 794924469, 794596481, 794265900, 794065933, 793658829, 793651581, 794047241, 794235916, 793831787, 793602676, 793732071, 793284454, 792391052, 791590271, 791320953, 791213226, 791256866, 791569977, 791995544, 791982498, 791696777, 791958389, 791535263, 790564651, 789856262, 789512939, 789458694, 789122620, 789068832, 789218140, 789308167, 789360657, 789454346, 789460373, 789129791, 788753891, 788204727, 787633286, 787255707, 787390289, 787500687, 787361069, 787391968, 787073669, 786989136, 787466049, 787714691, 787221527, 786621704, 786108627, 785378876, 785175323, 785528717, 785842056, 785543900, 785466080, 785718384]
2608.6G85718384k27890m19235q65326q12378n35736j35727K74582R0637J0452k55127
2618.3G82842636m85306n50537r3918l9901n83344o20117m87366k71835k89993m4938
2627.9G79375381l967j65634k85339n19257l26919n36423n39093p81555r78623j3504
2637.6G75225067L56064j73035n69915l64991k32391n48630n45196j28022n21850o70014
2647.2G71827087j1139m29687n28870l42712k53296L3264l37677n37643m13361j31912
2656.9G68874054n52979o08367Q087k15988k55738k86407l63999l53470l48663l91922
2666.5G65504608o55365p85446p27386j62430J94702J22146j07040l49503m20989o9275
2676.1G62544022J98059l96500m61426m37774q02613o18362J35040K02713k65426R3154
$$ y = [785718384, 785490494, 785071259, 784205933, 783393555, 782857819, 782722092, 782996674, 783087311, 783097763, 782842636, 782357330, 781806793, 781712875, 781672974, 781089630, 780469513, 779982147, 779710312, 779420319, 779375381, 779371414, 779205780, 778920441, 778401184, 778074265, 777537842, 776998749, 776217194, 775238571, 775225067, 775581131, 775408096, 774838181, 774473190, 774240799, 773692169, 773146973, 773018951, 772497101, 771827087, 771815948, 771386261, 770857391, 770514679, 770261383, 770294647, 769956970, 769419327, 769005966, 768874054, 768321075, 767712708, 767720795, 767504807, 767249069, 766962662, 766598663, 766245193, 765896530, 765504608, 764849243, 764063797, 763336411, 763173981, 763368683, 763490829, 763383789, 763034286, 762613297, 762544022, 762742081, 762345581, 761884155, 761446381, 760643768, 760025406, 760160446, 760363159, 760097733, 760190887]
2685.8G60190887m38461o97098l71780m38767k08587q06961n55039o9427j39237L56827
2695.4G56822357p2098o83593m38080k52991n57480o67114m84009k20184k40479l21197
2705.1G52885132j76773j20011R5978l81393m68827m26864p81555m91791p63245m28238
2714.7G48942413k9297k22625j2818n9509j87302m77218k51770M0512j28784l84751
2724.4G47228851o66809o55670m21066Q6441j45874m44107l23868m30069m0741P2861
2734G44259949n72663o10122q5526m33655m56695R1247l8223l05557n06516k46276
2743.7G41095963j18104k61688n0430n6763m58832l60412J98288j23825l15857j31149
2753.3G39417191m51355o33927m12597k11411k25601J80511L28369j77993n86930m93927
$$ y = [760190887, 759752426, 759055328, 758683548, 758244781, 758036194, 757229233, 756674194, 756604767, 756465530, 756822357, 756750259, 756066666, 755628586, 755375595, 754818115, 754151001, 753666992, 753446808, 753206329, 752885132, 752708359, 752588348, 752684326, 752302933, 751834106, 751407242, 750625687, 750133896, 749370651, 748942413, 748913116, 748690491, 748677673, 748618164, 748430862, 747953644, 747701874, 747742386, 747613602, 747228851, 746562042, 745906372, 745485306, 745571747, 745425873, 744981766, 744657898, 744227829, 744187088, 744259949, 743687286, 743077164, 742991638, 742557983, 742101288, 742192535, 742154312, 741848755, 741342239, 741095963, 740977859, 740716171, 740665741, 740608978, 740150146, 739789734, 739988022, 739864197, 739548340, 739417191, 738965836, 738331909, 737919312, 737707901, 737482300, 737662811, 737991180, 737813187, 737226257, 736732330]
2762.9G36732330l07922l25317j14289j23520L4714k21481o96564p5912L00445q0490
2772.6G35121994j50299O9427n35049q72726n25208l33328l66669n23682r1171l49197
2782.2G31444092n27725m8142J9302j62353m96063m5853l08456q80280n24444k69013
2791.9G28201065l02582m67376k73056m78516l09067j84097n55039p74993j262131
2800.5G23594208p93076l95736l17078m76456n01251j44348q67462o76804k22473o63147
2810.2G18536377j023560r74731l65143m72565q23745o56815m03900m58221n98755
2818.9G12758942r03702r69467o95954j189804j008682o76880r50546o50864o14624
2827.6G05098419o44989m80881p59506j144027j026688p58286j078109j514206j122055
$$ y = [736732330, 736424408, 736099091, 735984802, 735861282, 735895996, 735674515, 734977951, 734902039, 735202484, 735121994, 734971695, 735041122, 734506073, 733633347, 733108139, 732774811, 732408142, 731884460, 731793289, 731444092, 730916367, 730868225, 730887527, 730725174, 730229111, 730183258, 729874802, 728994522, 728470078, 728201065, 727898483, 727431107, 727158051, 726679535, 726370468, 726186371, 725631332, 724856339, 723594208, 722801132, 722405396, 722088318, 721611862, 721110611, 720966263, 720098801, 719421997, 719199524, 718536377, 717512817, 716538086, 716172943, 715700378, 714876633, 714219818, 713815918, 713357697, 712758942, 711855240, 710885773, 710189819, 709000015, 707991333, 707314453, 706363907, 705713043, 705098419, 704453430, 703972549, 703213043, 702069016, 701042328, 700284042, 699205933, 697691727, 696569672]
2836.2F96569672j006928j298675q34885q66089j029663j036301j294860j384812j734009
2844.9F86083450j753082j338425j158752j815796k035446j298752r33075j200027
2852.6F74550095j519165j040879j191177r62067n24368r35974p84989j016235l48129
2861.3F66227112l53775j276245j037751j403198j343002j328430j610108j773758
2869F56100845j977005j409225j049347j017456j463165j638871j568298j963806j983261
2877.7F42030411j666870j351166j308937j232987j213493j300583j345558j051941
2885.4F31558876p24106r08508n82733l24059l86276o53572q76503m53644j53313N5046
2895.1F26551208M2115R0141k42920o17485l49083o71768p07512k91290n20935p98645
$$ y = [696569672, 695562744, 694264069, 693429184, 692563095, 691533432, 690497131, 689202271, 687817459, 686083450, 684330368, 682991943, 681833191, 680017395, 677981949, 676683197, 675750122, 674550095, 673030930, 671990051, 670798874, 669836807, 669312439, 668376465, 667591476, 666575241, 666227112, 665873337, 664597092, 663559341, 662156143, 660813141, 659484711, 657874603, 656100845, 654123840, 652714615, 651665268, 650647812, 649184647, 647545776, 645977478, 644013672, 642030411, 640363541, 639012375, 637703438, 636470451, 635256958, 633956375, 632610817, 631558876, 630834770, 629926262, 629343529, 629019470, 628633194, 627979622, 627103119, 626649475, 626496162, 626551208, 626593323, 626683464, 626440544, 625823059, 625473976, 624802208, 624094696, 623803406, 623282471, 622483826]
2904.7F22483826l06359j16996l33710m10576j021500j258697j208038j322709j725540
2913.4F14779701j599540j052437j273766j079407j248397j508599j391296j203880
2921.1F04422379r43070j624565j770172j199646l87726k37198m2114L96347m71726
2929.8E98142509J79673Q21380L31498N85632N14335P84379J551551J732178J270485
2938.5F05913620J504631K336769K319374J604882J467170J728707J810417K216835
2946.2F20902405K019195J869088J634483J447067K144394K161179J869659J412659
2953.9F35460129J636047J935959J712265J948013J580201J602325J851730J966706
2961.6F49693375J878433J462021J678924J565857J359711J573563J704864J395721
$$ y = [622483826, 622177467, 622060471, 621726761, 621316185, 620294685, 619035988, 617827950, 616505241, 614779701, 613180161, 612127724, 610853958, 609774551, 608526154, 607017555, 605626259, 604422379, 603479309, 601854744, 600084572, 598884926, 598497200, 598260002, 598217888, 598614235, 598142509, 598322182, 599143562, 599475060, 600060692, 600575027, 601359406, 602910957, 604643135, 605913620, 607418251, 609755020, 612074394, 613679276, 615146446, 616875153, 618685570, 620902405, 622921600, 624790688, 626425171, 627872238, 630016632, 632177811, 634047470, 635460129, 637096176, 639032135, 640744400, 642692413, 644272614, 645874939, 647726669, 649693375, 651571808, 653033829, 654712753, 656278610, 657638321, 659211884, 660916748, 662312469]
2969.3F62312469J043473J209335J523819J507416J257477J226349J173629J328202
2977F72582169J663589J514511Q12073Q92792J207275N94940Q57086J191712J099090
2985.7F82415237J221772R96322P12281O15997R10492Q32977K69318j69449o7978J47171
2995.3F87884140N24750R00116P10296N77011m55245n08500L26004L00522J85776m68903
3005F89975967j11999j62125l70941N11093J62888n42679n21851j48468n75637q10090
3014.6F87406158m95758l07693n80444j409302n32150J25808m57000q97370q65097
3023.3F81987152k93884o33545j134415p77282q927k62451q25195j109696j513672
3032F75428085o24542j30615o68411j056061q81272r54895j069412p02972q30612o85959
$$ y = [662312469, 663355942, 664565277, 666089096, 667596512, 668853989, 670080338, 671253967, 672582169, 674245758, 675760269, 676572342, 677465134, 678672409, 679267349, 680124435, 681316147, 682415237, 683637009, 684633331, 685345612, 685961609, 686872101, 687705078, 687974396, 687804947, 687736969, 687884140, 688408890, 689309006, 690019302, 690596313, 690141068, 689632568, 689958572, 690259094, 690444870, 689975967, 689863968, 689701843, 689330902, 689841995, 690004883, 689462204, 688940353, 688791885, 688216248, 687406158, 686910400, 686602707, 686022263, 684612961, 684080811, 684206619, 683749619, 682852249, 681987152, 681693268, 681059723, 679925308, 679148026, 679139099, 678876648, 678051453, 676941757, 675428085, 674803543, 674672928, 674004517, 672948456, 672067184, 671112289, 670042877, 669339905, 668509293, 667823334]
3041.6F67823334p81784j163254j343994o67801l37067j272507j035232j029739q90961
3050.3F59300995q60520r37728k87171r04083p91397r92279j678925j276703r89608
3059F50582581q89130j175156q80279l99246k72294j241302j483536o78406j172790
3067.7F42390442r14154j034470j392174j021118q08944n96962j032906j000099r66492
3076.4F33623123j076965r03588r32998j106796p76368k39067j056480j266823q71277
3085F25392761q00781r13658j246452q85735j236382j500930r01528o41823q38203
3093.7F16427269q57010p37457j143837r38530p60994q59680j163559j794358j158523
3102.4F07013321l15590o58493j139565p27272p16857j089707j042480j033326q56208
$$ y = [667823334, 667041550, 665878296, 664534302, 663866501, 663529434, 662256927, 661221695, 660191956, 659300995, 658440475, 657502747, 657215576, 656311493, 655520096, 654527817, 652848892, 651572189, 650582581, 649693451, 648518295, 647638016, 647238770, 646966476, 645725174, 644241638, 643563232, 642390442, 641476288, 640441818, 639049644, 638028526, 637219582, 636622620, 635589714, 634589615, 633623123, 632546158, 631642570, 630709572, 629602776, 628826408, 628587341, 627530861, 626264038, 625392761, 624591980, 623678322, 622431870, 621546135, 620309753, 618808823, 617907295, 617265472, 616427269, 615570259, 614832802, 613688965, 612750435, 611989441, 611129761, 609966202, 608171844, 607013321, 606697731, 606039238, 604899673, 604172401, 603455544, 602365837, 601323357, 600290031, 599433823]
3111.1E99433823j086159j188164r00345o91719r02176j297950r11484p62978j058769
3119.8E90634079j013680o75201j006355j189461o27365r13658j264343j280823p80716
3128.4E81882477m30374j150322j162072m18434o48956j561737r65347l54843r86786
3137.1E74203606r08280o02989q07610j030502j141548j382866j231041p00645p26662
3145.8E65671463q72002r71984o64940l23792q27141j170044j193275j000366o24390
3154.5E58023529r35402j056862q73642j022567q43316o43158l77693n65986r07784
3163.1E50797119q02078j301041j489105j141243l34167j83869j351623j299172m75197
3171.8E42419624n31196r46236o23627l28979l52516m74816j075821j319770j370316
$$ y = [599433823, 598347664, 597159500, 596259155, 595567436, 594665260, 593367310, 592455826, 591692848, 590634079, 589620399, 588945198, 587938843, 586749382, 586122017, 585208359, 583944016, 582663193, 581882477, 581452103, 580301781, 579139709, 578721275, 578072319, 576510582, 575545235, 575190392, 574203606, 573295326, 572692337, 571884727, 570854225, 569712677, 568329811, 567098770, 566398125, 565671463, 564799461, 563827477, 563162537, 562838745, 562011604, 560841560, 559648285, 558647919, 558023529, 557088127, 556031265, 555157623, 554135056, 553291740, 552648582, 552270889, 551704903, 550797119, 549995041, 548694000, 547204895, 546063652, 545729485, 545545616, 544193993, 542894821, 542419624, 541888428, 540942192, 540318565, 539989586, 539637070, 539162254, 538086433, 536766663, 535396347]
3180.5E35396347o00700p48787j457062o75697o13175m36058n77965p36312k96212
3189.2E29254379r05761j076546r80339q94318n53055m68368q14667r77898o39839
3197.9E21943588o77528p90329q53729o23932p85980q43506n20058o16302m84810q17032
3207.5E14930382o29158m36440o32477l10478o27212q64296j114960r48257n82352
3216.2E08784752p84531m91562m47960q92601o95533n07431q14629m27856n10636q09326
3225.8E02402687n77850p15485n33180q29620n04838J61744k41738n86357p85484o08978
3235.5D97180901q56972r76601o18095o38886o52504m50325l96576o40297j77040l87344
3245.1D91386261q99200m73595l74718k40135l76701o95267q28285n03807j39962n39398
$$ y = [535396347, 534795647, 534046860, 532589798, 531914101, 531300926, 530864868, 530286903, 529550591, 529254379, 528348618, 527272072, 526291733, 525397415, 524844360, 524375992, 523561325, 522583427, 521943588, 521266060, 520475731, 519622002, 518998070, 518212090, 517368584, 516848526, 516232224, 515747414, 514930382, 514301224, 513864784, 513232307, 512921829, 512294617, 511430321, 510315361, 509367104, 508784752, 508000221, 507508659, 507060699, 506168098, 505472565, 504965134, 504150505, 503722649, 503212013, 502402687, 501824837, 501109352, 500576172, 499746552, 499241714, 499403458, 499161720, 498575363, 497789879, 497180901, 496323929, 495347328, 494729233, 494090347, 493437843, 492987518, 492590942, 491950645, 491773605, 491386261, 490487061, 490013466, 489638748, 489398613, 489021912, 488326645, 487498360, 486994553, 486854591, 486315193]
3254.8D86315193q75358p37267o23398o49910j07612k8534m94385p88803o60858j75248
3264.4D81173820l67546j63879l25508p73163l80440J1216k27967p67441o44722r72137
3274D76562233k22206K67219q21380k76070p1258q30880r74350l77922k72865l20435
3283.7D72662086o6604p27120n52597m50515l40615j90658o89545k03323j38588k22283
3293.3D69080238k89688n22804o23970p88231o47049n68428k97966n50957k68402l3493
3303D64489250q60061o92788n08384l07618J11733l52821p68586o38046o74782p53898
3312.6D59043999o21109l53661q5907m09012p53936p44973o41021o71883l20778K63748
3322.3D54705467m17518r55315o68335n68466p72438o45180n54848r85489p37037o72646
$$ y = [486315193, 485439835, 484702568, 484079170, 483429260, 483321648, 483293114, 482798729, 482009926, 481349068, 481173820, 480806274, 480642395, 480316887, 479543724, 479163284, 479174500, 478946533, 478179092, 477534370, 476562233, 476340027, 476607246, 475785866, 475509796, 475438538, 474607658, 473633308, 473255386, 472982521, 472662086, 472595482, 471868362, 471315765, 470865250, 470524635, 470333977, 469644432, 469441109, 469302521, 469080238, 468790550, 468267746, 467643776, 466855545, 466208496, 465640068, 465342102, 464791145, 464522743, 464489250, 463629189, 462936401, 462428017, 462120399, 462232132, 461879311, 461110725, 460472679, 459797897, 459043999, 458422890, 458069229, 457983322, 457574310, 456820374, 456075401, 455434380, 454762497, 454441719, 454705467, 454287949, 453332634, 452664299, 452095833, 451323395, 450678215, 450123367, 449137878, 448400841, 447728195]
3331.9D47728195l13377l77121j136322k50054l89480j049080l86047p01752j080284
3340.6D42044678m91486l76510m52958p18689j039314m41475n49736o10695l57704
3349.3D37006111m98504l12539o98204q00209j025428r53179p07779j154823m82788
3357.9D30372658m0474k96784q45108j107673q19626n72739j62430n66406p89947n64232
3367.6D24607239o97975j010590j064796o35567k08206k63367j168137j180343k31323
3376.3D18146935J70326p55196j190452l88375p41920l85895k43340m94117o7559q58306
3385.9D13192101o65246o7214j96915o68717p52983j11618n30662p07512k75536J09902
3395.6D09325600j03722j195259r96819p438K83241L1319n61257r58252q07914m00658
$$ y = [447728195, 447414818, 447037697, 445901375, 445651321, 445261841, 444212761, 443826714, 443124962, 442044678, 441553192, 441176682, 440723724, 440005035, 438965721, 438524246, 437974510, 437363815, 437006111, 436507607, 436195068, 435496864, 434696655, 433671227, 432718048, 432010269, 430855446, 430372658, 430332184, 430035400, 429190292, 428082619, 427262993, 426690254, 426527824, 425961418, 425171471, 424607239, 423909264, 422898674, 421833878, 421198311, 420990105, 420726738, 419558601, 418378258, 418146935, 418317261, 417562065, 416371613, 415983238, 415241318, 414855423, 414612083, 414117966, 414050407, 413192101, 412526855, 412459641, 412262726, 411594009, 410841026, 410729408, 410198746, 409491234, 409215698, 409325600, 409221878, 408026619, 407029800, 407022362, 407305603, 407336922, 406775665, 405817413, 405009499, 404608841]
3405.2D04608841J66740M4060n69305n78270k91558n8326R9983l0594m77905L25775
3414.8D03239441M08554r34296n94062O6032J75972n78079p28607N1040j09062J62277
3424.5D01159210j83944l35236L29132P6218k76909j450J31569J25084L85399k68135
3434.1D01140938j82610L36151P3433L21770K26326j01128J72882Q11959J08528k85454
3443.8D02622795k3308K28806J159820m91676n79834R70993P26318K96097L2845L19061
3453.4D05261917L89633P67937L66402J86348O71005M65851P72590P9155K63863O14891
3463.1D09839592L20091N19257L21998M72985K9030K90298k6016J11809J268234P29484
3472.7D13876762J063576P55348J09787P68547P23267L21922L13988P95174R37614
$$ y = [404608841, 404775581, 404819641, 404250336, 403672066, 403380508, 403322182, 403422165, 403391571, 402913666, 403239441, 403647995, 402713699, 402119637, 402185669, 402361641, 401783562, 401054955, 401105995, 400996933, 401159210, 400975266, 400640030, 400969162, 401045380, 400768471, 400767021, 400898590, 401023674, 401409073, 401140938, 400958328, 401294479, 401367912, 401689682, 401916008, 401814880, 401987762, 402799721, 402908249, 402622795, 402599487, 402828293, 403988113, 403496437, 402916603, 403887596, 404613914, 404910011, 404942856, 405261917, 405651550, 406419487, 406785889, 406972237, 407643242, 408109093, 408881683, 408960838, 409224701, 409839592, 410159683, 410678940, 411000938, 411473923, 411502953, 411793251, 411767235, 411879044, 413147278, 413876762, 414940338, 415695686, 415805473, 416574020, 417297287, 417619209, 417933197, 418728371, 419665985]
3481.4D19665985q3504p14759R80796J669884R65767M85458k66380K62146R72862O69365
3491D24607620J02883P49244J044045L31802N36690M09660N56412Q19626Q63609J221276
3500.7D31242867J811599J021996j035500m32701O84929R68285R82399J542816J88446
3509.4D36975136j061096J528701J513405J034355O05965L93791J037636K8877R9678
3518D42156448Q15964J188965R35516J731263J236190j233139P01561J770401J216202
3526.7D50519371P02972N88723K61001K60430O56471N73883J481819Q30116J495591
3535.4D57370377J037483n99213Q59833P25326J265336R79843J158752J324120J305351
3544.1D65427208J325645J99318K004357p50771K69585J882515J012802J902656j013031
$$ y = [419665985, 419582481, 418867722, 419848518, 421518402, 422484169, 422969627, 422703247, 422965393, 423938255, 424607620, 424710503, 425459747, 426503792, 426835594, 427372284, 427781944, 428338356, 429157982, 430021591, 431242867, 433054466, 434076462, 433040962, 432608261, 433293190, 434261475, 435243874, 436786690, 436975136, 435914040, 437442741, 438956146, 439990501, 440596466, 440990257, 442027893, 442056770, 442156448, 442972412, 444161377, 445096893, 446828156, 448064346, 446831207, 447532768, 449303169, 450519371, 451222343, 451811066, 452072067, 452332497, 452988968, 453562851, 455044670, 455874786, 457370377, 458407860, 457808647, 458668480, 459393806, 460659142, 461638985, 462797737, 464121857, 465427208, 466752853, 466952171, 468956528, 468205757, 468475342, 470357857, 471370659, 473273315, 472260284]
3552.7D72260284J218033J440811Q41866K006264O19774J996879J321335N08728L28331
3561.4D82542305K171059J716652L66630M895477M55895j471939o7101o87294M054451
3570.1D93976135K168083J433144J171722J454201J302719Q53081K029953P27501K771149
3578.8E07887688J691932M7913J930046K635078J962052L36609M551544K763596j846123
3587.5E21960335J551590j452561K621918L416710L598785J715966O52961L796845
3595.2E37862549k320481J971360M025268R3537K908134Q00324J007156K476425J602898
3603.9E50427170J902122L594323L631019j042938L544044k223854j131286J0476036
3611.6E69176636K011184l834610L860436j051445N183716N929260n04990J158448
$$ y = [472260284, 473478317, 474919128, 475760994, 477767258, 478387032, 480383911, 481705246, 482213974, 482542305, 484713364, 486430016, 486796646, 491692123, 492148018, 490676079, 490608978, 489921684, 493976135, 496144218, 497577362, 498749084, 500203285, 501506004, 502359085, 504389038, 505116539, 507887688, 509579620, 509627533, 511557579, 514192657, 516154709, 516491318, 521042862, 523806458, 521960335, 523511925, 522059364, 524681282, 528097992, 531696777, 533412743, 534065704, 537862549, 535542068, 537513428, 541538696, 541632233, 544540367, 545340691, 546347847, 548824272, 550427170, 552329292, 555923615, 559554634, 558511696, 562055740, 559831886, 558700600, 569176636, 571187820, 567353210, 571213646, 570162201, 575345917, 581275177, 580770187, 581928635]
3619.3E81928635k123070J82571L496933K666512K179718K813492K896690K252045
3627E96293526O769638k02599j3467827M823571O041488O700287O67000l774757K630195
3635.7F06480522M053421K739449n34554R75418L556214L598709J190567n85404J843872
3644.4F23318214M059639P770882n14564o615868N983658J183662m868812l093605
3652.1F27223206N635452N461998N008735M797593j1288453J413689O543083K101746
3659.8F46897049J220322L72619K279434N03922J538467K039566P8202N301437L995285
3668.5F64226303q45795J39084r412384J536713J0103760J2598571L396378k6321030
3676.2F55421600P94068R552841N828552l206329n66101L093872K175064K159195M01001
$$ y = [581928635, 579805565, 579988136, 583485069, 586151581, 588331299, 591144791, 594041481, 596293526, 603063164, 602860565, 589392738, 594216309, 600257797, 606958084, 607625084, 603850327, 606480522, 610533943, 613273392, 612738838, 613714256, 617270470, 620869179, 622059746, 621474342, 623318214, 627377853, 635148735, 634634171, 628018303, 634001961, 635185623, 630316811, 627223206, 632858658, 638320656, 643329391, 648126984, 636838531, 638252220, 644795303, 646897049, 648117371, 648489990, 650769424, 651273346, 652811813, 654851379, 654929581, 660231018, 664226303, 663380508, 663519592, 654107208, 655643921, 665747681, 678346252, 681742630, 655421600, 656215668, 665768509, 671597061, 668390732, 667824631, 670918503, 673093567, 675252762, 675653763]
3684.9F75653763M53720N265121P600708j1191711m628677J1049652o387940j193390
3692.6F76621246N860749J18332K092437Q23975n50690J679764R00040L172454L356324
3701.3F94074631o616135k858810N448608J448898p5912R80835L596420N225678q022538
3709.9F93201675M284974N299377j7170410M105835N598373R68399M12979K601548
3717.7F99302750K164230m165955J137467P763443l714676o267319N909500J111756
3725.4G03241196j45951l166198q81043N303574K677002P395553l417816j0189514
3733.1G00816803J1800995K573166j2792969r85107K126388N22308L134690M365921
3740.8G11562195l627320M396668J5717850j2798691k1944504J2590332Q103104R700928
$$ y = [675653763, 676107483, 681372604, 688973312, 677781601, 673152924, 684202576, 677814636, 676621246, 682481995, 682600327, 684692764, 685516739, 684966049, 686645813, 687545853, 690718307, 694074631, 687458496, 684599686, 690048294, 691497192, 691421280, 692402115, 695998535, 701224213, 693201675, 697486649, 702786026, 685615616, 689721451, 695319824, 696288223, 696701202, 699302750, 701466980, 697301025, 698438492, 706201935, 702487259, 696219940, 702129440, 703241196, 703095245, 699929047, 699048004, 704351578, 707028580, 714424133, 711006317, 700816803, 712617798, 715190964, 702397995, 701412888, 703539276, 704061584, 707196274, 711562195, 707934875, 712331543, 728049393, 715250702, 693306198, 705896530, 713999634, 723700562]
3748.5G23700562m528046j4795227J4040909q517838r054565P745132O166382L792725
3756.2G18550034p070542L233109P344131r987259k328567N426330J803818M32434
3763.9G17403488M497986k605362n794601M007187O795501O28128j1949692J233521
3771.7G14216156L566208P89566J626358k45056O09894M35485M203186J048432j0473404
3780.3G15776825K142105L117294J855164L635712l582230k024384J341935N98373
3788G22860794Q35037K01416J11466n05753R64050K14310J631088N217820l816223
3796.7G27714005n540925K176056N488053Q982467o606674j4779892L141632L601227
3804.4G24175949O374512P696914j3421783o956482P090607L082428L45917O59332
$$ y = [723700562, 719172516, 704377289, 718418198, 709900360, 700845795, 708590927, 714757309, 718550034, 711479492, 714712601, 722056732, 712069473, 709740906, 715167236, 716971054, 717403488, 721901474, 719296112, 713501511, 717508698, 724304199, 724932327, 712982635, 714216156, 717782364, 718571930, 720198288, 719953232, 720563126, 720998611, 725201797, 726250229, 715776825, 717918930, 721036224, 722891388, 726527100, 722944870, 720920486, 722262421, 722860794, 723695831, 723897247, 724008713, 723502960, 724467010, 724681320, 726312408, 731530228, 727714005, 722173080, 724349136, 729837189, 738819656, 732212982, 717433090, 720574722, 724175949, 730550461, 738247375, 724825592, 717869110, 724959717, 728042145, 728388062, 729047394]
3812.2G29047394M83703K227173P062531j449814j8334427O074829P818222O092453
3819.9G39022064L295059k2860336J035004O022110K326965M391403J244812n771026
3827.6G28706055q41370K609482N614700L216477j1811905K895584R567718p361679
3835.3G32595062k63748J1497345j0396042o910934R801330p612304p02362R563446
3843G37571793l294220n760270L688889K207260M52194K222519j150131L441162Q272705
3851.7G47651901p919693J63269k0817184K409973J4173126j346435k400971L075485
3859.4G34989471L650132M325561p091064l78876R539032q063583q894272N135269
3867.1G33211670P511749Q909912r181518j2941666L427429P493134N661468j1756286
$$ y = [729047394, 729531097, 731758270, 738820801, 737370987, 719036560, 725111389, 732929611, 739022064, 742317123, 719456787, 720491791, 726513901, 728840866, 733232269, 734477081, 728706055, 727864685, 730474167, 736088867, 739305344, 727493439, 730389023, 739956741, 732595062, 732331314, 743828659, 733432617, 726521683, 736323013, 728710709, 728008347, 737571793, 734277573, 728517303, 732206192, 734413452, 734865646, 737088165, 735938034, 739379196, 747651901, 739732208, 739895477, 719078293, 721488266, 735661392, 734314957, 731913986, 734989471, 738639603, 742965164, 735874100, 735495224, 745034256, 736970673, 728076401, 733211670, 740723419, 749633331, 740451813, 727510147, 730937576, 738430710, 744092178, 732335892]
3874.8G32335892M48303M692535j55258L844681P623978o477738j1691284O709366
3882.6G37330475J829147K358399P455597j6386338k96402N077820J813431O569137
3890.3G45751266j70974j2209549J280212M913635j555786J586762K085647K886887
3898G44568100J345215j2673264O165009L035278n452347P525711l585891m259644
3905.7G36668167l09601J402436K566528q67767M54559O13632O69479j03607n09109
3914.4G40584717K088394K717285l914490m740448N750733O26297n781021K860565
3922.1G40192032K977066J611099k704925m195252J590500K159042K083817j182556
3929.8G42530823n50614K032395l682709j104584K309037j77536K1514N71289J39924
$$ y = [732335892, 732784195, 737476730, 737321472, 741166153, 748790131, 742312393, 730621109, 737330475, 739159622, 741518021, 748973618, 732587280, 732290878, 737368698, 739182129, 745751266, 745580292, 733370743, 734650955, 739564590, 738008804, 739595566, 741681213, 744568100, 745913315, 733240051, 739405060, 742440338, 736987991, 744513702, 740927811, 736668167, 736358566, 737761002, 740327530, 739459763, 739914322, 740527954, 741197433, 741093826, 740584717, 742673111, 745390396, 741475906, 736735458, 742486191, 743112488, 737331467, 740192032, 743169098, 744780197, 742075272, 737880020, 739470520, 741629562, 743713379, 742530823, 741980209, 744012604, 740329895, 739225311, 741534348, 741356812, 741378326, 741949615, 742089539]
3938.5G42089539K11410l90320J972199K199630n596618j937714K136383J939469J769104
3947.2G44393082l168946J076737J263275k826843K011795j40381j073380O68793J24970
3955.8G42329102L65982m67148N13077J63574R72290K48871j990509J274414P18002
3964.5G44127655j107178m5547J60675P72095J36261r15528k0065j22986j38626O25076
3974.2G43471832N38788M62570m99572j5717Q70514k60468l86352j63345l68805j30005
3983.8G43519440L70865j55259l84369M70887P70874Q86917n14374r43832m8371j1902
3993.5G43960876L44468p6523k29111J15433M24347O6223o93588
4000.2G43912125
$$ y = [742089539, 742300949, 741910629, 743882828, 746082458, 740485840, 738548126, 740684509, 742623978, 744393082, 741224136, 742300873, 743564148, 740737305, 742749100, 742608719, 741535339, 742204132, 742329102, 742695084, 742227936, 742741013, 742904587, 743876877, 744125748, 742135239, 743409653, 744127655, 743020477, 742974930, 743135605, 743907700, 744043961, 743128433, 743108368, 742985382, 742846756, 743471832, 744010620, 744473190, 743973618, 743957901, 744828415, 744567947, 744181595, 744018250, 743649445, 743519440, 743890305, 743735046, 743350677, 743821564, 744592438, 745479355, 744964981, 744021149, 743972778, 743960876, 744305344, 744228821, 743999710, 744115143, 744539490, 744605713, 743912125]
##END=$$ End of the data block
