##TITLE=$$ Begin of the data block
##JCAMP-DX=5.00 $$ ACD/SpecManager v 10.08
##SPECTROMETER/DATA SYSTEM=Varian
##DATE=20 Nov 2012 14:50:28
##DATA TYPE=INFRARED SPECTRUM
##DATA CLASS=XYDATA
##ORIGIN=
##OWNER=
##NPOINTS=3735
##FIRSTX=399.26403809
##LASTX=4000.35498047
##MAXX=4000.35498047
##MINX=399.26403809
##MAXY=82.79534912
##MINY=39.78355026
##XFACTOR=1.0000000000
##YFACTOR=0.000000100000000
##FIRSTY=63.74193954
##DELTAX=0.96440572
##XUNITS=1/CM
##YUNITS=TRANSMITTANCE
##XYDATA=(X++(Y..Y))
399.3F37419395m468574q48427r534187j2552948j184120J0398788N653877N19600
$$ 637419395 632950821 632102394 622568207 610015259 608831139 619229927 624883804 625403404
407F25403404L157044l731041l630600q19321M664879K491875l619423P69386p114601
$$ 625403404 628560448 624829407 621198807 620379486 625044365 627536240 623916817 624686203 617571602
415.7F17571602n561524M713211k749633k29J7899628L624038o227836p542534k875252
$$ 617571602 612010078 616723289 613973656 613973427 631873055 635497093 629269257 621726723 618851471
424.3F18851471k66838j390076k900276R04007j403351l138809K323685N798606o18972
$$ 618851471 618584633 617194557 614294281 615198288 613794937 610656128 612979813 618778419 618159447
433F18159447m016838r9373r33609j395149j187668l624001j621170K544174L669472
$$ 618159447 614142609 614043236 613109627 611714478 610526810 606902809 605281639 607825813 611495285
441.7F11495285L353920K550278O74934o89506m88358J267281J547165p67289p88688
$$ 611495285 614849205 617399483 618074417 617384911 616896553 618163834 619710999 618943710 618155022
450.4F18155022M023018L834419r308J03798J03569K596779j624756q715172L285675
$$ 618155022 622178040 626012459 626003151 626106949 626210518 628807297 627182541 618467369 621753044
459.1F21753044Q52585m729118l134499K130241J712151M0665N04646l006744l942719
$$ 621753044 622605629 617876511 614742012 616872253 618584404 618625069 619129715 616122971 612180252
467.7F12180252m646912k519340K052574K466011J839256o68258j525917k930794J315498
$$ 612180252 607533340 605014000 607066574 609532585 611371841 610703583 609177666 606246872 607562370
476.4F07562370K881508M15268o41250p026940p597961l586083k98538K051010L535385
$$ 607562370 610443878 610859146 610217896 603190956 595592995 592006912 591708374 593759384 597294769
485.1E97294769M891472K756806r87053k469750j173210J943626L034516m808426n181007
$$ 597294769 602186241 604943047 603955994 601486244 600313034 602256660 605291176 600482750 595301743
493.8E95301743K601585K106895R69773P56683P56874m11148k069893k067833n315017
$$ 595301743 597903328 600010223 600979996 601736679 602493553 602082405 600012512 597944679 592629662
502.5E92629662o60592n89866l180733p3013L073616K814827j752587m381446m682503
$$ 592629662 591969070 591379204 588198471 588125458 591199074 594013901 592261314 587879868 583197365
511.1E83197365l475685j683579j861763p37228K69890o22330j869240j188583j970787
$$ 583197365 579721680 578038101 576176338 575439110 575709000 575086670 573217430 572028847 570058060
519.8E70058060j025238j950188k878304K144318L431587k169838m151115L200722
$$ 570058060 569032822 567082634 564204330 566348648 569780235 567610397 563459282 566660004
527.5E66660004K179794k253952j212540J566582K560806j21689k49328K72941N45884
$$ 566660004 568839798 566585846 565373306 566939888 569500694 569379005 569129677 569402618 569948502
536.2E69948502N75141J257287L334312K701874L482246K501221J113090J027947J22490
$$ 569948502 570523643 571780930 575115242 577817116 581299362 583800583 584913673 585941620 586064110
544.9E86064110O2065M349J438751q28667k687492J047783J487083q59642j182899
$$ 586064110 586126175 586130524 587569275 586740608 584053116 585100899 586587982 585728340 584545441
553.6E84545441q41828k424507j460991p29484j507912o12526j091232q15926j987953
$$ 584545441 583703613 581279106 579818115 579088631 577580719 576968193 575876961 575061035 573073082
562.3E73073082k096977q20313j716575k150574k906609l526535m635811k857246n48363
$$ 573073082 570976105 570155792 568439217 566288643 563382034 559855499 555219688 552362442 551814079
570.9E51814079L81966k77557j556282p28722k5406J585846q6212N34706K255058J449433
$$ 551814079 552196045 551918488 550362206 549633484 549608078 551193924 551107712 551642418 553897476 555346909
580.6E55346909K941131L273659K986526L121186L036346J834068j0452R7618K854424
$$ 555346909 558288040 561561699 564548225 567669411 570705757 572539825 572529373 572626991 575481415
589.3E75481415K836685O17485R0561r7923J230964R16558P38296J535721K82669j4725
$$ 575481415 578318100 578935585 579026146 578928223 580159187 581075745 581814041 583349762 583632431 583617706
598.9E83617706j264190j191864J21383j84211J09291L84559O66313K12517K59438
$$ 583617706 582353516 581161652 581283035 581098824 581208115 581592674 582258987 582471504 582730942
607.6E82730942K73857m61426P7400M99039j72691M49676J739197J229019J195221
$$ 582730942 583004799 582543373 582620773 583119812 582947121 583396797 585135994 586365013 587560234
616.3E87560234J245270J250343R90181R66492J807747J130600R04312J182480K508621
$$ 587560234 588805504 590055847 591046028 592012520 593820267 594950867 595855179 597037659 599546280
624.9E99546280K754555Q38966N57404P50694R38148N30358Q06999J138420J279144
$$ 599546280 602300835 603139801 603697205 604447899 605386047 605916405 606723404 607861824 609140968
633.6F09140968J494904p09839l89252K208863J794929Q68759M96788q59604k95639
$$ 609140968 610635872 609926033 609536781 611745644 613540573 614409332 614906120 614046516 613750877
642.3F13750877J276932J288033M60434q33283Q26187L262101J601867o82640p3891
$$ 613750877 615027809 616315842 616776276 615942993 616769180 620031281 621633148 620950508 620876617
651F20876617N66254n49126o58912J3008J007919J420021J268959K031098J290092
$$ 620876617 621442871 620893745 620234833 620247841 621255760 622675781 623944740 625975838 627265930
659.7F27265930M57001R7847j430054j524696L31421J404686K298546o64063r806404
$$ 627265930 627722931 627820778 626390724 624866028 625197449 626602135 628900681 628236618 618430214
668.3F18430214Q685799N150528N64765l96842N9967Q63227n72548k05268j83793q41102
$$ 618430214 627116013 632266541 632831306 632434464 632494431 633357658 632785110 632579842 632396049 631554947
678F31554947J294212K527046K738190J702042J033478P24868o8512j512794j368714
$$ 631554947 632849159 635376205 638114395 639816437 640849915 641574783 641506271 639993477 638624763
686.7F38624763P15371m20456j31531J805115J306610L04870O2104P84225l66669j649093
$$ 638624763 639340134 638919678 638788147 640593262 641899872 642204742 642266846 643051071 642684402 641035309
696.3F41035309k218247l042106j213379M65545o97517r63707M86565P59544L45040
$$ 641035309 638817062 635774956 634561577 635027122 634329605 633365898 633852463 634612007 634957047
705F34957047q23899j346474o81037j200982j546630n52788J228447J523895J759224
$$ 634957047 634133148 632786674 632105637 630904655 629358025 628805237 630033684 631557579 633316803
713.7F33316803K439918K287179K745285J725769J254272R00040L2348J239319J901932
$$ 633316803 635756721 638043900 640789185 642514954 643769226 644669266 644701614 645940933 647842865
722.3F47842865K404556L069916L742142M079208L025513J421280Q42743J316986R12933
$$ 647842865 650247421 653317337 657059479 661138687 664164200 665585480 666428223 667745209 668658142
731F68658142K89307J05819j15051J115341K305298L017121M047546J738357q04290
$$ 668658142 668947449 669053268 668938217 670053558 672358856 675375977 679423523 681161880 680357590
739.7F80357590n64194r05151j265412o49719L62091l41568o7749J472855m56238j876907
$$ 680357590 679793396 678888245 677622833 676973114 677335205 676993637 676925888 678398743 677942505 676065598
749.3F76065598j001969j094131j929627k242203k200088k388840k268219j331863
$$ 676065598 675063629 673969498 672039871 669797668 667597580 665208740 662940521 661608658
757.1F61608658k76795j16882o89011j294250k169724j948852m24500m9820n94558
$$ 661608658 661331863 661214981 660525970 659231720 657061996 655113144 654688644 654638824 654044266
765.7F54044266j189499o77719J677475L303680K953873K923202L455582K145767J004181
$$ 654044266 652854767 652177048 653854523 657158203 660112076 663035278 666490860 668636627 669640808
774.4F69640808K358856K722702J784363K254715M145660N288163L382339K061157
$$ 669640808 671999664 674722366 676506729 678761444 682907104 688195267 691577606 693638763
782.1F93638763K604676K807083J870041O81762J0300m30908J188965J666260K299728
$$ 693638763 696243439 699050522 700920563 701602325 701612625 701181717 702370682 704036942 706336670
790.8G06336670K459717J770019L780670K450638J189652J501236L17840q98590n01480
$$ 706336670 708796387 710566406 714347076 716797714 717987366 719488602 719806442 718907852 718406372
799.5G18406372K600784K225495R34677K260284L162918K112122K15607l94135j172256
$$ 718406372 721007156 723232651 724167328 726427612 729590530 731702652 731918259 731524124 730351868
808.2G30351868q89054j40533J48926L85437O13098O84357J488800J742782Q0338p935
$$ 730351868 729462814 729322281 729471207 729856644 730469742 731154099 732642899 734385681 734466019 734458084
817.8G34458084r71832j652908j371155j540146q62732k46887J247711J129074R05914
$$ 734458084 733486252 731833344 730462189 728922043 728059311 727812424 729060135 730189209 731095123
826.5G31095123k96249k759400k211227j980286k591323k830811k016449j398468j209946
$$ 731095123 730798874 728039474 725828247 723847961 721256638 718425827 716409378 715010910 713800964
835.2G13800964j55868J55792j018600j628113q19702j620255k725296k778015k156067
$$ 713800964 713645096 713800888 712782288 711154175 710334473 708714218 705988922 703210907 701054840
843.9G01054840k032623j191483O96564k33383n76096n54809j189499j607285j920242
$$ 701054840 699022217 697830734 698527298 698293915 697717819 697163010 695973511 694366226 692445984
852.5F92445984j229477k609787k733307j335754j360321j781311j668091l58963Q27102
$$ 692445984 691216507 688606720 685873413 684537659 683177338 681396027 679727936 679368973 680196075
861.2F80196075R54514M14276J997757L039475K369232L014221L391266M346008M718170
$$ 680196075 681150589 681564865 683562622 686602097 688971329 691985550 695376816 699722824 704440994
869.9G04440994M737244L903656L644028M973831L265533J699524p0953k76337j62811
$$ 704440994 709178238 713081894 716725922 721699753 724965286 726664810 726593857 726317520 726154709
878.6G26154709k05689J265641J19629J42288l59116j410751j601334j980514k403412
$$ 726154709 725949020 727214661 727334290 727476578 727117462 725706711 724105377 722124863 719721451
887.3G19721451l538208l543472k987595k147751l195190k483902p32499j996231k530975
$$ 719721451 716183243 712639771 709652176 707504425 704309235 701825333 701092834 699096603 696565628
895.9F96565628k581177j601333j571961k049484j953354k342529j661148k428742
$$ 696565628 693984451 692383118 690811157 688761673 686808319 684465790 682804642 680375900
903.7F80375900k448654j444702j925354k375336k835159l429108m242859m075317
$$ 680375900 677927246 676482544 674557190 672181854 669346695 665917587 661674728 657599411
911.4F57599411l166122k879715l424607m458313l945160l274078l710175k938919
$$ 657599411 654433289 651553574 648128967 643670654 639725494 636451416 632741241 629802322
919.1F29802322k042999k409057k833214j551133r32388j290283l59879r1896O39992
$$ 629802322 627759323 625350266 622517052 620965919 620033531 618743248 618383369 618291473 618931465
927.8F18931465R53522J21689p439M57420J205750R79309M84123Q34503J389199R46617
$$ 618931465 619884987 620006676 619999237 620456657 621662407 622641716 623125839 623960342 625349541 626296158
937.4F26296158P26394J389122J852913K077561J816063K149467J552811M272p25555
$$ 626296158 627022552 628411674 630264587 632342148 634158211 636307678 637860489 637864761 637139206
946.1F37139206k370148k910843k131080l165474m300919m343872m496727n028572
$$ 637139206 634769058 631858215 629727135 626561661 622260742 617916870 613420143 608391571
953.8F08391571n119972n623741o139260o302681n677452n628395p049064o637269
$$ 608391571 603271599 597647858 591508598 585205917 579528465 573900070 566851006 560213737
961.5E60213737o405067o745415p134170o772690o557732p607917p206727o974487
$$ 560213737 553808670 547063255 539929085 533156395 526598663 518990746 511784019 504809532
969.2E04809532o964912p729645q106308q331833p766113o993904p143975n958328
$$ 504809532 497844620 490114975 482008667 473676834 465910721 458916817 451772842 445814514
976.9D45814514o591453n956040n603790m833222m989280n270310k330780l298568
$$ 445814514 439223061 433267021 427663231 422830009 417840729 412570419 410239639 406941071
984.7D06941071k338105k108421j562195m21142j312790k26326j091881K21863O01005
$$ 406941071 404602966 402494545 400932350 400511208 399198418 398972092 397880211 398102074 398703079
993.3C98703079L86315m86832p67059R29718L44391J499748O50139N88111Q9951K05498
$$ 398703079 399089394 398602562 397835503 398765221 399109612 400609360 401259499 401847610 401937561 402143059
1003D02143059P34138q63991L45955q88176m17633j33972K17247N36537q49952J24092
$$ 402143059 402877197 402013206 402359161 401470985 401053352 400919380 401136627 401673164 400823212 400947304
1012.6D00947304n21355K63367j155472r66454J04981J91650J478119M20J127472L62396
$$ 400947304 400425949 400689316 399533844 398567390 398672371 398864021 400342140 400342560 401470032 401832428
1022.3D01832428J609726J922836K6779J541443J885987K046508J62087R72099R68018
$$ 401832428 403442154 405364990 405391769 406933212 408819199 410865707 411027794 411999893 412967911
1031D12967911J336899J807327O37436K013359P07741J473274m8142m80346N44433
$$ 412967911 414304810 416112137 416749573 418762932 419470673 420943947 420895805 420415459 420959892
1039.6D20959892J93024J019402j410103K31666M72718O01043N65376q9416J082382
$$ 420959892 421152916 422172318 420762215 420993881 421466599 422067642 422633018 422543602 423625984
1048.3D23625984r5177J849518J233063J686630J463204L62739J861573K680130M212493
$$ 423625984 423530807 425380325 426613388 428300018 429763222 430125961 431987534 434667664 438880157
1057D38880157K279358K885743L042411L505631L347092K544746M348259K962913M184723
$$ 438880157 441159515 444045258 447087669 450593300 453940392 456485138 460833397 463796310 467981033
1065.7D67981033L341332K892151K203254o31446j767540m122544l801536m756890
$$ 467981033 471322365 474214516 476417770 475786324 474018784 469896240 466094704 461337814
1073.4D61337814m060936m154663l716507j579361j993293Q63723L94936J360283O14624
$$ 461337814 457276878 453122215 449405708 447826347 445833054 446696777 447091713 448451996 449066620
1082.1D49066620j31378R64889l9024K397346K357064K935562J866722K605400L641930
$$ 449066620 448935242 449900131 449861107 452258453 454615517 457551079 459417801 462023201 465665131
1090.7D65665131J693229K216416J585655K161941J192551K226906K269745O98738
$$ 465665131 467358360 469574776 471160431 473322372 474514923 476741829 479011574 479710312
1098.5D79710312J259155J223450K025070l65143k22282n68276l14293R78432l58238
$$ 479710312 480969467 482192917 484217987 483852844 483630562 483062286 482747993 483726425 483368187
1107.1D83368187J147003M49677J322822J547508K022706K707786J516190K514228
$$ 483368187 484515190 484964867 486287689 487835197 489857903 492565689 494081879 496596107
1114.9D96596107J654778J722908R23882J358413J268692R15528K176742N94292J192779
$$ 496596107 498250885 499973793 500897675 502256088 503524780 504440308 506617050 507211342 508404121
1123.5E08404121N34020N96580J144219J431503J898232O52122K219086K526169K516021
$$ 508404121 508938141 509534721 510678940 512110443 514008675 514660797 516879883 519406052 521922073
1132.2E21922073J364670P55730J074333O22101Q85811j155281r88770j713791k454300
$$ 521922073 523286743 524042473 525116806 525738907 526624718 525469437 524480667 522766876 520312576
1140.9E20312576k181205l279458k728042k753792j895981k507934k268334k266655
$$ 520312576 518131371 514851913 512123871 509370079 507474098 504966164 502697830 500431175
1148.6E00431175k532043k042389k802963j125489j776542n17884k16980j069564j69259
$$ 500431175 497899132 495856743 493053780 491928291 490151749 489633865 489416885 488347321 488178062
1157.3D88178062m42695J408806N58967R01833Q80165O09703J409798J483535K863198
$$ 488178062 487735367 489144173 489703140 490604973 491485138 492094841 493504639 494988174 497851372
1166D97851372K618751L991928L696595M405822M882584L791351M917450M310684N147133
$$ 497851372 500470123 504462051 508158646 512564468 517447052 521238403 526155853 530466537 535613670
1174.6E35613670N335999M914970N113030N283050N300827M924050N325432M710083
$$ 535613670 540949669 545864639 550977669 556260719 561561546 566485596 571811028 576521111
1182.4E76521111M633026M261818M186515M183808L567276M139442M095841L335075
$$ 576521111 581154137 585415955 589602470 593786278 597353554 601492996 605588837 608923912
1190.1F08923912K390595K072944K106819J770897J303597N40580L37220R82399J217842
$$ 608923912 611314507 613387451 615494270 617265167 618568764 619109344 619446564 620428963 621646805
1198.8F21646805N42068L68424R02443J123695K49138j14403N94864J91269P83653
$$ 621646805 622188873 622557297 623459740 624583435 624832573 624718170 625313034 625504303 626287956
1207.4F26287956K044831J613502J447334J996308J792564J715584K073402J427918
$$ 626287956 628332787 629946289 631393623 633389931 635182495 636898079 638971481 640399399
1215.1F40399399J064682O68258N81818J203308J317291J254044J035233J434326J239700
$$ 640399399 641464081 642132339 642714157 643917465 645234756 646488800 647524033 648958359 650198059
1223.8F50198059J75171m47159o50558o90537q36716p97500j020737p14493J49765
$$ 650198059 650373230 649926071 649275513 648584976 647748260 646950760 645930023 645215530 645365295
1232.5F45365295M2954J52664R6893m31442q47778j281662r20868p26700p12356k91901
$$ 645365295 645408249 645560913 645657806 645226364 644378586 643096924 642176056 641449356 640737000 640445099
1242.2F40445099Q6517M31824M39453P61490J086273N16205P2021J24665K41089L49731
$$ 640445099 640531616 640963440 641402893 642164383 643250656 643766861 643838882 643963547 644204636 644554367
1251.8F44554367L07541M74625Q74481J272659J394043J123276O58722L20739J18409
$$ 644554367 644861908 645336533 646211014 647483673 648877716 650000992 650659714 650980453 651098862
1260.5F51098862l91312l13873n0507J70136N89599J168595J839141J729584J372071
$$ 651098862 650707550 650393677 650343170 650513306 651102905 652271500 654110641 655840225 657212296
1269.2F57212296O41555J47324J47018K02561O25915J87226r0332L56521O90079J061707
$$ 657212296 657853851 658001175 658148193 658350754 658976669 659163895 659073563 659430084 660120163 661181870
1278.8F61181870J107330K11487l53623k13012p72629j019364r42917l01895P8049
$$ 661181870 662289200 662500687 662147064 661934052 661161423 660142059 659199142 658897247 658975296
1287.5F58975296R0103N42526L66822N25894J43585m22211p89947j580963j481705
$$ 658975296 659065399 659607925 659974747 660500641 660644226 660222015 659432068 657851105 656369400
1296.2F56369400j165695j031952q34961k21634J78528K11944l0212o61774j006393
$$ 656369400 655203705 654171753 653336792 653115158 653293686 653505630 653475418 652813644 651807251
1304.8F51807251j720581j631165j389465j534653p41272n2566J89895m3182k59628
$$ 651807251 650086670 648455505 647066040 645531387 644790115 644737549 644927444 644884262 644624634
1313.5F44624634M3030m28620j341247j593018j092758j010132j173553n05867k57798
$$ 644624634 644667664 644239044 642897797 641304779 640212021 639201889 638028336 637522469 637264671
1322.2F37264671m59518n7793j45759q88825j587486k144165k364388k555389k708740
$$ 637264671 636805153 636747360 636601601 635712776 634125290 631981125 629616737 627061348 624352608
1330.9F24352608k114678j056404q61015m11492p3471l80783p78846o48919m34150
$$ 624352608 622237930 621181526 620320511 619909019 619835548 619454765 618675919 618027000 617592850
1339.6F17592850j276169j499176q45337l97110k19307Q71735J343040J036263R50164
$$ 617592850 616316681 614817505 613972168 613575058 613355751 614227486 615570526 616606789 617556953
1348.2F17556953L7232m67873p06405j013832j091500n46341k97241o78139K57798
$$ 617556953 617594185 617126312 616419907 615406075 614314575 613768234 613470993 612792854 613050652
1356.9F13050652N98640M81491K50740n38330n36232n61333k471389j576348l90091
$$ 613050652 613649292 614130783 614381523 613843193 613306961 612745628 610274239 608697891 608307800
1365.6F08307800n68199M95186N63812K52838R54972K41508M07448j26190q89549q44079
$$ 608307800 607739601 608234787 608798599 609051437 610006409 610247917 610655365 610529175 609639626 608795547
1375.2F08795547k09922R53521M50135P31964J008644J249962J165848N37109M41284
$$ 608795547 608585625 609539146 609989281 610721245 611729889 612979851 614145699 614682808 615124092
1383.9F15124092O76880J229401L72047N8899J610527K202187J753463J404305J689720
$$ 615124092 615800972 617030373 617402420 617461319 619071846 621274033 623027496 624431801 626121521
1392.6F26121521J718369P73010k145348k51121N4779m79126j818428j465569Q36411
$$ 626121521 627839890 628612900 626467552 626216431 626271210 625792084 623973656 622508087 623344498
1401.3F23344498L68080M97551O37626j324310j635246l69225o77681j421623j158180
$$ 623344498 623712578 624210129 624847755 623523445 621888199 621518974 620841293 619419670 618261490
1409.9F18261490r22585l80516n33409j12114L00141K01644L22075j053810L50037
$$ 618261490 617338905 616958389 616424980 616312866 616613007 616814651 617136726 616082916 616432953
1418.6F16432953l462410j793594J623764N97229Q38317j304245L52173J404763N67016
$$ 616432953 612970543 611176949 612800713 613397942 614236259 612932014 613284187 614688950 615255966
1427.3F15255966J354065N3215j250954n51567J156311L07045j32713J766815J280022
$$ 615255966 616610031 616663246 615412292 614860725 616017036 616324081 616191368 617958183 619238205
1436F19238205j559792J44043K731629O91757L5019P38220k64740N98145L01933R57603
$$ 619238205 617678413 617822456 620554085 621245842 621280861 622019081 621754341 622352486 622654419 623612022
1445.6F23612022J155472R94415p24754n62744P93114p28951j263046j249237J051178
$$ 623612022 624767494 625761909 625037155 624474411 625267525 624538574 623275528 622026291 623077469
1454.3F23077469J339989l79219l241883l778648K635040j09672J846122M35486K79503
$$ 623077469 624417458 624038239 620796356 617017708 619652748 619543076 621389198 621824684 622104187
1463F22104187K171326j767121O00891J432648K478905K010307L093605M179917K396011
$$ 622104187 624275513 622508392 623109283 624541931 627020836 629031143 632124748 636304665 638700676
1471.7F38700676L904762Q72727M607620M074860K395935J878357L019485L539276
$$ 638700676 642605438 643478165 648085785 652160645 654556580 656434937 659454422 662993698
1479.4F62993698K773972L497009J788559L245621K573166J661376K601777P47223
$$ 662993698 665767670 669264679 671053238 674298859 676872025 678533401 681135178 681882401
1487.1F81882401K076187J869201J582794M16108K804489L264160J822128K938767
$$ 681882401 683958588 685827789 687410583 687826691 690631180 693895340 695717468 698656235
1494.8F98656235K020111j994476J117553J815796p16247K009811K350235N66025K336120
$$ 698656235 700676346 698681870 699799423 701615219 700898972 702908783 705259018 705825043 708161163
1503.5G08161163K964478M861526q61358q131180K406158P49436J406173J501618J602783
$$ 708161163 711125641 715987167 715125809 706994629 709400787 710150223 711556396 713058014 714660797
1512.2G14660797p58514J998825K523041R87167M90494m322968M349747L940582K6779
$$ 714660797 713902283 715901108 718424149 719411316 719901810 715578842 719928589 723869171 723895950
1520.8G23895950k110290k294007L437043K137832j219330L36152K677154p83386l29285
$$ 723895950 721785660 719491653 722928696 725066528 723847198 724183350 726860504 726077118 725747833
1529.5G25747833J947251L33480J470566j072235l215637K292633J486130K459259
$$ 725747833 727695084 728028564 729499130 728426895 725211258 727503891 728990021 731449280
1537.2G31449280L903961J450348j0330658M332275J355057k167587K035522l04260
$$ 731449280 735353241 736803589 726472931 730805206 732160263 729992676 732028198 731723938
1545G31723938j943588J556091J510620J620560n15518l939667J206436J955719J267929
$$ 731723938 729780350 731336441 732847061 734467621 733952103 730012436 731218872 733174591 734442520
1553.6G34442520k081070j151962M546738M912872m26102l915176j0740204M133911
$$ 734442520 732361450 731209488 735756226 740669098 740242996 736327820 725587616 729721527
1561.4G29721527K056351M72030P0801k665481j109391R32770J692200J189194n634842
$$ 729721527 731777878 732249908 732320709 729655228 728545837 729478607 731170807 732360001 726725159
1570G26725159p3700J406326m40750m69666J354981O03638r207077J264190J723023
$$ 726725159 726651459 728057785 727617035 727147369 728502350 729105988 719898911 721163101 722886124
1578.7G22886124j15357M3183n56488o18210j349259j233139j315918j060638p63931
$$ 722886124 722770767 722813950 722257462 721639252 720289993 719056854 717740936 716680298 715916367
1587.4G15916367j095810q05588j353073O7825p52792j357117j250763k177505j545182
$$ 715916367 714820557 714014969 712661896 712729721 711976929 710619812 709369049 707191544 705646362
1596.1G05646362k278061j203842j395340r70459r87320j394729m72412j889725j479569
$$ 705646362 703368301 702164459 700769119 699798660 698811340 697416611 696944199 695054474 693574905
1604.7F93574905j680755j903229k734146j647720k016144l263092n64423j555633
$$ 693574905 691894150 689990921 687256775 685609055 683592911 680329819 679765396 678209763
1612.5F78209763q45337r71604L44620M14963j0354004n07584p12051j069336j756134
$$ 678209763 677364426 676392822 676737442 677152405 666798401 666290817 665578766 664509430 662753296
1621.1F62753296N00946L43170n571594M57001O76956P78274k641906k993470o86645
$$ 662753296 663254242 663597412 658025818 658482819 659159775 659938049 657296143 654302673 653616028
1629.8F53616028j617890r74197j235657J377640K308197l924408j841659K034225
$$ 653616028 651998138 651023941 649788284 651165924 653474121 649549713 647708054 649742279
1637.5F49742279l88336j87073L71552q39386L84369k36741J860505K369308k08206
$$ 649742279 649353943 649166870 649538422 648699036 649083405 648846664 650707169 653076477 652868271
1646.2F52868271J923141j300125J526642K087250L621445N398025j587143j2594147
$$ 652868271 654791412 653491287 655017929 657105179 660726624 666124649 664537506 651943359
1653.9F51943359N788193M872589K472153K262802K314453K195969K495193L024063
$$ 651943359 657731552 662604141 665076294 667339096 669653549 671849518 674344711 677368774
1661.6F77368774J089173j535721K245636K148437J571808K254410K885285O14471
$$ 677368774 678457947 676922226 679167862 681316299 682888107 685142517 688027802 688642273
1669.4F88642273K400589M152069P60422K393570M327850J431580l653717K627334
$$ 688642273 691042862 695194931 695955353 698348923 702676773 704108353 700454636 703081970
1677.1G03081970L091812K428437K668762J070480M571381O531982K938996o460495
$$ 703081970 706173782 708602219 711270981 712341461 716912842 723444824 726383820 719923325
1684.8G19923325J493530M116669K463531K89383J188354R99833K645034L415146K899781
$$ 719923325 721416855 725533524 727997055 728286438 729474792 730474625 733119659 736534805 739434586
1693.5G39434586M173736L296585m998932J718903L564377N216903K63901j0588074
$$ 739434586 743608322 746904907 741905975 743624878 747189255 752406158 752670059 742081985
1701.2G42081985N951844M743423K497254J475067K037506j525803o7062J966629L46451
$$ 742081985 748033829 752777252 755274506 756749573 758787079 757261276 757194214 759160843 759507294
1709.9G59507294q32596N67779J664277K281723M04586p95288L977509K274399q220444
$$ 759507294 758674698 759242477 760906754 763188477 763593063 762797775 766775284 769049683 760829239
1718.5G60829239J618423K182083L74680L47214K81372j61133J189804J165314J034088
$$ 760829239 762447662 764629745 765004425 765351639 765633011 765471878 766661682 767826996 768861084
1727.2G68861084J726608J865998j038590k245560K867203L232956l143845p702484
$$ 768861084 770587692 772453690 771415100 769169540 772036743 775269699 772125854 764423370
1734.9G64423370L151627M190063K067109L149261M44641l820724K327346J651841
$$ 764423370 767574997 771765060 773832169 776981430 777426071 773605347 775932693 777584534
1742.7G77584534j532669r30100J862946J307907J057586J193009O42471M147339j68762
$$ 777584534 776051865 775121765 776984711 778292618 779350204 780543213 781185684 785333023 785164261
1751.3G85164261k483444K419052R48028J024552J568680j793213l1052K029724K457657
$$ 785164261 782680817 785099869 786047897 787072449 788641129 786847916 786816864 788846588 791304245
1760G91304245L460999r30939l95889K319412J67083j33743M90875J053696k482605
$$ 791304245 794765244 793834305 793438416 795757828 795924911 795791168 796282043 797335739 794853134
1768.7G94853134J224365M106598J082764j587982k243653L212281J393661k031173
$$ 794853134 796077499 800184097 801266861 799678879 797435226 800647507 802041168 800009995
1776.4H00009995J017684M38233J002960L02506r89914N51910J726379K162552o80694
$$ 800009995 801027679 801465912 802468872 802771378 801781464 802333374 804059753 806222305 805541611
1785.1H05541611q59528Q62961l1815m12597J057586N57633M12903j579209j044922
$$ 805541611 804682083 805545044 805513229 805100632 806158218 806715851 807128754 805549545 804504623
1793.8H04504623L560181J487427j272659L23104J396103o14853k164917J483460n58853
$$ 804504623 808064804 809552231 808279572 808602676 809998779 809383926 807219009 808702469 808143616
1802.4H08143616k18201J720657Q97522J015854M38233l20206K34299J069793j366195
$$ 808143616 807925415 809646072 810543594 811559448 811997681 811677475 811911774 812981567 811615372
1811.1H11615372j077347K29492J3046R66339M69208P81403R5367L52707Q94318m00391
$$ 811615372 810538025 810767517 810780563 811746902 812216110 812997513 813092880 813445587 814339905 813939514
1820.8H13939514j04751p69120M19770Q35266k326126o6605K388535K776565Q68759
$$ 813939514 813834763 813065643 813485413 814320679 811994553 811927948 814316483 817093048 817961807
1829.4H17961807l949585l07541J733857l5248k34299j61133R6207R4528k35672R69849
$$ 817961807 814012222 813704681 815438538 815403290 815168991 815007858 815104065 815198593 814962921 815932770
1839.1H15932770M03518O93131P7820R61456J035690n707473P83844K070999R6512
$$ 815932770 816336288 817029419 817107239 818068695 819104385 813396912 814180756 816251755 816348267
1847.8H16348267m93546O36215J175461k68631J8387j05972J92260j21536l69339o866
$$ 816348267 815854721 816490936 817666397 817397766 817416153 817310181 817502441 817380905 817011566 817004700
1857.4H17004700l37601N94101K34375K10876j74408K27585N84793o1264L66440k85721
$$ 817004700 816667099 817261200 817495575 817706451 817532043 817759628 818344421 818283157 818649597 818363876
1867.1H18363876M33960j391449j631851J194382P94372M97666J56479N58548q9264
$$ 818363876 818797836 817406387 815774536 816968918 817763290 818260956 818417435 818975983 818886719
1875.7H18886719m27780k94877p1411L45917r2010N27725J65176O14777M90875n88150
$$ 818886719 818458939 818164062 818092651 818438568 818346558 818874283 819039459 819654236 820145111 819556961
1885.4H19556961l56827k17132J302795K10495k268753j74637O79627N70144J286850
$$ 819556961 819200134 818983002 820285797 820496292 818227539 818052902 818732529 819302673 820589523
1894.1H20589523M68521j001434L93219n112m71878k09503l37295Q1863n722L86200
$$ 820589523 821058044 820056610 820449829 820444717 819972839 819763336 819426041 819507904 819502182 819888382
1903.7H19888382K43301L02582M71344O3248j55029p0878q80737q87985O44379k51618
$$ 819888382 820131683 820434265 820905609 820968857 820813828 820742950 819862213 818974228 819618607 819366989
1913.3H19366989J3962L91006R13468K168884k004013j699371J142120O95648O00434
$$ 819366989 819380951 819771957 820685425 822854309 820850296 819150925 820293045 820988693 821589127
1922H21589127r70993j362153Q4305N06897J77994P11060L77502j85165j66855m07563
$$ 821589127 820618134 819255981 819340286 819847183 820025177 820736237 821113739 820928574 820761719 820354156
1931.7H20354156M4404o33851l42407J25504K89535M09394M1427M07257J4801J245652
$$ 820354156 820398560 819764709 819422302 819547806 819837341 820246735 820288162 820695419 820710220 821955872
1941.3H21955872J94015k773514J13831O43539l79791k10113K25372K34070P29293
$$ 821955872 822149887 819376373 819490204 820133743 819753952 819543839 819769211 820003281 820732574
1950H20732574P02897r3689k90985n33677l58734l81546m7760p1411k21329N52903
$$ 820732574 821435471 821341782 821050797 820517120 820158386 819776840 819729080 819657669 819436340 819989243
1959.6H19989243O52999M93775K33154R4071l49350l281K25296r72061q59986q8577
$$ 819989243 820642242 821136017 821369171 821463242 821113892 821110611 821335907 820363846 819503860 819415283
1969.3H19415283M52042M06799P17850O63299k9068M2801l12271j24893k16141n60531
$$ 819415283 819867325 820274124 820991974 821655273 821626205 821669006 821356735 821231842 821015701 820455170
1978.9H20455170m12903k71301L80554O94427L59116p935K52381K38113n188q54492
$$ 820455170 820042267 819770966 820151520 820845947 821205063 821197128 821449509 821687622 821682434 820827942
1988.6H20827942r96475N75637K09427r54132k746R64966P84759K29721p5836k65503
$$ 820827942 819831467 820407104 820616531 819662399 819659653 820624619 821409378 821639099 821563263 821297760
1998.2H21297760l49655p50427o02265k44827L39279M79279J92718L26004J6861K81906
$$ 821297760 820948105 820197678 819595413 819350586 819689865 820169144 820361862 820687866 820704727 820986633
2007.8H20986633N0965n72281p80640p44934l04489k41013R3232J67846O7063r0256
$$ 820986633 821037598 820465317 819684677 818939743 818635254 818394241 818487473 818655319 818722382 818632126
2017.5H18632126M79812Q34656k45819m58069m85153l40118m99878n38407M654l6773
$$ 818632126 819111938 819946594 819700775 819242706 818757553 818417435 817917557 817379150 817383804 817347031
2027.1H17347031L52401L15171J39007M5166j39923m94232p43713k08130k92359l94592
$$ 817347031 817699432 818014603 818153610 818198776 818058853 817564621 816820908 816612778 816320419 815925827
2036.8H15925827k89307K18125N94101L54919J85318q0795J26953k48489n35736n86548
$$ 815925827 815636520 815854645 816448746 816803665 816988983 816908188 817035141 816786652 816250916 815664368
2046.4H15664368p26929j81274J83258J24359K12707O67954K01950o3400J47399q6441
$$ 815664368 814937439 814756165 814939423 815063782 815276489 815944443 816146393 816082993 816230392 816143951
2056.1H16143951j84021m65087l49732l71094j59835K2277M40827J137390N18265n9281
$$ 816143951 815959930 815494843 815145111 814774017 814614182 814636459 815077286 816214676 816732941 816673660
2065.7H16673660l73764k74811m98657p82242j16348K08893K79236J0528K48948N12695
$$ 816673660 816299896 816025085 815526428 814744186 814627838 814836731 815115967 815126495 815375443 815888138
2075.4H15888138J06964l36151p3548L56904k60010j62430r6283k30408J65100K78397
$$ 815888138 815995102 815658951 815585403 815942307 815682297 815519867 815423584 815193176 815358276 815636673
2085H15636673N4321j64261K28806M21066K70920m07333l76892j75095j68152L66287
$$ 815636673 815690994 815526733 815755539 816176605 816447525 816040192 815663300 815488205 815320053 815686340
2094.6H15686340j44806J52893L42713J09482J79825O1035M38690j69220j67618k06985
$$ 815686340 815541534 815694427 816037140 816146622 816326447 816387482 816826172 816656952 816489334 816282349
2104.3H16282349m74625L8528K44675M60129K0065Q9493K32544N3101p8660k16903
$$ 816282349 815807724 815846252 816090927 816551056 816571121 816660614 816893158 816946259 816867599 816650696
2113.9H16650696p7667l61100j79138K15531L66821j67084o6299M43802Q2931M883
$$ 816650696 816573029 816211929 816032791 816248322 816615143 816448059 816381760 816825562 816908493 816913376
2123.6H16913376l54538L6774J87606K3423J38168k46811j04980j84861K43988L93296
$$ 816913376 816558838 816595612 816783218 816806641 816944809 816697998 816593018 816408157 816652145 817045441
2133.2H17045441J68152K38494j3427j6404j84860j43509m33426k29797J50070j01700
$$ 817045441 817213593 817452087 817438660 817422256 817237396 817093887 816660461 816430664 816580734 816479034
2142.9H16479034K3957j5946J19629J01547K43226M04129J02233l67507m57001J24740
$$ 816479034 816502991 816487045 816606674 816708221 816951447 817355576 817457809 817090302 816633301 816758041
2152.5H16758041J78910J62429O1570J97601L18756Q0719L7384M7074K64205j89437
$$ 816758041 816936951 817099380 817160950 817358551 817677307 817758026 817795410 817842484 818106689 817917252
2162.1H17917252k73056P247j3504j07955K15683N88302j22757n0278n9127O1798L27377
$$ 817917252 817644196 817651443 817637939 817529984 817745667 818333969 818211212 818160934 818101807 818163605 818490982
2172.8H18490982J68076N29480R5138N0430j21460M6006L38974M3182N22308L93372
$$ 818490982 818659058 819188538 819283676 819334106 819212646 819258652 819597626 819640808 820163116 820556488
2182.4H20556488J74027l58735l40499o5079N951N62210J88751K50244K18735J68686
$$ 820556488 820730515 820371780 820031281 819966202 819972153 820534363 820723114 820973358 821192093 821360779
2192H21360779K10876L3798J55793j12839k47498l26232Q0719P0953M6997M23279P23724
$$ 821360779 821571655 821605453 821761246 821648407 821400909 821074677 821155396 821226349 821273346 821696625 822420349
2202.6H22420349M27628m70352O0348l2349k7618J97220j00784Q4228j3809O50177
$$ 822420349 822847977 822377625 822437973 822405624 822378006 822575226 822474442 822558670 822544861 823195038
2212.3H23195038M60358J50070j49308j94320M95682m1810l4866j07956M4022j90354
$$ 823195038 823655396 823805466 823656158 823461838 823957520 823915710 823880844 823772888 823816910 823626556
2221.9H23626556l13797N63660M83704O63604K95563j88675k70996J6098O2409l01361
$$ 823626556 823312759 823876419 824360123 825023727 825319290 825130615 824859619 824875717 824938126 824636765
2231.6H24636765k22168k71225M99191K51922J66398K51693l0288L93753k77787k64129
$$ 824636765 824414597 824143372 824642563 824894485 825060883 825312576 825282288 825676041 825398254 825134125
2241.2H25134125l12042l01209j47934O9885N69077L00598N69153J43051K67105J46942
$$ 825134125 824822083 824520874 824372940 824442825 825011902 825312500 825881653 826024704 826291809 826438751
2250.9H26438751j64566l6468n60837j45493l84597M0588L85437M49982M18930r2163
$$ 826438751 826274185 826237717 825676880 825531387 825146790 825187378 825572815 826022797 826441727 826349564
2260.5H26349564M42581k66800l02963l20206l39584J74942K7847K93732j00937K91061
$$ 826349564 826792145 826525345 826222382 825902176 825562592 825737534 825765381 826059113 825958176 826249237
2270.2H26249237M76990M07791L8986N798L85438p15485n15289n44129J0224N08194
$$ 826249237 826726227 827134018 827173004 827178802 827564240 826848755 826333466 825789337 825799561 826307755
2279.8H26307755J1596J36109K37197R77097K83737r7503n12925n03921N1575o03180
$$ 826307755 826319351 826455460 826692657 827669754 827953491 827855988 827343063 826839142 826890717 826287537
2289.4H26287537J91116k6398M18473M66308l24783J84555j46637J60293j18331j84861
$$ 826287537 826478653 826452255 826870728 827337036 827012253 827196808 827050171 827210464 827092133 826907272
2299.1H26907272n62591o34232j49612j13526Q18177J82647J80436j51215O4011M69284
$$ 826907272 826344681 825710449 825560837 825447311 826265488 826448135 826628571 826477356 826541367 827010651
2308.7H27010651o93055k33078q86764J51443O36979k20261K22931k84729O41556P64312
$$ 827010651 826317596 826084518 825197754 825349197 825986176 825765915 825988846 825704117 826345673 827109985
2318.4H27109985k00958j359024j148148j0528k36054j71585l36609L11280l51639
$$ 827109985 826909027 825550003 824401855 824391327 824155273 823983688 823647079 823958359 823606720
2327.1H23606720n37949L08380J468506J303177j191940r77707q74786M34188P14188
$$ 823606720 823068771 823377151 824845657 826148834 824956894 823979187 823104401 823538589 824252777
2335.7H24252777j157913o69403P37762J041794j012802q8577K27966j125183o29807
$$ 824252777 823094864 822425461 823163223 824205017 823192215 823103638 823331604 822206421 821576614
2344.4H21576614o06613M67301N03158P20825J416932N06820r10187k93808O7215n93261
$$ 821576614 820970001 821437302 821940460 822661285 824078217 824585037 823674850 823381042 823448257 822854996
2354.1H22854996o10733m64478j35422r63668n27420r39637q06427J015702N45272
$$ 822854996 822244263 821779785 821644363 820680695 820153275 819213638 818407211 819422913 819968185
2362.7H19968185L68042p2937L50037p30057m06341J080093J77612O6910o1188P12357
$$ 819968185 820336227 820263290 820613327 819883270 819476929 820557022 820734634 820801544 820740356 821452713
2372.4H21452713N11017J68533m9743j99662K56272k65808J65863j37253l23181K90603
$$ 821452713 821963730 822132263 822082520 821882858 822139130 821873322 822039185 821901932 821578751 821869354
2382H21869354L63083M86145L89176L47747r4375K48031J3123o52161j67312l75901
$$ 821869354 822232437 822718582 823107758 823455505 823361130 823609161 823622284 822970123 822802811 822426910
2391.7H22426910l38440j16119K48413R1553p2479L21579k07215j48315m3411l7842
$$ 822426910 822088470 821972351 822220764 822312317 822239838 822561417 822354202 822205887 822162476 822124634
2401.3H22124634j64871l34168j38473k69928R4757M9896j05667K6855k37121n46723
$$ 822124634 821959763 821625595 821487122 821217194 821311951 821361847 821256180 821283035 821045914 820499191
2410.9H20499191k74582K31247J06430k31170m76380l7536k04087m34951J49612J01471
$$ 820499191 820224609 820455856 820562286 820331116 819854736 819817200 819613113 819178162 819327774 819429245
2420.6H19429245j75323m80423k1515Q6136k95792k59781m38843k85187k73895l9139
$$ 819429245 819253922 818773499 818751984 818838120 818542328 818282547 817843704 817558517 817284622 817245483
2430.2H17245483J28479m3182l69644m96597m8218j13220k33384l79104j21918J96076
$$ 817245483 817373962 817330780 816961136 816464539 816416321 816303101 816069717 815690613 815568695 815764771
2439.9H15764771J01547j48926o87790l09067K2049k6626m1809k55127m33960n12696
$$ 815764771 815866318 815717392 815029602 814720535 814742584 814715958 814674149 814419022 813985062 813472366
2449.5H13472366k77481J09024L41492l71704o10199j96686k54516j98822j21003j43509
$$ 813472366 813194885 813303909 813645401 813273697 812663498 812466812 812212296 812013474 811892471 811748962
2459.2H11748962j85928r6359n21469l4714L63312m39682j83335k79617l48663k75498
$$ 811748962 811563034 811466675 810945206 810910492 811273804 810834122 810650787 810371170 810022507 809747009
2468.8H09747009J3275M30451l74985l08990J64566j02845p22122n03998m0969p5455
$$ 809747009 809760284 810190735 809815750 809506760 809671326 809568481 808846359 808342361 808301392 808225937
2478.5H08225937J08261o256L02200k88772n48783N5619m01459n11398m40674k30866
$$ 808225937 808334198 808327942 808630142 808341370 807792587 807848206 807446747 806935349 806494675 806263809
2488.1H06263809q4762K92358L38898q9188N798n3787J60523n13993p03811J5945q6899
$$ 806263809 806179047 806471405 806810303 806721115 806726913 806673126 806833649 806319656 805615845 805631790 805544891
2498.7H05544891j33819m53415l32794j7090Q6822K04544N7145r0790k97165l47748
$$ 805544891 805411072 804957657 804624863 804607773 804694595 804899139 804956284 804865494 804568329 804220581
2508.3H04220581l75595p0725r5367k44827R2163K14386R2239r1858K17972n035m79965
$$ 804220581 803844986 803774261 803678894 803434067 803526230 803740616 803832855 803740997 803958969 803953934 803473969
2519H03473969l13569m90570m54940P9803P1335k13165r2392p4158J30463P934k17743
$$ 803473969 803160400 802669830 802214890 802294693 802366028 802152863 802060471 801986313 802116776 802124710 801906967
2529.6H01906967P9117m49753r04007o12716q011L08456q4534l55835M5701L98330
$$ 801906967 801986084 801536331 800632324 800019608 800011597 800320053 800235519 799879684 799925385 800323715
2539.2H00323715j79519k38724j09101o65512r62600n97992o1112l15399j44958N75027
$$ 800323715 800144196 799905472 799796371 799130859 798168259 797570267 797509155 797193756 797048798 797623825
2548.9G97623825N86777L0975l72085o64063o66962j25274l67890l45459k07824o53229
$$ 797623825 798210602 798241577 797869492 797205429 796538467 796413193 796045303 795699844 795492020 794838791
2558.5G94838791k51160L47595M37775m0970l34091k97470l12958l21045m48684n70679
$$ 794838791 794587631 794935226 795373001 795332031 794997940 794700470 794387512 794066467 793617783 793047104
2568.1G93047104l24249J60369K18888L99017j05972k65732J12076o13327p17468n98984
$$ 793047104 792722855 792883224 793102112 793501129 793395157 793129425 793241501 792628174 791910706 791311722
2577.8G91311722k25983k18124l34015K25754m8523O3018j10931M4174M30985l58353
$$ 791311722 791085739 790867615 790533600 790759354 790710831 790773849 790662918 790707092 791138077 790779724
2587.4G90779724p30133o23627l43628m23660j22375L4179o4163M05350P7820j27182
$$ 790779724 790049591 789425964 789082336 788658676 788536301 788570480 788506317 788911667 788989487 788862305
2597.1G88862305l968k12478k84806j42669n64804p31125j70975J0147J93100O8283
$$ 788862305 788858337 788645859 788361053 788218384 787653580 786922455 786751480 786761627 786954727 787023010
2606.7G87023010K29111j31149o46134j71585l18603o02188o89927j94625l14866n09262
$$ 787023010 787252121 787120972 786474838 786303253 785984650 785382462 784692535 784497910 784183044 783673782
2616.4G83673782J86844R8877j2512m20837l86506l37219n53207j47476l02124m80805
$$ 783673782 783860626 783959503 783946991 783526154 783139648 782802429 782249222 782101746 781799622 781318817
2626G81318817n40085k73742j95084o943P9346n03006n45044p70264n48324m57840
$$ 781318817 780778732 780504990 780309906 780302963 780382309 779879303 779334259 778563995 778015671 777557831
2635.6G77557831p40051k80991K07977k6932o78710l44391k35443m16871j96228j21078
$$ 777557831 776817780 776536789 776744766 776717834 776039124 775694733 775459290 775042419 774846191 774725113
2645.3G74725113n03616q51441k78473l47595l99475j17645k58179l20282m24652l59421
$$ 774725113 774221497 773370056 773091583 772743988 772344513 772226868 771968689 771648407 771223755 770864334
2654.9G70864334j46332j05819q54874q14972l93982k50091N1956k82593o10k75650
$$ 770864334 770718002 770612183 769757309 768942337 768548355 768298264 768350220 768067627 768067017 767791367
2664.6G67791367n27344n48630p11288Q163m21371n16739j27030r9945m272l16239
$$ 767791367 767264023 766715393 766004105 766012268 765590897 765074158 764947128 764847183 764842911 764526672
2674.2G64526672k59781p2555q3847n56412l02734k37046j016082p30744j06506K91443
$$ 764526672 764266891 764194336 764110489 763554077 763251343 763014297 761998215 761267471 761160965 761452408
2683.9G61452408k9526m69360m49677m48761l25699J34507J30844r61151o41175K30561
$$ 761452408 761422882 760953522 760503845 760055084 759729385 759863892 759994736 759033585 758392410 758622971
2693.5G58622971k23465l25165j92185n80978n42374k54135m37012l97644n51452k23618
$$ 758622971 758399506 758074341 757882156 757301178 756758804 756504669 756067657 755670013 755118561 754894943
2703.1G54894943K38495k60925o25763m03824K94189k52380o87637l40729n27573n86013
$$ 754894943 755133438 754872513 754246750 753842926 754137115 753884735 753197098 752856369 752328796 751742783
2712.8G51742783r49555k86941J36184m12597k90528l3035P1716m99420n41382j47552
$$ 751742783 750793228 750506287 750642471 750229874 749939346 749906311 749978027 749478607 748937225 748789673
2722.4G48789673j09329k3499j62659o16378p44400L2501M7149o02798p68127l49274
$$ 748789673 748680344 748656845 748494186 747877808 747133408 747165909 747213058 746610260 745842133 745492859
2732.1G45492859p858k6398q011m84238m90570o01883n02014J79291J3733l07846m86527
$$ 745492859 745485001 745458603 745450592 744966354 744475784 743873901 743371887 743551178 743564911 743257065 742770538
2742.7G42770538j38015k45057l70178P6676k69013m83398l9978N81054r0103r21631
$$ 742770538 742632523 742387466 742017288 742093964 741824951 741341553 741301575 741882629 741792526 740870895
2752.3G40870895l88946P1106J31531l30277q06198n63660j33133k80838m3563J97296
$$ 740870895 740481949 740553055 740684586 740354309 739548111 738984451 738851318 738570480 738526917 738724213
2762G38724213m50364l52554j2359j54877k07367L7537n6229n16586l29056M2953p5149
$$ 738724213 738273849 737921295 737908936 737754059 737546692 737584229 737528000 737011414 736682358 736725311 736650162
2772.6G36650162k40097N3329k68478m66767m39224r08127m28085j01700j91421l17459
$$ 736650162 736410065 736463394 736194916 735728149 735288925 734380798 733952713 733851013 733659592 733342133
2782.2G33342133l35541n3787j31913k75573m47083j09787k78168p36312o63147o71616
$$ 733342133 733006592 732952805 732820892 732545319 732098236 731988449 731710281 730973969 730310822 729639206
2791.9G29639206m92325m08630J6708j03607n38025l15704n70679j243668j020584
$$ 729639206 729146881 728738251 728754959 728651352 728113327 727797623 727226944 725983276 724962692
2800.5G24962692l87344q85773n29709r918l99933m39300n06592O2332k94647j086884
$$ 724962692 724575348 723689575 723159866 723149948 722750015 722310715 721804123 721866455 721571808 720484924
2810.2G20484924r49096j019364r09424p49969o60782o06537n56488n79681l84217
$$ 720484924 719535828 718516464 717607040 716857071 716196289 715589752 715033264 714453583 714069366
2818.9G14069366m35409p10754q32367j273423q69522q55942r97848o81229j084823
$$ 714069366 713633957 712923203 712090836 710817413 709947891 709091949 708094101 707412872 706328049
2827.6G06328049p33567m01992o80008q83942r37729o21795o77567j465607j586075
$$ 706328049 705594482 705192490 704512482 703628540 702690811 702069016 701391449 699925842 698339767
2836.2F98339767r27887j282501j228637q21915r84879q61206j387024j952057j826248
$$ 698339767 697411880 696129379 694900742 694078827 693093948 692232742 690845718 688893661 687067413
2844.9F87067413j429214j259232j339111j410523j727523j855698j310883o97708
$$ 687067413 685638199 684378967 683039856 681629333 679901810 678046112 676735229 676037521
2852.6F76037521r49936j075439j190033j342850r13391m60129k04925r92966j113205
$$ 676037521 675087585 674012146 672822113 671479263 670565872 670105743 669900818 668907852 667794647
2861.3F67794647p26166j107711r56421j112976j393509j494217j744156j825409j606674
$$ 667794647 667068481 665960770 665004349 663891373 662497864 661003647 659259491 657434082 655827408
2870F55827408j167145j051865j251068j691894j840668j705093j562958j576538j682663
$$ 655827408 654660263 653608398 652357330 650665436 648824768 647119675 645556717 643980179 642297516
2878.7F42297516j738739j653671j263962j265640j127930j117859j023254o87485
$$ 642297516 640558777 638905106 637641144 636375504 635247574 634129715 633106461 632418976
2886.4F32418976p73621n08461q76312p32994k33154n02205n14870n59120J41334J38321
$$ 632418976 631645355 631136894 630260582 629527588 629294434 628792229 628277359 627718239 627859573 627997894
2896F27997894l34663l09296n76744m56581n30853m88930n24254l17955j4343m25682
$$ 627997894 627663231 627353935 626777191 626320610 625789757 625300827 624776573 624458618 624444275 624018593
2905.7F24018593p58324r77173o39648l80669n54771j236153j571998j377411j747742
$$ 624018593 623260269 622283096 621643448 621262779 620708008 619471855 617899857 616522446 614774704
2914.3F14774704j494865j254349r32732r16672j669044j615105j316032j031494j452561
$$ 614774704 613279839 612025490 611092758 610176086 608507042 606891937 605575905 604544411 603091850
2923F03091850j694221j133080n65452k3728j64222n494R2621K2583M25987N52254
$$ 603091850 601397629 600264549 599699097 599675369 599511147 599505653 599598274 599620857 600046844 600599098
2932.7F00599098O90766J083831J093064P50503J342850J866226J493492J790314K320290
$$ 600599098 601289864 602373695 603466759 604217262 605560112 607426338 608919830 610710144 613030434
2941.3F13030434J825142J497345K090492J969261J654053J912994J504555J334305
$$ 613030434 614855576 616352921 618443413 620412674 622066727 623979721 625484276 626818581
2949.1F26818581K329406K503701J865310K077179J907883J251602J564636K094345
$$ 626818581 629147987 631651688 633516998 635594177 637502060 638753662 640318298 642412643
2956.8F42412643J799088J472397J442795J680297K048569J867523J607438J201629
$$ 642412643 644211731 645684128 647126923 648807220 650855789 652723312 654330750 655532379
2964.5F55532379J386032K004700K050476J460724P38449J399765J608505J451798
$$ 655532379 656918411 658923111 660973587 662434311 663172760 664572525 666181030 667632828
2972.2F67632828J646271J262283J073990R34066J625367K008590J579361Q12226N24597
$$ 667632828 669279099 670541382 671615372 672549438 674174805 676183395 677762756 678574982 679099579
2980.9F79099579J222687N02090L94669J148224J190795J176682R53827J071243Q47550
$$ 679099579 680322266 680824356 681219025 682367249 683558044 684734726 685688553 686759796 687607346
2989.6F87607346P53784J020279O02951L3493L2501J47095M38537P64313M54788J28174
$$ 687607346 688361130 689381409 689984360 690017853 690050354 690197449 690635986 691400299 691855087 691983261
2999.2F91983261l31268P171L33100K41546L19825n20707m44030k09275p7896L79181
$$ 691983261 691651993 691659164 691992264 692233810 692553635 692032928 691588898 691379623 691301727 691680908
3008.8F91680908J38855l50189q54492m60816l93829k88773j39312n27573p77283r74731
$$ 691680908 691819763 691469574 690615082 690154266 689760437 689471664 689332352 688804779 688027496 687052765
3018.5F87052765j11923k30332p44934o36749p96738o24771p82089p31049n84793m08859
$$ 687052765 686940842 686710510 685965576 685328827 684532089 683907318 683125229 682394180 681809387 681400528
3028.1F81400528o69479p50580p07245j232071p28226r72137j013031n67932j026383
$$ 681400528 680731049 679980469 679273224 678041153 677312927 676340790 675327759 674759827 673733444
3036.8F73733444p28836n30472q97903q07572o10809j067276j050873q95614q57620
$$ 673733444 673004608 672474136 671576233 670768661 670157852 669090576 668039703 667144089 666286469
3045.5F66286469p76368j417694j085205o15005q87833j095200p45239m96597j080551
$$ 666286469 665510101 664092407 663007202 662392197 661504364 660409164 659663925 659167328 658086777
3054.2F58086777q93860p71103j050034j377792j183853q48618j194915p31812m87213
$$ 658086777 657192917 656421814 655371780 653993988 652810135 651961517 650766602 650034790 649547577
3062.9F49547577o09512j128617j203460q10242j420136j092758q32672j058731j053772
$$ 649547577 648938065 647809448 646605988 645795746 644375610 643282852 642450180 641391449 640337677
3071.5F40337677q61473n33791p60193q86764j146622r74579q76121j289025j044578
$$ 640337677 639476204 638942413 638182220 637295456 636148834 635174255 634298134 633009109 631964531
3080.2F31964531o37779p18880j194305j217080r51461p19872q45146j109657j133995
$$ 631964531 631326752 630607872 629413567 628196487 627245026 626525154 625680008 624570351 623436356
3088.9F23436356j235123j281319j123161o95686j106034q60176j45912r52606j205979
$$ 623436356 622201233 620919914 619796753 619101067 617995033 617134857 616988945 616036339 614830360
3097.6F14830360j055069j089363j181373j371117j135750n09414j74485p29980j124230
$$ 614830360 613775291 612685928 611504555 610133438 608997688 608488274 608313789 607583809 606459579
3106.2F06459579j188735p57103q11387j497001j460152r69734n60951j126900r77707
$$ 606459579 605270844 604513741 603702354 602205353 600745201 599775467 599214516 598087616 597109909
3114.9E97109909m88396r65805j141739j242065o12831q7967q04482j701088j577072
$$ 597109909 596621513 595655708 594513969 593271904 592659073 592571106 591766624 590065536 588488464
3123.6E88488464j051101n60685n94978j524773r98687m48036j015053j132355o25992
$$ 588488464 587437363 586876678 586281700 584756927 583758240 583310204 582295151 581162796 580536804
3132.3E80536804o35261j430741r54933o87294n46913l37715j157837j096611r27963
$$ 580536804 579901543 578470802 577515869 576828575 576281662 575943947 574786110 573689499 572761536
3141E72761536j306382j453094j044006o74324n03159n77927j270256j158752p92160
$$ 572761536 571455154 570002060 568958054 568283730 567780571 567202644 565932388 564773636 563981476
3149.6E63981476n61295m71992p87163j234322j388778q78830q84018r13124q82874
$$ 563981476 563420181 562948189 562161026 560926704 559537926 558659096 557775078 556861954 555979080
3158.3E55979080p71103o47812q15696o82564o85654m04243j022530j582527q59756
$$ 555979080 555207977 554560165 553744469 553061905 552376251 551972008 550949478 549366951 548507195
3167E48507195p04651j066780j324082q55446n25169l14751l41759p68775n99328q62998
$$ 548507195 547802544 546735764 545411682 544556236 544031067 543716316 543374557 542605782 542006454 541143456
3176.6E41143456j006127q26034r60198j111030q49267n84411p09839p26929j128692
$$ 541143456 540137329 539311295 538351097 537240067 536390800 535806389 535096550 534369621 533240929
3185.3E33240929j050835o92558m58641p51419j482850q59832o26297q74749n12313
$$ 533240929 532190094 531497536 531038895 530287476 528804626 527944794 527318497 526443748 525931435
3194E25931435l62740m27818o46706j207199j279983l39585n66635q60481k84348n36804
$$ 525931435 525568695 525140877 524494171 523286972 522006989 521667404 521100769 520240288 519955940 519419136
3203.6E19419136r44557j018944p01294o29387p07817n81016m36135m11834q28972
$$ 519419136 518474579 517455635 516754341 516124954 515417137 514836121 514399986 513988152 513159180
3212.3E13159180j085892r76906m48074n29671p01141k28386o36292j147918o37093
$$ 513159180 512073288 511096382 510648308 510118637 509417496 509189110 508552818 507404900 506767807
3221E06767807l68347o96411l70827m88281j150246j057777p28760j61591m59518r49364
$$ 506767807 506399460 505703049 505332222 504843941 503693695 502635918 501907158 501745567 501286049 500336685
3230.7E00336685j41792L25661n96734r89799n57404q25195q96606r92508o84586l55453
$$ 500336685 500194893 500520554 499923820 498934021 498376617 497551422 496654816 495662308 494977722 494622269
3240.3D94622269n86396l7422j81045p59239j110230q11005r7808k35634n55230r59396
$$ 494622269 494035873 493998451 493817406 493058167 491947937 491136932 491039124 490803490 490248260 489288864
3249.9D89288864p93533m61426l34206l16429m37164o4621l24097j101722r43070j40343
$$ 489288864 488495331 488033905 487699699 487383270 486946106 486881485 486557388 485455666 484512596 484372253
3259.6D84372253m20761o65435k34910m00314n15442q90922p26738j44310J41296J20430
$$ 484372253 483951492 483286057 483051147 482650833 482135391 481244469 480517731 480373421 480514717 480635147
3269.2D80635147n88760o60439l70178n88570j118164m99458J92833o13060o24771
$$ 480635147 480046387 479385948 479015770 478427200 477309036 476809578 477002411 476389351 475764580
3277.9D75764580n0545m04816r50546m29306o8054l64838l88832m04053j18789m93927
$$ 475764580 475714035 475309219 474358673 473929367 473861313 473496475 473107643 472703590 472584801 472090874
3287.5D72090874o14090j41220l59688k10838k15226q57658j046486m43611j76773
$$ 472090874 471476784 471335564 470975876 470765038 470549812 469692154 468645668 468202057 468025284
3296.2D68025284k90299l99475m76303k24876o60553p49779m36478m93660o0653m16107
$$ 468025284 467734985 467335510 466859207 466634331 465973778 465223999 464787521 464293861 464233208 463817101
3305.9D63817101o97098J80664k40631j118508p59124m61274l67508j005020j064644
$$ 463817101 463120003 463300667 463060036 461941528 461182404 460721130 460353622 459348602 458283958
3314.6D58283958j18446k75040k85759l81813r05685o97594m38881l78265k34070l42636
$$ 458283958 458165512 457890472 457604713 457222900 456317215 455619621 455180740 454802475 454568405 454225769
3324.2D54225769q32329q28895r91249o83670n6038p47261r00307n83153n71365n12390
$$ 454225769 453393440 452564545 451573296 450889626 450833588 450086327 449186020 448602867 448031502 447519112
3333.8D47519112o08445o50940n97419o94733n15404k48909j138572j179314m85497
$$ 447519112 446910667 446259727 445662308 444967575 444452171 444203262 443064690 441885376 441399879
3342.5D41399879j82457j86157j186142p74727j79405o74095q33511q02384n12809
$$ 441399879 441217422 441031265 439845123 439070396 438890991 438216896 437383385 436581001 436068192
3351.2D36068192o94962q19397k37083j14975j405831j458206k85873l05481m61121
$$ 436068192 435373230 434553833 434316750 434201775 432795944 431337738 431051865 430746384 430285263
3359.9D30285263j096916j223755r01680o22673m1428k73971p21932j037750p59926
$$ 430285263 429188347 427964592 427062912 426440239 426398811 426124840 425402908 424365158 423605232
3368.6D23605232p97767q12149m63639n02624o67115p89451J7738p95173j440850l37944
$$ 423605232 422807465 421995316 421531677 421029053 420361938 419572487 419590225 418795052 417354202 417016258
3378.2D17016258j78985j83182o73485p63512o95076m50630l06320p82509r8266j59378
$$ 417016258 416837273 416654091 415980606 415217094 414522018 414071388 413765068 412982559 412884293 412724915
3387.8D12724915m50898n80291m78058k06452j202240r57336J08223L76663m97971
$$ 412724915 412274017 411693726 411215668 411009216 409806976 408849640 408957863 409334526 408836555
3396.5D08836555j528358o02455K78435J79901j45531l22800l03650o23054l74641
$$ 408836555 407308197 406705742 406984177 407164078 407018547 406695747 406392097 405769043 405394402
3405.2D05394402j08262o78749l92456o21910n84106M82864l80134q36678n9967L80592
$$ 405394402 405286140 404607391 404214935 403593025 403008919 403491783 403111649 402274971 402215004 402595596
3414.8D02595596k13852p94448j15624L11356Q98437m4327j058960m60319l13721P4120
$$ 402595596 402381744 401587296 401471672 401783028 402681465 402637138 401578178 401117859 400804138 400878258
3424.5D00878258N7144k1134l31726p629L56522q1597K05803J51367L3913m17252l27987
$$ 400878258 400935402 400914268 400582542 400574913 400931435 400849838 401055641 401207008 401240921 400823669 400495682
3435.1D00495682K64091M06227M24614J36719L2578J60789P36046p2022L27645P82509
$$ 400495682 400759773 401166000 401590614 401727333 401759911 401920700 402656746 402584724 402912369 403694878
3444.7D03694878J58386R70154j239205o23588J329765L82462J14402j78451O25458
$$ 403694878 403853264 404823418 403584213 402960625 404290390 404672852 404787254 404608803 405234261
3453.4D05234261P18421Q35305R49669q507j81008O7978Q57163N23071N47371K35558
$$ 405234261 405952682 406787987 407737656 407729149 407548141 407616119 408473282 408996353 409543724 409779282
3463.1D09779282R7160O39915J53161N04341J23329N70793O78444J95579R80187P28874
$$ 409779282 409876442 410516357 410669518 411173859 411297188 411867981 412546425 412742004 413722191 414451065
3472.7D14451065P91054L40233j30349L20397Q09059R69315O90574P30171L60299K77786
$$ 414451065 415242119 415582352 415452003 415772400 416581459 417550774 418241348 418971519 419331818 419609604
3482.3D19609604J52244N87197O82258P25785J270904q9683j21651J119652J094360
$$ 419609604 419761848 420349045 421031303 421757088 423027992 422938309 422816658 423936310 425030670
3491D25030670M09393L99094R95140O15769M68711L83797M29611J054039J031723K58332
$$ 425030670 425440063 425839157 426834297 427450066 427918777 428302574 428732185 429786224 430817947 431076279
3500.7D31076279N58662J290588L30391m01039M67720J255646P51190J613617J105538
$$ 431076279 431634941 432925529 433255920 432854881 433322601 434578247 435329437 436943054 438048592
3509.4D38048592j143074N44891J165733J162758R92165Q06923J120872K38037M27933
$$ 438048592 436905518 437450409 438616142 439778900 440771065 441577988 442698860 442936897 443364830
3518D43364830Q41789Q86002O83899J295242R53064p37839N03426J410980J299133
$$ 443364830 444206619 445092621 445776520 447071762 448024826 447286987 447790413 449201393 450500526
3526.7D50500526K65503O14090J075592Q96912Q47282J59035J239662Q92067J342507
$$ 450500526 450766029 451380119 452455711 453352623 454199905 454358940 455598602 456490669 457833176
3535.4D57833176J219825n22155P84874P65953P47833J087952J829223J419983J353226
$$ 457833176 459053001 458530846 459315720 460081673 460829506 461917458 463746681 465166664 466519890
3544.1D66519890J322174j54038J338578p65610Q03642J914864J050720K333336r21478
$$ 466519890 467842064 467688026 469026604 468260994 469064636 470979500 472030220 474363556 473442078
3552.7D73442078L38020J394691J882058K192649P1717J735153J473274P39021L22571
$$ 473442078 473780098 475174789 477056847 479249496 479321213 481056366 482529640 483268661 483591232
3561.4D83591232J842461J026688K73742N533142J109963r99146M04969j245308L412551
$$ 483591232 485433693 486460381 486734123 492267265 493377228 492378082 492783051 491537743 494950294
3570.1D94950294J591950J136017J801643J564789J112900J483345K137031Q64601
$$ 494950294 496542244 497678261 499479904 501044693 502157593 503640938 505777969 506642570
3577.8E06642570L013382J177102l7346K155266K020492J772842J266366N061149K597733
$$ 506642570 509655952 510833054 510795708 512950974 514971466 516744308 518010674 523071823 525669556
3586.5E25669556k321854P65457j983414L445206M222374L479080J462212O6948L545112
$$ 525669556 523347702 524113159 522129745 525574951 529797325 533276405 534738617 534805565 538350677
3595.2E38350677j458740K369118M043922L13149L783646J212539K81754J934128J219101
$$ 538350677 536891937 539261055 543304977 543618126 547401772 548614311 548896065 550830193 552049294
3603.9E52049294J928100L774643L527565j470375L709259j205025j808014R477883
$$ 552049294 553977394 557752037 561279602 559809227 563518486 562313461 560505447 569983330
3611.6E69983330K139206k981835M415818r46351M679642N048409j158600J781196
$$ 569983330 572122536 569140701 573556519 572610168 577289810 582338219 581179619 582960815
3619.3E82960815j204719L68500L891449L260917J970482K019119K134819K214318
$$ 582960815 581756096 582124596 586016045 589276962 591247444 593266563 595401382 597615700
3627E97615700P493133J128121j3038063K938575N093842P406311J710892l563538
$$ 597615700 605108833 606236954 593198891 596137466 601231308 608637619 610348511 606784973
3634.7F06784973K096291L844146L035698m79621R32884L505859L646278N67818j527481
$$ 606784973 608881264 612725410 615761108 615281487 616214371 619720230 623366508 623934326 622406845
3643.4F22406845K137146M952927P834701k033500n766182P270279q79174n673866
$$ 622406845 624543991 629496918 637331619 635298119 629531937 636802216 635923042 630249176
3651.1F30249176q80852O549034M659348M571228N683060j1171913Q61625O046066
$$ 630249176 629368324 635917358 640576706 645147934 650830994 639659081 640520706 646566772
3658.8F46566772J861115J413498R10416K945632L82767P72248J301193J53579N794907
$$ 646566772 648427887 649841385 650751801 653697433 654080200 654852448 656153641 656307220 662102127
3667.5F62102127L795471j064224N18799q263245K015915R554520J1302337O43235
$$ 662102127 665897598 664833374 665352173 657088928 659104843 668659363 679961700 680604935
3675.2F80604935k4192124L209992R179458N077668l095856m7531L368149K081527
$$ 680604935 656412811 659622803 668802261 673879929 670784073 670736542 674104691 676186218
3682.9F76186218J746140J38778M97056M926376P289505j0339508m390106J1218032
$$ 676186218 677932358 678071136 678568192 683494568 690784073 680444565 676054459 687272491
3690.6F87272491o828689k293549N890808Q39844K327271R84802p53250O08520L58963
$$ 687272491 680443802 678150253 684041061 684880905 687208176 688192978 687439728 688048248 688407211
3699.3F88407211L278809L966827n804672l288193N633698J914902m55323K85569L469238
$$ 688407211 691686020 695652847 689848175 686559982 692193680 694108582 693653259 693938828 697408066
3708F97408066N931167p273635M567489N535736j7156830M236756M696655J18332O64444
$$ 697408066 703339233 696065598 700633087 706168823 689011993 693248749 697945404 698063736 698728180
3716.7F98728180K620621K266693l855133J087799Q383331l439636p290802O403351
$$ 698728180 701348801 703615494 699760361 700848160 709231491 705791855 698501053 704904404
3724.4G04904404K064972j776123m752655L84445N670395K169494P839356k876740
$$ 704904404 706969376 705193253 700440598 700825043 706495438 708664932 716504288 713627548
3732.1G13627548j0722427J1288452K033615j3296204m72793L337479J204528L079300
$$ 713627548 702905121 714193573 716227188 702930984 702458191 705795670 707000198 710079498
3739.8G10079498M064408l350373M311676J5052262j1387329k1813965J1166992O758347
$$ 710079498 714143906 710793533 715105209 730157471 718770142 696956177 708123169 714881516
3747.5G14881516R134368m156723j4217605J6111221o381149j1006623O797257O108932
$$ 714881516 724015884 719859161 705641556 721752777 715371628 704365005 711162262 717271194
3755.3G17271194M442444p213516K453995O980438j0586548k544250N443191K315140
$$ 717271194 721713638 714500122 716954117 723934555 713348007 710803757 716246948 718562088
3763G18562088J231003M684753l137436o014023M095002O383667Q73260j0692901J420593
$$ 718562088 719793091 724477844 721340408 715326385 719421387 725805054 726678314 715985413 717406006
3771.7G17406006L527832K00882R65881l97644R77173P29218L772811R69010r736099
$$ 717406006 720933838 721134720 722100601 721702957 722680130 723409348 727182159 728151169 718415070
3780.3G18415070K397918K854920J520996L190994m022140j551285J213074N94100
$$ 718415070 720812988 723667908 725188904 728379898 724357758 722806473 724019547 724613647
3788G24613647J518250P019K670L23029Q72803r45206J666565N559997m300384m801788
$$ 724613647 726131897 726138916 726141586 726464615 727337418 726392212 728058777 733618774 729318390 724516602
3797.7G24516602K486801N088196Q743515o890412j4474335L824463L660736N881882
$$ 724516602 727003403 732091599 740835114 733944702 719470367 723294830 726955566 732837448
3805.4G32837448P371979j2606888o358795O066666K162780P91703Q60138j03150J859970
$$ 732837448 740209427 727602539 721243744 727310410 729473190 730264893 731125031 731021881 732881851
3814.1G32881851P786865k52304j9392929N704041Q586807P771530M794617k4566345
$$ 732881851 740668716 740416412 721023483 726727524 735314331 743085861 747880478 723314133
3821.8G23314133j80512O158753K364120L961868J489411n475388j063919K202378
$$ 723314133 723133621 729292374 731656494 735618362 737107773 731632385 730568466 732770844
3829.5G32770844M705963K639541j0838775L479690R479523p845764o82526J2024994
$$ 732770844 737476807 740116348 729277573 732757263 742236786 734391022 733708496 745733490
3837.2G45733490q332748o505204R130097q222962j273346Q742295k344284m903260
$$ 745733490 737400742 730895538 740025635 731802673 730529327 739271622 736927338 732024078
3844.9G32024078K641602J568146R29031L470154j147308J881027P926712o306687
$$ 732024078 734665680 736233826 737162857 740633011 739485703 741366730 749293442 742986755
3852.7G42986755J491318k0165710O39801J2992859j508332k659607L076401M104385
$$ 742986755 744478073 724312363 724952164 737945023 736436691 733777084 736853485 740957870
3860.4G40957870M056702o708069Q34961R949265r616547r826050N340042Q201523
$$ 740957870 745014572 738306503 739141464 749090729 739474182 729648132 734988174 743189697
3868.1G43189697J1057968r205474j5409623M087220P915878M652023j2616043J119690
$$ 743189697 754247665 745042191 729632568 733719788 741635666 746287689 733671646 734791336
3875.8G34791336N011749J27335L640518P497177o170120j1972733P091217J682969
$$ 734791336 739803085 739930420 743570938 751068115 744897995 732925262 740016479 741699448
3883.5G41699448J933136O447372j6610107J274185M959411J547394O704407Q9874
$$ 741699448 743632584 750079956 733469849 734744034 739703445 741250839 747955246 748045120
3891.2G48045120j1287460J137543M817199j901855M30755J474305M219970K906418
$$ 748045120 736757660 737895203 742712402 740810547 741241302 742715607 746935577 749841995
3898.9G49841995j3219146O926498L467026p498322P330017l887863n324936o6681
$$ 749841995 736622849 743549347 747016373 739518051 746848068 742960205 737635269 737568588
3906.7G37568588J666718L081741L66135Q15887p4844Q8882j58081q68377K128677
$$ 737568588 739235306 742317047 742683182 743499069 743424225 743513107 743355026 742486649 744615326
3915.3G44615326L386154m482727m533234N983353k7313n561371K625504L173141K788010
$$ 744615326 748001480 743518753 738985519 744968872 744941559 739380188 742005692 745178833 747966843
3924G47966843k944031m951859J839524K047882J712570l52402k66647J492157l950958
$$ 747966843 745022812 740070953 741910477 743958359 745670929 745318527 745051880 746544037 742593079
3932.7G42593079j797486K155152J94473N59463Q70133n65872o9428L92380K005920
$$ 742593079 740795593 742950745 743145218 743704681 744574814 744008942 743939514 744331894 746337814
3941.4G46337814J362686n155334j422272J574707J748352K387619k399368J063233
$$ 746337814 747700500 742545166 741122894 742697601 744445953 746833572 744434204 745497437
3949.1G45497437P43942l194428K170182j47400j524430Q16956O94656N86472r21555
$$ 745497437 746241379 743046951 745217133 745069733 743545303 744362259 745056915 745643387 744721832
3957.8G44721832Q6136Q0795Q44956N78689k038116J96915L42102M654J105957O12030
$$ 744721832 744807968 744888763 745733719 746312408 744274292 744471207 744813309 744817963 745923920 746535950
3967.4G46535950M75006m48609m81033N24826k7466o44684K30256J342849L18222j282272
$$ 746535950 747010956 746562347 746081314 746606140 746578674 745933990 746164246 747507095 747825317 746543045
3977.1G46543045m89502K87552k99072k70005K65656J4496J69449M34494n43061l44619
$$ 746543045 746053543 746341095 746042023 745772018 746037674 746052170 746221619 746656113 746113052 745768433
3986.7G45768433R3078O01197J031188o96411k82211M36859l60260m07562n95703L82004
$$ 745768433 745861511 746462708 747493896 746797485 746515274 746952133 746591873 746184311 745588608 745970612
3996.3G45970612N76400K33460O23398J32064
$$ 745970612 746547012 746780472 747403870 747535934
4000.2G47535934
$$ 747535934
##END=$$ End of the data block
