##TITLE=$$ Begin of the data block
##JCAMP-DX=5.00 $$ ACD/SpecManager v 10.08
##SPECTROMETER/DATA SYSTEM=Varian
##DATE=20 Nov 2012 14:50:24
##DATA TYPE=INFRARED SPECTRUM
##DATA CLASS=XYDATA
##ORIGIN=
##OWNER=
##NPOINTS=3735
##FIRSTX=399.26403809
##LASTX=4000.35498047
##MAXX=4000.35498047
##MINX=399.26403809
##MAXY=82.90776825
##MINY=39.78986359
##XFACTOR=1.0000000000
##YFACTOR=0.000000100000000
##FIRSTY=62.95550156
##DELTAX=0.96440572
##XUNITS=1/CM
##YUNITS=TRANSMITTANCE
##XYDATA=(X++(Y..Y))
399.3F29555016Q522567r007415j3495598q87261J857796l425484q735P535629N830498
$$ 629555016 638077583 629070168 615574570 614687309 616545105 613119621 613110886 620646515 626477013
407.9F26477013m574585p953606K039604O996231j010971o619530k708930J159744
$$ 626477013 621902428 613948822 615988426 622984657 621973686 615354156 612645226 613804970
415.7F13804970l72620k219429n934105k325020J1628075Q915939k78206p921943L20587
$$ 613804970 613432350 611212921 605278816 602953796 614581871 623497810 623219604 615297661 615618248
424.3F15618248j423492k187462j911736k722854K700233l86429j592064J736946L387566
$$ 615618248 614194756 612007294 610095558 607372704 610072937 609686508 608094444 609831390 613218956
433F13218956l26729q301697k184562L78685m095192k259941M207458R140167M513245
$$ 613218956 612892227 604590530 602405968 602784653 598689461 596429520 600636978 609777145 614290390
441.7F14290390J549683R23614k139015m31252M111634J652298j177178K55013k518616
$$ 614290390 615840073 616763687 614624672 614193420 618305054 619957352 618780174 619035187 616516571
450.4F16516571K265625N390167J897965K36931j185151n04531q861962p568702Q960838
$$ 616516571 618782196 624172363 626070328 626307259 625122108 624617577 615755615 608186913 617147751
459.1F17147751P07054k573013o09818L29361K464371L851890j126480m111671m126244
$$ 617147751 617854805 615281792 614671974 615001335 617465706 621317596 620191116 616079445 611953201
467.7F11953201o343231j520080K313041J42174l644295k062340J214791M171333P409630
$$ 611953201 605609970 604089890 606402931 606545105 602900810 600838470 602053261 606224594 613634224
476.4F13634224j412315q370972m882431j0758K40097j096534K30903l107261R47570
$$ 613634224 612221909 603850937 598968506 598957748 599197845 598101311 598332214 595224953 596172523
485.1E96172523P070275L350830k046547k318611j820488l392639P84340J749534k609482
$$ 596172523 603242798 606593628 604547081 602228470 600407982 597015343 597799683 599549217 596939735
493.8E96939735j109581J688805L901520O94389l305549k659226l129120j355667J477051
$$ 596939735 595830154 597518959 601420479 602114868 598809319 596150093 593020973 591665306 593142357
502.5E93142357k633858k753448K574463L349189l87115l579025q65174n31387m434281
$$ 593142357 590508499 587755051 590329514 593678703 593291588 589712563 588847389 588316002 583881721
511.1E83881721k716407k05689j235733l694038k585030j087036n46646N96619j640168
$$ 583881721 581165314 580959625 579723892 576029854 573444824 572357788 571811142 572407761 570767593
519.8E70767593j081352j050300j032372j316299n73693l89557l736915L176460K795181
$$ 570767593 569686241 568635941 567603569 566287270 565713577 565324020 561587105 564763565 567558746
528.5E67558746j533279j50185R54094J891060j624145j599999J132088J215706J530571
$$ 567558746 566025467 565875282 566829376 568720436 567096291 565496292 566628380 567844086 569374657
537.2E69374657J717262K580986M075966L693771J22833M04397J410827O50978q2474
$$ 569374657 571091919 573672905 577748871 581442642 581565475 581969872 583380699 584031677 583949203
545.9E83949203L4600J676750j093025j221276J916314R74960n47981o3515p0915k876053
$$ 583949203 583983803 585660553 584567528 583346252 585262566 586237526 585689545 585626030 585555115 582679062
555.5E82679062k813912k793006k506028J47629k49939q22830j893921j951370j045037
$$ 582679062 579865150 577072144 574566116 574713745 574463806 573640976 571747055 569795685 568750648
564.2E68750648j045532k458687m068069l297195k893372j350746j469612j059075
$$ 568750648 567705116 565246429 561178360 557881165 554987793 553637047 552167435 551108360
571.9E51108360j688728j653214J575547P74650J8730R308J331101J172485J059723
$$ 551108360 549419632 547766418 549341965 550116615 550135345 550144653 551475754 552648239 553707962
580.6E53707962L224907K954102L516578L884354L479385J738548J388321P31469O48040
$$ 553707962 556932869 559886971 563403549 567287903 570767288 572505836 573894157 574625626 575273666
589.3E75273666K265625J841660J932144J18141n30853O65398J041183J79138n75065
$$ 575273666 577539291 579380951 581313095 581431236 580900383 581565781 582606964 582786102 582211037
597.9E82211037N45387j315765j164093L03688j06392J514358L90549o90689J50871
$$ 582211037 582756424 581440659 580276566 580580254 580473862 581988220 582378769 581688080 581838951
606.6E81838951L39012P29561O76499M2076n48211m11186O10276Q36753K61307K068367
$$ 581838951 582177963 582907524 583584023 583626099 583077888 582666702 583276978 584113731 584375038 586443405
616.3E86443405K215233L08647N42793J712914J850357L93295J874161L042297J717225
$$ 586443405 588658638 588967285 589510078 591222992 593073349 593466644 595340805 598383102 600100327
624.9F00100327J610183J684342J480064O46820K49901J229935J465606L05939O26106
$$ 600100327 601710510 603394852 604874916 605521736 605771637 607001572 608467178 608773117 609399223
633.6F09399223Q52204k62299O64215K169419K026863k18811r51233L00560J13525
$$ 609399223 610251427 609989128 610653343 612822762 614849625 614630814 613679581 613980141 614093666
642.3F14093666L55492R03206L44467P71827K790108K731896P56454l21960q91610
$$ 614093666 614449158 615352364 615696831 616468658 619258766 621990662 622747116 622425156 621533546
651F21533546o30798O71692J278610j2970m03595L23906Q79479K287292J979370K38457
$$ 621533546 620902748 621574440 622853050 622840080 622436485 622760391 623639870 625927162 627906532 628144989
660.6F28144989o80351j056443l91845m06532r67293J487808J717033m302101M505844
$$ 628144989 627464638 626408195 626016350 625609818 624642525 626130333 627847366 623545265 628051109
669.3F28051109K811547J127128J372681J41106k53602m17938j01623k68326q8120
$$ 628051109 630862656 631989784 633362465 633503571 633249969 632832031 632730408 632462082 632373962
678F32373962J679917K745132K911911J274033P15103R29871n22995j683808j084709
$$ 632373962 634053879 636799011 639710922 640984955 641700058 642629929 642106934 640423126 639338417
686.7F39338417k90527k76566P93419P89490N01785J486435J159439L19519m11224
$$ 639338417 639047890 638771324 639564743 640354233 640856018 642342453 643501892 643821411 643410187
695.3F43410187j536942k327308k265130j338462l02010l22266l61747K77595K42577
$$ 643410187 641873245 639545937 637280807 635942345 635640335 635318069 634956322 635233917 635476494
704F35476494M15535l86124j947403j627960j095505j202163m00582J212883J856613
$$ 635476494 635892029 635505905 633558502 631930542 630835037 629632874 629232292 630445175 632301788
712.7F32301788K036705K217560K494316K971115J444092L98712J515732J616516N02243
$$ 632301788 634338493 636556053 639050369 642021484 643465576 643864288 645380020 646996536 647498779
721.4F47498779R33304K627182L189697L276444M513855L704376J138306P40661M78516
$$ 647498779 648432083 651059265 654248962 657525406 662039261 665743637 666881943 667622604 668101120
730.1F68101120P23343O91299R9259Q97979J598206K785873K636338J702728J683197
$$ 668101120 668824463 669515762 669615021 670513000 672111206 674897079 677533417 679236145 680919342
738.7F80919342J005402l53623j173858r79157m70352L00751o08368p94297J1750Q6441
$$ 680919342 681924744 681571121 680397263 679418106 678947754 679248505 678640137 677845840 677857590 677944031
748.4F77944031J09405j075897k150421k982254k521515k339020k151947j579666j821823
$$ 677944031 678053436 676977539 674827118 671844864 669323349 666984329 664832382 663252716 661430893
757.1F61430893M28238P51877l44620r47876l171845k614440r21402k18125n14068
$$ 661430893 661859131 662611008 662266388 661318512 658146667 655532227 654610825 654392700 653878632
765.7F53878632q38166L09906J406708K615814L114395L992920L818207J313400P26700
$$ 653878632 653040466 653350372 654757080 657372894 660487289 664480209 668298416 669611816 670338516
774.4F70338516K277756K674942K181854K970124L873214L969116K998581K482148
$$ 670338516 672616272 675291214 677473068 680443192 684316406 688285522 691284103 693766251
782.1F93766251K796249K792892J273423K74887J304931O18515J180954J022721J550293
$$ 693766251 696562500 699355392 700628815 700903702 702208633 702827148 704008102 705030823 706581116
790.8G06581116M019775K603455J978759J380311P31735J040649J269303O65588m89884
$$ 706581116 710600891 713204346 715183105 716563416 717295151 718335800 719605103 720270691 719780807
799.5G19780807J825409K488404J360245J605224K490769J941528O36291O92215o71081
$$ 719780807 721606216 724094620 725454865 727060089 729550858 731492386 732128677 732820892 732149811
808.2G32149811p22351j004181j336594N63507J334763J229019J426773Q53272m77753
$$ 732149811 731427460 730423279 729086685 729650192 730984955 732213974 733640747 734494019 734016266
816.9G34016266n06745q47396n50919p40280j326676p54547n25741Q53653j26190m37394
$$ 734016266 733509521 732662125 732111206 731370926 730044250 729289703 728763962 729617615 729491425 729054031
826.5G29054031L97950p24869j783066k829971k121353k730408k350464r74197j495591
$$ 729054031 729451981 728727112 726944046 724114075 721992722 719262314 716911850 715937653 714442062
835.2G14442062n90744L86811k73133j630172j664353j829529j842270k344131l173065
$$ 714442062 713851318 714238129 713964996 712334824 710670471 708840942 706998672 704654541 701481476
843.9G01481476k416229j808243R8877J56173q44726l44086m88586p86057j811523
$$ 701481476 699065247 697257004 697355881 697512054 696667328 696323242 695834656 695048599 693237076
852.5F93237076k072525k441330k208405j569214k292633k227172p88880J122742J278305
$$ 693237076 691164551 688723221 686514816 684945602 682652969 680425797 679636917 680759659 682037964
861.2F82037964O64596L73993J177063K622452K440262K882233L887024M625854M082642
$$ 682037964 682702560 683076553 684253616 686876068 689316330 692198563 696085587 700711441 704794083
869.9G04794083M183273M751205M131318M026794K445526J421127J40076K91596L61175
$$ 704794083 708977356 713728561 717859879 721886673 724332199 725753326 725893402 726184998 726546173
878.6G26546173j76468R30481k83203L69110l99933k022018j185379k026138l174592
$$ 726546173 726369705 727300186 727016983 727386093 726986160 724964142 723778763 721752625 718578033
887.3G18578033l799209k949066k677841k758027k382736j864548j303787k109375
$$ 718578033 714778824 711829758 709151917 706393890 704011154 702146606 700842819 698733444
895F98733444k441330k480163j743088j349564k086792k754211k851410j357651j152572
$$ 698733444 696292114 693811951 692068863 690719299 688632507 685878296 683026886 681669235 680516663
903.7F80516663j360321j469803l142014l411941k406617k730636m119873m228592
$$ 680516663 679156342 677686539 674544525 671132584 668725967 665995331 661875458 657646866
911.4F57646866l490219l148804l214798m232025m355965l679962l059845k420692
$$ 657646866 654156647 651007843 647793045 643561020 639205055 635525093 632465248 630044556
919.1F30044556k266236k298584l474884j678505K18277j141586n14793n47982k45170
$$ 630044556 627778320 625479736 622004852 620326347 620544624 619403038 618888245 618340263 618095093
927.8F18095093P98378N65986P88994O30303L82232M33998J056939J174774P62100
$$ 618095093 618893471 619459457 620248451 620878754 621260986 621694984 622751923 623926697 624688797
936.4F24688797R15680J242638J554412J766091J580047R83048J818046J877671K89230
$$ 624688797 625604477 626847115 628401527 630167618 631747665 632730713 634548759 636426430 636715660
945.1F36715660k58064j521187k569351k675896l592415m109382m420967m786530n115433
$$ 636715660 636457596 634936409 632367058 629691162 626098747 621989365 617568398 612781868 607666435
953.8F07666435n192756n186654n477600o624641o644211n789680o536713o665955
$$ 607666435 602473679 597287025 591809425 585184784 578540573 572750893 566214180 559548225
961.5E59548225o573867o563301p284203o926651n938873o994286p618484p790909
$$ 559548225 552974358 546411057 539126854 532200203 526261330 519267044 511648560 503857651
969.2E03857651p301064p352905p419663p996406p372933o696205p722435o657219
$$ 503857651 496556587 489203682 481784019 473787613 466414680 459718475 451996040 445338821
976.9D45338821o513137n705300n782280m701195m243659m939194k871018l888015
$$ 445338821 438825684 433120384 427338104 422636909 418393250 413454056 410583038 406695023
984.7D06695023k330399j864510j520156k05422q04558l66821j665802l8719P3433
$$ 406695023 404364624 402500114 400979958 400774536 399969978 399603157 397937355 397898636 397972069
993.3C97972069K0408K61765K56271J130905P5875J075363O5346R93118J220474L06740
$$ 397972069 397992477 398254242 398510513 399641418 399717293 400792656 400858002 401851120 403071594 403378334
1003D03378334p477r08851J238975m71802m95987j83906o15502p89031j290970P88231
$$ 403378334 403370857 402462006 403700981 403229179 402733192 402549286 401933784 401144753 399853783 400642014
1012.6D00642014n88456P172o4507j10817L06778k73551R19990K0332J037865P58972
$$ 400642014 400053558 400060730 399996223 399885406 400192184 399918633 400838623 400858955 401896820 402655792
1022.3D02655792J331444J504288O98852J209526J288796K360077K43530O71501J085358
$$ 402655792 403987236 405491524 406190376 407399902 408688698 411048775 411292305 411963806 413049164
1031D13049164J528702J968574J097679J434326m74319J407204J048660L21503K46772
$$ 413049164 414577866 416546440 417644119 419078445 418604126 420011330 421059990 421381493 421628265
1039.6D21628265n74798M53567o50596J149444N32990N00259L4523l30238J328544
$$ 421628265 421053467 421507034 420856438 422005882 422538872 423039131 423073654 422743416 424071960
1048.3D24071960N4970J213913K19727J683082J558380O38123L251686L119812L041191
$$ 424071960 424126930 425340843 425560570 427243652 428802032 429440155 432691841 435811653 438852844
1057D38852844K023430L329659K599830L017159L939628L781929M921379K978669L616485
$$ 438852844 440876274 444205933 446805763 449822922 453762550 457544479 462465858 465444527 469061012
1065.7D69061012K524185K635842J961059o63070j778031m163093l490563m635849
$$ 469061012 471585197 474221039 476182098 475519028 473740997 469577904 466087341 461451492
1073.4D61451492m136772m237747l457184q11462j458168M20417o37664L64227L63655
$$ 461451492 457314720 453076973 449619789 448808327 447350159 447770576 447132912 447497139 447860794
1082.1D47860794L08418J689339J429176K777901J173782K800179K872505K619972
$$ 447860794 448169212 449858551 451287727 454065628 455239410 458039589 460912094 463532066
1089.8D63532066K321511J333351K992325J785278J784058P95822K135009K178154
$$ 463532066 465853577 467186928 470179253 471964531 473748589 474544411 476679420 478857574
1097.5D78857574N48554J559448J124878J389847n10483l9596L17459P6675L35808
$$ 478857574 479406128 480965576 482090454 483480301 482969818 482930222 483247681 483324356 483660164
1106.2D83660164J49536J600266K63748J493835K066841K133980J678886R68934K042274
$$ 483660164 483809700 485409966 485673714 487167549 489234390 491368370 493047256 494016190 496058464
1114.9D96058464J165733K170792J295204J513481J206704N10368J280861L32145K008515
$$ 496058464 497224197 499394989 500690193 502203674 503410378 503920746 505201607 505533752 507542267
1123.5E07542267J529198J605834J530762J152535P52830j72653K209282K244148K594719
$$ 507542267 509071465 510677299 512208061 513360596 514113426 513940773 516150055 518394203 520988922
1132.2E20988922J724510J565476J967125J19018j53007r07860r37119k389068j941071
$$ 520988922 522713432 524278908 526246033 526365051 526212044 525304184 524367065 521977997 520036926
1140.9E20036926j818275k784805k150460l447380k245827k760658k524872k415962
$$ 520036926 518218651 515433846 513283386 509836006 507590179 504829521 502304649 499888687
1148.6D99888687k434273j046714k523308j456948j895523j175537r69085o42128R68780
$$ 499888687 497454414 496407700 493884392 492427444 490531921 489356384 488387299 487745171 488713951
1157.3D88713951M959J077080O5994L93410L82729J069183K646637J635284K154198
$$ 488713951 488718910 489795990 489861984 490255394 490638123 491707306 494353943 495989227 498143425
1166D98143425K887650M635581L408394L370362M144706M352990N395774M224701M893189
$$ 498143425 501031075 505666656 509075050 512445412 516590118 520943108 526338882 530563583 535456772
1174.6E35456772N044136N576744N264740N023346N381775M631996N157738M555855
$$ 535456772 540500908 546077652 551342392 556365738 561747513 566379509 571537247 576093102
1182.4E76093102N085639M886742L821716L657952L745498M160653L436470L487854
$$ 576093102 581178741 586065483 589887199 593545151 597290649 601451302 604887772 608375626
1190.1F08375626L109626K411118J824684J250267J076660O58226J203842J138726
$$ 608375626 611485252 613896370 615721054 616971321 618047981 618706207 619910049 621048775
1197.8F21048775Q67386M62417P3738J233444J320267M19235R6970P2136K81219J069413
$$ 621048775 621916161 622378578 622452316 623685760 625006027 625425262 625522232 625594368 625875587 626945000
1207.4F26945000J293258J147957J813355J769218J350250J823159K261505J478691
$$ 626945000 628238258 629386215 631199570 632968788 634319038 636142197 638403702 639882393
1215.1F39882393J089210J272431J273193J144104P42874J095505J291046J242523
$$ 639882393 640971603 642244034 643517227 644661331 645404205 646499710 647790756 649033279
1222.9F49033279J098862L13492j63117o46743j180115j083069p00912n45349n54886
$$ 649033279 650132141 650445633 650282516 649635773 648455658 647372589 646671677 646126328 645571442
1231.5F45571442k56653o2714K94800J93710n09491j059646j268769p33032q73489
$$ 645571442 645314789 645252075 645546875 645740585 645231094 644171448 642902679 642169647 641296158
1240.2F41296158r19953l04260L66974R90372M44183N88074J137314P35397L35007
$$ 641296158 640376205 640071945 640438919 641429291 641873474 642461548 643598862 644334259 644669266
1248.9F44669266k38495l48053J36413O47049P53708R14231J315612J052933J209946
$$ 644669266 644430771 644082718 644219131 644866180 645619888 646534119 647849731 648902664 650112610
1257.6F50112610J118393J01242l73764j28861P7591k64587K77939O36444P59811J543122
$$ 650112610 651231003 651332245 650958481 650829620 650907211 650642624 650920563 651557007 652316818 653859940
1267.2F53859940J605148J721802J303482M55017k15759q0338M20456K7161L30123
$$ 653859940 655465088 657186890 658490372 658945389 658729630 658649292 659069748 659096909 659427032
1275.9F59427032L60489M39072R30176R98535M05655m54788j96915m95529p72171q23822
$$ 659427032 659787521 660226593 661156769 662155304 662560959 662106171 661909256 661413727 660641556 659817734
1285.5F59817734r20944k40708N89447Q45947M26102L79105K89001k07062j193084
$$ 659817734 658896790 658656082 659245529 660091476 660517578 660896683 661185684 660978622 659785538
1294.2F59785538j575012j401368j513137r62754o26831o0196k4338j02005J47706
$$ 659785538 658210526 656809158 655296021 654333267 653706436 653646240 653621902 653519897 653667603
1302.9F53667603n45350j122741j763535j408691j326065j497498o33087n12772l07846
$$ 653667603 653122253 651999512 650235977 648827286 647501221 646003723 645370636 644857864 644550018
1311.6F44550018N7831K95181R003p56988q80280j091232j311798j614190j109886
$$ 644550018 644607849 644903030 644912033 644155045 643274765 642183533 640871735 639257545 638147659
1320.3F38147659j46217k30598l86620j86882j79329o93626j510430k401466k881889
$$ 638147659 638001442 637770844 637384224 637197342 637018013 636324387 634813957 632412491 629530602
1328.9F29530602k468262k173844k002601j323090j004753m56505N0087p0076q51402
$$ 629530602 627062340 624888496 622885895 621562805 620558052 620101547 620151634 620081558 619230156
1337.6F19230156p65610r95483k127915q70056L2349J1825l1242N99556J085396R09996
$$ 619230156 618464546 617469063 615341148 614471092 614503441 614515266 614484024 615083580 616168976 617078972
1347.3F17078972P87239K46124p15141j166840p59124o46821m48608n57327m35524
$$ 617078972 617866211 618112335 617397194 616230354 615471230 614824409 614375801 613818474 613382950
1355.9F13382950N73845J37329P0114L12691o11573q43505k38495k028389j551132
$$ 613382950 613956795 614094124 614164238 614476929 613865356 613021851 612783356 610754967 609203835
1364.6F09203835k5597k96669N49049K42806k00997R08394j2817K15149O45828O5308
$$ 609203835 609178238 608881569 609430618 609673424 609472427 610380821 610368004 610583153 611228981 611294289
1374.3F11294289j493149m90990R65119L10936J099891P47109P13920J206818P27272
$$ 611294289 609801140 609310150 610275269 610586205 611686096 612433205 613147125 614353943 615081215
1382.9F15081215M75883K72103J220398R81674J94206J181870K000999J822052J503792
$$ 615081215 615557098 615829201 617049599 618031273 618225479 619407349 621408348 623230400 624734192
1391.6F24734192J742744J607705P58705j966248l94134K05307o19050k445297q78982
$$ 624734192 626476936 628084641 628843346 626877098 626482964 626688271 626069221 623623924 622744942
1400.3F22744942J141281r2659M26216Q01468j506729j587906j98097m32396j275788
$$ 622744942 623886223 623793564 624219780 625021248 623514519 621926613 621728516 621296120 620020332
1409F20020332j372718j031075k53448n38025j10550J97143l9863N41191p20673K22130
$$ 620020332 618647614 617616539 617363091 616825066 616714516 616911659 616871796 617412987 616692314 616914444
1418.6F16914444l618507j761094J766816N59883M58717j401367N48248J482086M63715
$$ 616914444 613295937 611534843 613301659 613861542 614320259 612918892 613467140 614949226 615412941
1427.3F15412941J129379J83106r18312q18024J002121M43077M5586K046737J083336
$$ 615412941 616542320 616725426 615807114 614989090 615991211 616434288 616479874 618526611 619609947
1436F19609947k344360O64253L053207R11141j65939L13034p8163Q24775K56882R77936
$$ 619609947 617265587 617929840 620983047 621894188 621728249 622041283 621963120 622787895 623044777 624022713
1445.6F24022713J097526P52144o95534k09121R27467n80406j051674j298447R39942
$$ 624022713 625120239 625872383 625176849 624967728 625895195 625314789 624263115 622964668 623904610
1454.3F23904610Q94165n34706k213211m855233K576714K56653J802902N04951J22071
$$ 623904610 624798775 624264069 622050858 617195625 619772339 620028992 621831894 622336845 622458916
1463F22458916J934471j562195J052551J633873K305298J866531L039513M104309K965241
$$ 622458916 624393387 622831192 623883743 625517616 627822914 629689445 632728958 636833267 639798508
1471.7F39798508M287872m4250M560318M169921K151490J563110K917786L717575K750549
$$ 639798508 644086380 644042130 648602448 652772369 654923859 656486969 659404755 663122330 665872879
1480.3F65872879L353577K052383L299027K555618J758575K963181J107101J908264
$$ 665872879 669226456 671278839 674577866 677133484 678892059 681855240 682962341 684870605
1488.1F84870605K650300K294998j105194K186584L222885K084427K964325J737289
$$ 684870605 687520905 689815903 688710709 690897293 694120178 696204605 699168930 700906219
1495.8G00906219j937561J300889J859130r44137J735000K168503P21283K457428L171463
$$ 700906219 698968658 700269547 702128677 701184540 702919540 705088043 705809326 708266754 711438217
1504.5G11438217N281601j507034r350357K829818J602021J940307J813279J811065
$$ 711438217 716719818 715212784 705862427 708692245 710294266 712234573 714047852 715858917
1512.2G15858917q43887J944351J987000J015472J852875n044480L588562L346787
$$ 715858917 715015030 716959381 718946381 719961853 721814728 716770248 720358810 723705597
1519.9G23705597p08695j575698k125245L511963L038941k81906l79563K306671q42819
$$ 723705597 722996902 721421204 719295959 722807922 725846863 725564957 725185394 727492065 726649246
1528.6G26649246l70941K077866M68444J223145r43222k259750K278595J348648J883926
$$ 726649246 726278305 728356171 728824615 730047760 729104538 726844788 729123383 730472031 732355957
1537.2G32355957L159561J221085j0555039M470673J709442k123642K146912J12762
$$ 732355957 735515518 736736603 726181564 730652237 732361679 730238037 732384949 732497711
1545G32497711j952896J719437J620178J338577j85776l839721P37991J948395J786194
$$ 732497711 730544815 732264252 733884430 735223007 735037231 731197510 731935501 733883896 735670090
1553.6G35670090k070160j962815M555359M575730j395722j214904j1364899L156509
$$ 735670090 733599930 731637115 736192474 740768204 739372482 738157578 726792679 729949188
1561.4G29949188J897278J360016Q17795k556381j067048L26386J089249J485977n216141
$$ 729949188 731846466 733206482 734024277 731467896 730400848 730727234 731816483 733302460 728086319
1570G28086319m08554J054535q39005m16565J460801N31158q431931Q69294J260070
$$ 728086319 727677765 728732300 727893295 727476730 728937531 729468689 721036758 721906052 723166122
1578.7G23166122j84097j8463m47311l64304j371384j351928j469193j112518o56204
$$ 723166122 722982025 722963562 722516251 722151947 720780563 719428635 717959442 716846924 716190720
1587.4G16190720j000901m01458j063004k1057p97501j560592j253662k002259j619720
$$ 716190720 715189819 714788361 713725357 713704300 712906799 711346207 710092545 708090286 706470566
1596.1G06470566k538681j407013j372147j103439r73663j173935p41730k029801j047363
$$ 706470566 703931885 702524872 701152725 700049286 699075623 697901688 697159958 695130157 694082794
1604.7F94082794j366424j937256l051529j679230j390228l163834j080017j884537
$$ 694082794 692716370 690779114 687727585 686048355 684658127 681494293 680414276 678529739
1612.5F78529739r02633q19168M67376K33918j0577622k14004n47944r49249j671371
$$ 678529739 677627106 676807938 677275314 677509232 666931610 666717606 666169662 665220413 663549042
1621.1F63549042K53296m5777n306472P73696N31464Q42896k146836l248443q11158
$$ 663549042 663802338 663756561 658450089 659223785 659755249 660598145 658451309 655202866 654391708
1629.8F54391708j651458r68933j037980J433564K352829m872437j875992K299423
$$ 654391708 652740250 651771317 650733337 652166901 654519730 649647293 647771301 650070724
1637.5F50070724j16119L25241L26691j213226N37719j95541J643448K609253k41700
$$ 650070724 649954605 650279846 650606537 649393311 649931030 649735489 651378937 653988190 653746490
1646.2F53746490J231690j150208J864777K544861L716431N187683P98874j2461930
$$ 653746490 654978180 653827972 655692749 658237610 661954041 667141724 667940598 655478668
1653.9F55478668L769837M620742K859726K208329J908874K136765K857971L563385
$$ 655478668 659248505 663869247 666728973 668937302 670846176 672982941 675840912 679404297
1661.6F79404297J033401k035751K124176K032318J589432K548523L305130M30908
$$ 679404297 680437698 678401947 680526123 682558441 684147873 686696396 690001526 690432434
1669.4F90432434J594009L725434J185913K816315M034576N42984l073654L126373
$$ 690432434 692026443 695751877 696937790 699754105 703788681 704331665 701258011 704384384
1677.1G04384384L274002K775574K824936P56988M087296O354523M054565q115616
$$ 704384384 707658386 710433960 713258896 714015884 718103180 724457703 728512268 720396652
1684.8G20396652P32041M721069L348541P12509Q62046Q70590K576904L322373K833404
$$ 720396652 721128693 725849762 729198303 729910812 730772858 731643448 734220352 737542725 740376129
1693.5G40376129M717941M081955p026519J779937M409027N458680m41132r317779
$$ 740376129 745094070 749176025 742149506 743929443 748338470 753797150 753356018 744038239
1701.2G44038239N511398M190674K832946J208573J331711q77304j8845J788483P11517
$$ 744038239 749549637 753740311 756573257 757781830 759113541 758236237 758217392 760005875 760717392
1709.9G60717392q61969j1063J471100K639008P58972q86765M137803L278961p578125
$$ 760717392 759855423 759844360 761315460 763954468 764713440 763826675 767964478 771243439 763665314
1718.5G63665314L46451J903152P67899K61917J08184l97949P43561J039658Q19473
$$ 763665314 764011765 765914917 766682816 766944733 767052917 766654968 767398529 768438187 769257660
1727.2G69257660J896133K374268q50525k189331K667389L041153l862610p985306
$$ 769257660 771153793 773528061 772677536 770488205 773155594 776196747 772334137 764348831
1734.9G64348831M120484M338302K071533L399735L15857m280472K269974K111358
$$ 764348831 768469315 772807617 774879150 778278885 778594742 774314270 776584244 778695602
1742.7G78695602j137542j387329J862945J522522J176758J378708L36075L988952
$$ 778695602 777558060 776170731 778033676 779556198 780732956 782111664 782447739 786436691
1750.4G86436691j23520k891616K295455R47495J015854J965713j475372k18658K014160
$$ 786436691 786313171 783421555 785717010 786664505 787680359 789646072 788170700 787952042 789966202
1759G89966202K362289L648682j042252j242141K267074M25797O0730O90231R94263
$$ 789966202 792328491 795977173 794934921 793692780 795959854 796385651 796446381 797136612 798130875
1767.7G98130875k766571J607284M749909J746292j838379l210831L177948J397324
$$ 798130875 795364304 796971588 801721497 803467789 801629410 798418579 801596527 802993851
1775.4H02993851k361832R57642O04782J023254J11771r16672P76901J848603J976165
$$ 802993851 800632019 801589661 802194443 803217697 803329468 802412796 803189697 805038300 807014465
1784.1H07014465n52215k20871P20978o27823p84760J157684Q56476K90757j531525
$$ 807014465 806462250 806241379 806962357 806334534 805549774 806707458 807563934 807854691 806323166
1792.8H06323166p85751L562088J329422j410141J83944J264572l13720k005387J277848
$$ 806323166 805537415 809099503 810428925 809018784 809202728 810467300 810153580 808148193 809426041
1801.5H09426041l58506k33230J239166Q67844J211319M65774j65100J87760Q64944
$$ 809426041 809067535 808834305 810073471 810941315 812152634 812618408 812453308 812641068 813506012
1810.2H13506012j608200p60880M95453k88543J046142O89469R52224M0207M5548J034698
$$ 813506012 811897812 811136932 811632385 811343842 812389984 813079453 814031677 814071884 814117432 815152130
1819.8H15152130k84805J17340o36292K12861R36203k282563r5520K201386K719726
$$ 815152130 814867325 814984665 814348373 814561234 815497437 813214874 813119354 815320740 818040466
1828.5H18040466J393891m402085o28967J869736p5302k46048l43247J30005M07181
$$ 818040466 819434357 815032272 814403305 816273041 816197739 815951691 815608444 815738449 816145630
1837.2H16145630k94953R45588K37121N22385K92663J064454J338958n227432P71408
$$ 816145630 815850677 816796265 817033386 817555771 817848434 818912888 820251846 815024414 815795822
1845.8H15795822J821976m01840l99628Q14896J164093l22495j35879j06583j526k99530
$$ 815795822 817617798 817215958 816816330 817631226 818795319 818472824 818336945 818230362 818228836 817929306
1855.5H17929306k03552L08990j29394K04086j90124P4691j47171M22211M51965j24130
$$ 817929306 817725754 818034744 817905350 818109436 817919312 817994003 817846832 818269043 818721008 818596878
1865.1H18596878O36902k91443L82309j077423j535111R30329O48117P30438L09067
$$ 818596878 819233780 818942337 819324646 818247223 816712112 817642441 818290558 819020996 819330063
1873.8H19330063K40249k35061j80435O7291R7427R0409q6747O26069N8288N61295
$$ 819330063 819570312 819335251 819154816 819222107 819319534 819409943 819323196 819949265 820007553 820568848
1883.4H20568848R2010o01044J43128p7973J242600j07574k537842K98691J169052
$$ 820568848 820660858 820059814 820202942 820124969 821367569 821259995 818722153 819020844 820189896
1892.1H20189896L71780R21097M60281j042175J55868k80532k71073O6910m31824J35346
$$ 820189896 820561676 821482773 821943054 820900879 821056747 820776215 820505142 820572052 820140228 820275574
1901.8H20275574K70767P39746J16119k05001K30636N6763j43814l02201o86721m72794
$$ 820275574 820546341 821286087 821402206 821197205 821427841 821484604 821340790 821038589 820351868 819879074
1911.4H19879074O70090r1019K02484J72196M15802K157745j309357j579132O70395
$$ 819879074 820549164 820458145 820660629 820832825 821248627 823406372 822097015 820517883 821188278
1920.1H21188278M26331O79016j191940j188736L59649L15094K25983M91333J01318
$$ 821188278 821614609 822293625 821101685 819912949 820272598 820587692 820813675 821305008 821406326
1928.8H21406326J74485L09600j66626j37939p03430j72653N8670j7853K33459L46070
$$ 821406326 821580811 821890411 821723785 821585846 820882416 820709763 820768433 820750580 820984039 821330109
1938.4H21330109O95190l433R32770j52054k677460J83334N74418n76630k08664N18799
$$ 821330109 822025299 822021866 822954636 822802582 820125122 820308456 820882874 820306244 820097580 820616379
1948.1H20616379M52804M87290K69470K71454J39160n19409k57797n60074l32871j81961
$$ 820616379 821069183 821556473 821825943 822097397 822236557 821717148 821459351 820899277 820566406 820384445
1957.7H20384445k4414O39801M96445N78613J13449L8529k34681k33154J7395j061020
$$ 820384445 820360031 820999832 821496277 822074890 822188339 822226868 821992187 821759033 821776428 820715408
1967.3H20715408p09839M43955P26776M1428M52346R50852J25351j87302l11355j62964
$$ 820715408 820005569 820449524 821176300 821217728 821670074 822620926 822746277 822558975 822247620 822084656
1977H22084656o55976o84967p6675P4692K48947M25110P35321L69949J59760j59607
$$ 822084656 821428680 820743713 820667038 820741730 820990677 821415787 822151108 822521057 822680817 822521210
1986.6H22521210k12174n30319j033249K52228J89743q40225N5923J022263Q29468
$$ 822521210 822309036 821778717 820745468 820997696 821187439 820347214 820403137 821425400 822254868
1995.3H22254868L20739L7537n26199n28489m81414n58548m55475K02942L64837J3886
$$ 822254868 822575607 822613144 822086945 821558456 821077042 820518494 820063019 820265961 820630798 820644684
2005H20644684M74090M42505M40445J9150o18362n43137n51147l18680k03858l28827
$$ 820644684 821118774 821561279 822001724 822020874 821402512 820859375 820308228 819989548 819785690 819456863
2014.6H19456863J32294O90384l6087P0953K43302l56064n0812l85055l12653m50134
$$ 819456863 819589157 820279541 820243454 820314407 820557709 820201645 820150833 819765778 819453125 819002991
2024.2H19002991o36978l9673J06735L74756K98309L12119j16349m23278m66919p75986
$$ 819002991 818366013 818326340 818433075 818807831 819106140 819418259 819301910 818878632 818411713 817635727
2033.9H17635727l55911j33744l16238o15692R9411O44302M99344L59497N0812J43204
$$ 817635727 817279816 817146072 816829834 816214142 816313553 816957855 817457199 817816696 817867508 818010712
2043.5H18010712n82123n23224m26254o61087j19706J10169M42123L66822M40139j41296
$$ 818010712 817428589 816905365 816479111 815818024 815698318 815808487 816250610 816617432 817057571 816916275
2053.2H16916275m87442J14670K48260J63040n75485n10330k92892j3581K12250L08151
$$ 816916275 816428833 816543503 816791763 816954803 816379318 815868988 815576096 815562515 815774765 816082916
2062.8H16082916R79004J86615l89938j94550k8000o9885n73807m43267N6610K71835
$$ 816082916 817061920 817248535 816858597 816664047 816636047 816566162 815992355 815549088 815605698 815877533
2072.5H15877533q011M21829L83149P8887K31629j05362n7068k22397j52359k29568
$$ 815877533 815869522 816291351 816674500 816753387 816985016 816879654 816822586 816600189 816447830 816218262
2082.1H16218262j85547L37906K70157N6533j12915K13852K38724O1722k15912k65274
$$ 816218262 816032715 816370621 816640778 816697311 816584396 816798248 817036972 817098694 816882782 816617508
2091.7H16617508j39923j49384K95029K0370J26572J15967r689L45840J99432J97373
$$ 816617508 816477585 816328201 816623230 816643600 816770172 816886139 816876450 817222290 817421722 817619095
2101.4H17619095k59934j49231O6071R6130N2185k83203J40076K2507J12381L32870
$$ 817619095 817359161 817209930 817276001 817372131 817424316 817141113 817281189 817303696 817416077 817748947
2111H17748947K8381o6452M5090k09122m87747j4496K38724N75714k5024l95508J67236
$$ 817748947 817777328 817710876 817755966 817546844 817059097 817044601 817283325 817859039 817834015 817438507 817605743
2121.6H17605743J67084J56098j83182K23388K6093j72806J77689l82080j68686O8359
$$ 817605743 817772827 817928925 817745743 817969131 817995224 817822418 818000107 817618027 817449341 817517700
2131.3H17517700K50168K10495J87073J22757k64359l89938m44031L20969K43759j1673
$$ 817517700 817767868 817978363 818165436 818288193 818023834 817633896 817189865 817510834 817754593 817742920
2140.9H17742920p4997j44730J17417p6523K99911k9144L891K73285l8757K8076l2959
$$ 817742920 817667923 817523193 817640610 817564087 817863998 817834854 817838745 818112030 818073273 818101349 818068390
2151.5H18068390K98004j37558j29547L55377J41144K6550J15509K38953j19324K12097
$$ 818068390 818366394 818228836 818099289 818454666 818595810 818622360 818737869 818976822 818857498 819069595
2161.2H19069595q3847n93109j6327J36414J90887J68000J26495K29492M00238J34430
$$ 819069595 818985748 818392639 818376312 818512726 818703613 818871613 818998108 819227600 819627838 819762268
2170.8H19762268J70899K10723j17492K18811J29776J08871m2572q9645J25427K02713
$$ 819762268 819933167 820143890 820026398 820245209 820374985 820483856 820441284 820351639 820477066 820679779
2180.5H20679779M39835K14233L14941J8998j55869q6746J22986M13589j04522O8283
$$ 820679779 821119614 821333847 821648788 821667786 821511917 821425171 821548157 821961746 821857224 821925507
2190.1H21925507R8190K21100K83279K13318J44882l71780j97678l84674N3177K78168
$$ 821925507 822023697 822244797 822528076 822741394 822886276 822514496 822316818 821932144 821985321 822263489
2199.8H22263489J89590N63050K36511J56708L81K62833J00097j46408j52588k03476
$$ 822263489 822453079 823016129 823252640 823409348 823409729 823672562 823772659 823626251 823473663 823270187
2209.4H23270187K23008J02691O43769N13458O6376P6980O2027L35236k00272k30179
$$ 823270187 823493195 823595886 824239655 824753113 824819489 824896469 824958496 825293732 825093460 824863281
2219H24863281j66931J40915J68381j05133R5825k5559P05491O99844o9733m45862
$$ 824863281 824696350 824837265 825005646 824900513 824996338 824970779 825676270 826376114 826306381 825860519
2228.7H25860519k31781J12992J7013p4997k28500M86832L49960P7133K56958J58844
$$ 825860519 825628738 825741730 825758743 825683746 825455246 825942078 826292038 826369171 826626129 826784973
2238.3H26784973K35291l53928l15552k75345r4680k72065k84500N70526M52195M20303
$$ 826784973 827020264 826666336 826350784 826075439 825980759 825708694 825424194 825994720 826446915 826867218
2248H26867218K03323N25895K37960k90374K3498n65872m07333m26560k92969M20380
$$ 826867218 827070541 827596436 827834396 827544022 827567520 827001648 826594315 826167755 825874786 826295166
2257.6H26295166P35474M45785l5171K15225K20642J15280n17273m00162j79748j83029
$$ 826295166 827030640 827476425 827441254 827656479 827877121 827992401 827475128 827074966 826895218 826712189
2267.3H26712189L14254q316J11390P0190M57153N09491J51978j8311m09774O9427
$$ 826712189 827026443 827018127 827129517 827199707 827656860 828166351 828318329 828300018 827890244 827959671
2276.9H27959671m82025m36630j05973L06778O13632L14866Q70971L6392k45056l88488
$$ 827959671 827477646 827041016 826935043 827241821 827855453 828170319 829041290 829077682 828832626 828444138
2286.5H28444138j16196J01395p94220n4474k07138L11126L93296j3047J84861j40915
$$ 828444138 828327942 828429337 827635117 827580643 827373505 827684631 828077927 828064880 828249741 828108826
2296.2H28108826M05426l48969j60827j19629l20664l04184q67996L96881N34516P28073
$$ 828108826 828514252 828165283 828004456 827884827 827564163 827259979 826391983 826788864 827323380 828051453
2305.8H28051453j46103m30680O77720l98636m82636o42013K5329R2240l25699J99280
$$ 828051453 827905350 827474670 828152390 827753754 827271118 826629105 826654434 826746674 826420975 826620255
2315.5H26620255P6522R89228N38864j57700j042328j543426l41797J61285K90375
$$ 826620255 826696777 827686005 828224869 828067169 827024841 825481415 825139618 825300903 825591278
2324.2H25591278m78134q2932J58081k44827L12195J351471K18430j568299m55475
$$ 825591278 825113144 825030212 825188293 824943466 825255661 826607132 826825562 825257263 824801788
2332.8H24801788j73721J35574j90506m68063J60141J48087K49023n82199J80282p0037
$$ 824801788 824628067 824763641 824573135 824105072 824265213 824413300 824662323 824080124 824260406 824190369
2342.5H24190369m08173j45874j111908N5389O79856Q35342J298294N05448r48334
$$ 824190369 823782196 823636322 822524414 822579803 823259659 824095001 825393295 825898743 824950409
2351.2H24950409m84924l54309o65894J20010j74484l24936j345367r04083K79312
$$ 824950409 824465485 824111176 823445282 823565292 823390808 823065872 821720505 820816422 821095734
2359.8H21095734P20825L23562j485519j47629Q13828N27420P0343L49960r6893r89151
$$ 821095734 821816559 822140121 820654602 820506973 821320801 821848221 821918564 822268524 822171631 821182480
2369.5H21182480M85382P26700N22308L04642j47705k72446L48587O34079m98276m32434
$$ 821182480 821667862 822394562 822916870 823221512 823073807 822801361 823149948 823784027 823285751 822853317
2379.1H22853317M51203N90591j15433m7531L07999L44086L79486l06931n798j90735
$$ 822853317 823304520 823895111 823779678 823732147 824040146 824384232 824763718 824456787 824450989 824260254
2388.8H24260254m30145R0942j58386O5307k09808k12936J05209J18561O8817m57611
$$ 824260254 823830109 823921051 823762665 823827972 823618164 823405228 823510437 823628998 823697815 823240204
2398.4H23240204j96076J31607J51749l03421m23965q8730k79312J07803K34146j64108
$$ 823240204 823044128 823175735 823327484 823024063 822600098 822511368 822232056 822339859 822574005 822409897
2408.1H22409897k66495k47574k81372l4408L1128k41700r4452R8496J20621k11869
$$ 822409897 822143402 821895828 821614456 821580048 821611176 821369476 821275024 821373520 821494141 821282272
2417.7H21282272l03344k66190o1188j76544o12564O256J40228P0877l51562o59332
$$ 821282272 820978928 820712738 820651550 820475006 819862442 819868698 820008926 820079803 819728241 819068909
2427.3H19068909j98059k27204J27793m0589k41852m76837m15191K27203j30157o2180
$$ 819068909 818870850 818643646 818771439 818730850 818488998 818012161 817596970 817824173 817694016 817631836
2437H17631836k12860k32773J29242j24435m77982o09970o1340r4147j92948O6986
$$ 817631836 817418976 817186203 817315445 817191010 816713028 816103058 816041718 815947571 815754623 815821609
2446.6H15821609j46789n53818n27649k29950K9984M39911k30713n77164j45035k73513
$$ 815821609 815674820 815121002 814593353 814363403 814393387 814833298 814602585 814025421 813880386 813606873
2456.3H13606873l58353j83258m8065j01242Q2168k71149k49938j05515l80249k02866
$$ 813606873 813248520 813065262 813017197 812915955 812998123 812726974 812477036 812371521 811991272 811788406
2465.9H11788406m67300j29166n0659N264L81852j28785l02963j74789k24228p73621
$$ 811788406 811321106 811191940 811141281 811146545 811528397 811399612 811096649 810921860 810697632 809924011
2475.6H09924011k63977K06757l43704j33210J18332K08054j93405k64893l09296k70233
$$ 809924011 809660034 809866791 809523087 809389877 809508209 809716263 809522858 809257965 808948669 808678436
2485.2H08678436n9814l68653m4631k25831r9334M2419j01776P7133j61667p9193n16739
$$ 808678436 808618622 808249969 808205338 807979507 807880173 807922592 807820816 807897949 807736282 807657089 807140350
2495.8H07140350j76162J78527l84674l33404k54669N6305J34887J61820l9444l36991
$$ 807140350 806964188 807142715 806758041 806424637 806169968 806226273 806361160 806522980 806483536 806146545
2505.5H06146545q8424K11563j20697p92389m42276k13699m9439k9373j56784K10495
$$ 806146545 806058121 806269684 806148987 805356598 804914322 804700623 804651184 804621811 804465027 804675522
2515.1H04675522N8060Q3694J03836r1629l20206m39758l54919q0262J96000o5842
$$ 804675522 804733582 804817276 804921112 804829483 804509277 804069519 803714600 803634338 803830338 803764496
2524.7H03764496q164m7454l8300j28708j90735p2632m93774o37817q46558j87531
$$ 803764496 803756332 803708878 803670578 803541870 803351135 803278503 802784729 802146912 801300354 801112823
2534.4H01112823K94648m1733J984j05973J19400p2937K7848m0894p78809o55593j95237
$$ 801112823 801407471 801365738 801367722 801261749 801381149 801308212 801336060 801295166 800516357 799860764 799665527
2545G99665527k31552o75812p9803M94385M03747j09329n85861k50931m12521l57895
$$ 799665527 799433975 798758163 798678360 799172745 799576492 799467163 798881302 798630371 798217850 797859955
2554.6G97859955m17023n81970l19748l11737j12457M34417O60553p7285l99094l98407
$$ 797859955 797442932 796860962 796541214 796229477 796117020 796551437 797211990 797134705 796735611 796337204
2564.3G96337204l93524o18744q64563l64380p858L64837K747J55029J17111l11126
$$ 796337204 795943680 795324936 794460373 794095993 794088135 794452972 794455719 794610748 794727859 794416733
2573.9G94416733L09906m42124q67843p56989m85840o5002k34604K04773K24991J10321
$$ 794416733 794726639 794284515 793416672 792659683 792173843 792108841 791874237 792079010 792304001 792414322
2583.6G92414322l08228k36282J79825j16577n57633q12988n1651j87607q6136J87531
$$ 792414322 792106094 791869812 792049637 791933060 791375427 790562439 790510788 790323181 790237045 790424576
2593.2G90424576k22931K75574J28326j40381l09982m53644l69568k60315l46985n00030
$$ 790424576 790201645 790477219 790605545 790465164 790155182 789701538 789331970 789071655 788724670 788224640
2602.9G88224640l9673j8539n0812k76947K40402N31845n01480n44510p17926p12891
$$ 788224640 788184967 788166428 788115616 787838669 788079071 788610916 788109436 787564926 786847000 786134109
2612.5G86134109k47497N9662P1029O485J44654m24729l92990j46713j06964m89426
$$ 786134109 785886612 785946274 786017303 786023788 786168442 785743713 785350723 785204010 785097046 784607620
2622.1G84607620r03473l72772j24740k73972p73087l88336J37635J02691O3706n69458
$$ 784607620 783704147 783331375 783206635 782932663 782159576 781771240 781908875 782011566 782075272 781505814
2631.8G81505814o78101n99823m64478n27877n28794j21765q3999n7450m21371m51355
$$ 781505814 780827713 780227890 779763412 779235535 778706741 778584976 778500977 778443527 778022156 777570801
2641.4G77570801m22058p06024l40271J64566m63715j246491l73840N1499l63999l18451
$$ 777570801 777148743 776442719 776102448 776267014 775803299 774556808 774182968 774234467 773870468 773552017
2651.1G73552017k33841k79007k49939m31823n52674N9281k84958m99191k13852n76172
$$ 773552017 773318176 773039169 772789230 772357407 771804733 771864014 771579056 771079865 770866013 770289841
2660.7G70289841k05918K5254j46256m65851o96335o66351m55322n7602l22647n41992
$$ 770289841 770083923 770109177 769962921 769497070 768800735 768134384 767679062 767621460 767298813 766756821
2670.4G66756821k77176L6697k27432l80783j54038Q4229Q4915n59845m53873n78231
$$ 766756821 766479645 766516342 766288910 765908127 765754089 765838318 765923233 765363388 764909515 764331284
2680G64331284p14951l20740O4774L85513l07617l14407n03083q10470n42221m82788
$$ 764331284 763616333 763295593 763360367 763745880 763438263 763123856 762620773 761810303 761268082 760785294
2689.6G60785294R8877m92020p23877L586J69677K41166k06452k88391l79333q68531
$$ 760785294 760884171 760392151 759668274 759671860 759841537 760082703 759876251 759587860 759208527 758339996
2699.3G58339996o83136n98068n99823N1422O4087k19498k96020k54822p9880q20007
$$ 758339996 757656860 757058792 756458969 756510391 756574478 756354980 756058960 755804138 755724258 754904251
2708.9G54904251n35583j95694l98636O8588m44794n20172m23736l78952k4033j53656
$$ 754904251 754368668 754172974 753774338 753842926 753398132 752877960 752454224 752075272 752051239 751897583
2718.6G51897583k60468m00085k63519m98657n36271k57721r8953l77426m99268L24784
$$ 751897583 751637115 751237030 750973511 750474854 749938583 749680862 749581909 749204483 748705215 749029999
2728.2G49029999k22550n01480j64184m34265j41678L6392l20435o37359q7967l88108
$$ 749029999 748807449 748305969 748141785 747707520 747565842 747602234 747281799 746644440 746556473 746168365
2737.9G46168365p06634k01263j12992q774o78253l99551J64108j76391p4235p2174
$$ 746168365 745461731 745260468 745147476 745138702 744460449 744060898 744225006 744048615 743974380 743902206
2747.5G43902206k10647k97165K747l08610o02951k71148l69187l13263p9650k03553
$$ 743902206 743691559 743394394 743397141 743088531 742485580 742214432 741845245 741531982 741452332 741248779
2757.2G41248779m91714R7351J19476k21557N798n16892m25415k6321j11923j18027
$$ 741248779 740757065 740854416 740973892 740752335 740758133 740241241 739815826 739789505 739677582 739559555
2766.8G39559555j03149n49164p78961J22604L95050k31171n55725P7591O7826r38874
$$ 739559555 739456406 738907242 738128281 738250885 738645935 738414764 737859039 737936630 738004456 737065582
2776.4G37065582q52279m57764k46811n8212n7526l06473m12826k26822j85242l2425
$$ 737065582 736213303 735755539 735508728 735450516 735392990 735086517 734673691 734446869 734261627 734229202
2786.1G34229202j7090k34146p55233p92084n50385n54352n22995m73785J4038r4757
$$ 734229202 734212112 733977966 733222733 732430649 731880264 731325912 730802917 730329132 730343170 730248413
2795.7G30248413o1340k7924p64389r76791q66776o71844q97675q43811m10232p9499
$$ 730248413 730187073 730159149 729394760 728417969 727551193 726879349 725981674 725137863 724727631 724648132
2805.4G24648132r1247o00891l18375k60162r01261j270218p24792m76456j095505
$$ 724648132 724556885 723955994 723637619 723377457 722476196 721205978 720481186 720004730 718909225
2814G18909225q16116l42560l30505n90897o35299r18045j014557p22199j072540p25403
$$ 718909225 718093109 717750549 717420044 716829147 716193848 715275803 714261246 713539047 712466507 711741104
2823.7G11741104p48672p97882o04783p79647n74723r80987o69174p46155j241303
$$ 711741104 710992432 710194550 709589767 708810120 708235397 707254410 706585236 705839081 704597778
2832.4G04597778q06732j110535j232986j041870j088104j042252q80508j277542j417771
$$ 704597778 703791046 702680511 701447525 700405655 699317551 698275299 697394791 696117249 694699478
2841.1F94699478q36792j350555j595993j391831j448593j197586j633072j811294
$$ 694699478 693862686 692512131 690916138 689524307 688075714 686878128 685245056 683433762
2848.8F83433762j402588j655960j373749r16596j369094j244584r31396p97196r05227
$$ 683433762 682031174 680375214 679001465 678084869 676715775 675471191 674539795 673742599 672837372
2857.4F72837372j011658o05850j024323q99505n51911j046447j111145j246720j386184
$$ 672837372 671825714 671219864 670195541 669296036 668744125 667697678 666586533 665339813 663953629
2866.1F63953629j390458j470031j620713j618042j599273j501465j274796j504745
$$ 663953629 662563171 661093140 659472427 657854385 656255112 654753647 653478851 651974106
2873.8F51974106j553040j573791j771622j900864j434478j332093j998138j458321
$$ 651974106 650421066 648847275 647075653 645174789 643740311 642408218 640410080 638951759
2881.6F38951759r82093j130982j182518q99696p84684j106529n95093p37037q50144
$$ 638951759 637969666 636838684 635656166 634756470 633971786 632865257 632270164 631533127 630682983
2890.2F30682983m41475n02548l43132j94587J78451j00212k17934O3286k93197o33622
$$ 630682983 630241508 629738960 629395828 629201241 629379692 629279480 629061546 629124832 628831635 628198013
2899.9F28198013j011657p11899j68610j30501m99343n63775n40390p78427k94456
$$ 628198013 627186356 626474457 626305847 626175346 625676003 625112228 624571838 623793411 623498955
2908.6F23498955m24309j223831j468239j057701j187592j699295j371536j335525
$$ 623498955 623074646 621850815 620382576 619324875 618137283 616437988 615066452 613730927
2916.3F13730927j122170j120262j547241j482849j385422j289330j408157j293144
$$ 613730927 612608757 611488495 609941254 608458405 607072983 605783653 604375496 603082352
2924F03082352j352043q31910J21117p6027k23541O4621O90384Q34846N00412O37284
$$ 603082352 601730309 600898399 601019516 600943489 600719948 600784569 601474953 602309799 602810211 603447495
2933.6F03447495N85823L20625N79185J514740K012596J614495J467018K303429K549095
$$ 603447495 604033318 604353943 604933128 606447868 608460464 610074959 611541977 613845406 616394501
2942.3F16394501J745300J513939J809463J882935J625137J832772K023849J799736
$$ 616394501 618139801 619653740 621463203 623346138 624971275 626804047 628827896 630627632
2950F30627632J963806K343560K240028J613350J526642J795959J938706J623993J476974
$$ 630627632 632591438 634934998 637175026 638788376 640315018 642110977 644049683 645673676 647150650
2958.7F47150650J592636J587601K126465J806411J497727J689224J596222J760635
$$ 647150650 648743286 650330887 652457352 654263763 655761490 657450714 659046936 660807571
2966.4F60807571J575776J343994J144180J128922J344146J602020J546250J708984
$$ 660807571 662383347 663727341 664871521 666000443 667344589 668946609 670492859 672201843
2974.1F72201843J825638R97696J221313J632081J444702J137085Q69217Q37478N49164
$$ 672201843 674027481 675025177 676246490 677878571 679323273 680460358 681329575 682167053 682716217
2982.8F82716217J004334J131134J263656J379929P97348Q81119R59243R16520O29196
$$ 682716217 683720551 684851685 686115341 687495270 688292618 689173737 690132980 691049500 691678696
2991.5F91678696J30157j0910K67563J70822M68369Q13446O5994L57361J38016j5183
$$ 691678696 691808853 691797943 692065506 692236328 692704697 693518143 693584137 693941498 694079514 694064331
3001.1F94064331M66919K2964j8768j49002j80054m98046l39890J65939M09317L42865
$$ 694064331 694531250 694554214 694535446 694386444 694206390 693708344 693368454 693534393 693943710 694286575
3010.8F94286575o57501n05752l67203m67530r58938r29871j87988p95822j40000j40533
$$ 694286575 693629074 693123322 692756119 692288589 691329651 690399780 690211792 689415970 689275970 689135437
3020.4F89135437r58328q32596n49393l68194j168366j186600p33718o8131J35422
$$ 689135437 688177109 687344513 686795120 686426926 685258560 684071960 683338242 683270111 683405533
3029.1F83405533l22495j000824j864853p75146l24173q39310r32769q87223o49490
$$ 683405533 683083038 682082214 680217361 679442215 679118042 678278732 677345963 676458740 675809250
3037.8F75809250o69632o71539r13163r32693j085053q31222q38242j245956r25217
$$ 675809250 675139618 674468079 673554916 672622223 671537170 670705948 669867706 668621750 667696533
3046.5F67696533p48367o74973j281967p47986m78592j168365q20618q63952n97077
$$ 667696533 666948166 666273193 664991226 664243240 663764648 662596283 661775665 660911713 660314636
3055.1F60314636j231079j565628q76770r49936r09576j124573j008606q11539n87921
$$ 660314636 659083557 657517929 656641159 655691223 654781647 653657074 652648468 651836929 651249008
3063.8F51249008j138077j293182r57947j794891r95255m03595p88879q38242q22219
$$ 651249008 650110931 648817749 647859802 646064911 645069656 644666061 643877182 643038940 642216721
3072.5F42216721p88269j128083q27408q86612j150054j109124o80618n23910j091424
$$ 642216721 641428452 640300369 639472961 638586349 637436295 636327171 635646553 635122643 634031219
3081.2F34031219o48765o80199j166496j201439j147346j188660j209831o90995r67025
$$ 634031219 633382454 632702255 631535759 630334320 629186974 627998314 626788483 626097488 625130463
3089.9F25130463j702881j328697n18609r64698j074562m65546q20198r86328r15756
$$ 625130463 623427582 622098885 621580276 620615578 619541016 619075470 618255272 617268944 616353188
3098.5F16353188o40870j068039j573524j025620j128196j041947o56051r14841j091766
$$ 616353188 615712318 614644279 613070755 612045135 610916939 609874992 609218941 608304100 607212334
3107.2F07212334n67170p22579j072999o14814r24874j177711j206207j279755j038971
$$ 607212334 606645164 605922585 604849586 604234772 603309898 602132187 600925980 599646225 598607254
3115.9E98607254o90803n97001j274070j358071o26449n71671j434669j195412l91083
$$ 598607254 597916451 597319450 596045380 594687309 594060860 593489189 592054520 590859108 590468025
3124.6E90468025n43976q56285j366157j196404j040649j216698r42879l89366l77807
$$ 590468025 589924049 589067764 587701607 586505203 585464554 584247856 583304977 582915611 582537804
3133.3E82537804j570206j429443o55137p49015q95920q78029p96089j019287j194115
$$ 582537804 580967598 579538155 578883018 578134003 577238083 576360054 575563965 574544678 573350563
3141.9E73350563j246529p80258p97233j068192p52792q45299o32973p73544j134148
$$ 573350563 572104034 571323776 570526543 569458351 568705559 567860260 567227287 566453743 565319595
3150.6E65319595n00755l58582j574172j695939p70607p07702n70870p82089o65016
$$ 565319595 564818840 564460258 562886086 561190147 560419540 559711838 559140968 558358879 557693863
3159.3E57693863n76706q88138p60917j188126r36699q09326j059876j082191j103859
$$ 557693863 557117157 556229019 555468102 554279976 553343277 552533951 551474075 550391884 549288025
3168E49288025p88727j053505r08470m45747l92876p39327p42378n62744r30595r03740
$$ 549288025 548499298 547445793 546537323 546091576 545698700 544959373 544216995 543654251 542723656 541819916
3177.6E41819916j008301q96072j038361r82399o71577q76198m27246n74150p59469
$$ 541819916 540811615 539915543 538877182 537894783 537223206 536347008 535919762 535345612 534586143
3186.3E34586143p28836o67686m90990r79385j244049j221886q25615q52051n40657
$$ 534586143 533857307 533189621 532698631 531719246 530475197 529253311 528427696 527575645 527034988
3195E27034988l65333j057015r00611q31223o05431m31404m64248o66085j067466o94733
$$ 527034988 526669655 525612640 524712029 523880806 523275375 522843971 522379723 521713638 520646172 519951439
3204.6E19951439n24979j022567j425019m62570K20604j67999j011124j686249m97093
$$ 519951439 519426460 518403893 516978874 516516304 516736908 516568909 515557785 513871536 513374443
3213.3E13374443l75442j281014p59392p4691j14556j022987j357613m45938j83487
$$ 513374443 512999001 511717987 510958595 510883904 510769348 509746361 508388748 507942810 507759323
3222E07759323q77724n75637m29879o14662n72281r03015m19082o52466j050988n35888
$$ 507759323 506881599 506305962 505876083 505261421 504689140 503786125 503367043 502714577 501663589 501127701
3231.6E01127701r6131m08210r36508j73493l14140j057663r74121o31409o48270q21457
$$ 501127701 501031570 500623360 499686852 499513359 499199219 498141556 497167435 496536026 495887756 495066299
3241.3D95066299n47370l48473L11050n12924j107712l41224p06673n46188n44892
$$ 495066299 494518929 494170456 494481506 493968582 492860870 492519646 491812973 491266785 490721893
3249.9D90721893p49893p47871m26941j80817m26750o1760p30782j148986l91960p8812
$$ 490721893 489972000 489224129 488797188 488616371 488189621 488127861 487397079 486248093 485856133 485777321
3259.6D85777321l55988n26848n94520o20308m9362p39632r48067L2425j21917p67289
$$ 485777321 485421333 484894485 484299965 483679657 483630295 482890663 481942596 481975021 481853104 481085815
3269.2D81085815j037788m18892k07443l17612k61421k11525l75328p87582n21431
$$ 481085815 480048027 479629135 479421692 479104080 478842659 478631134 478255806 477468224 476946793
3277.9D76946793m99993k57339k24839n64422l38745j38893l08228q37212p08885o45523
$$ 476946793 476446800 476189461 475964622 475400200 475061455 474922562 474614334 473777122 473068237 472422714
3287.5D72422714n95474j46523J54992j01052q96835m50478o3018m33083q49152q78601
$$ 472422714 471827240 471680717 471835709 471734657 470837822 470387344 470324326 469891243 469042091 468163490
3297.2D68163490n98907l98140K75040l55721o85196k65579r90410p35970k63786k29950
$$ 468163490 467564583 467166443 467441483 467085762 466400566 466134987 465144577 464408607 464144821 463914871
3306.8D63914871J76125p68547j450272k22397j09329l50990n41077q89892l48359
$$ 463914871 464090996 463322449 461872177 461649780 461540451 461189461 460648384 459758492 459410133
3315.5D59410133q89244n96084j78147j070594r51004k64435J99470l56788j86539
$$ 459410133 458520889 457924805 457746658 456676064 455725060 455460625 455660095 455303307 455116768
3324.2D55116768n19638j625786r41849l46222O1837l91922q95195o10161m94995m11377
$$ 455116768 454597130 452971344 452029495 451683273 451745110 451353188 450457993 449847832 449352837 448941460
3333.8D48941460j321183j282768n56450m60739m9095k35786j033898j011734l32794
$$ 448941460 447620277 446337509 445781059 445320320 445271225 445035439 444001541 442989807 442657013
3342.5D42657013m42543p30286o71501q22639r01451p33834n98831m44298m92363r60540
$$ 442657013 442214470 441484184 440812683 439990044 439088593 438354759 437755928 437311630 436819267 435858727
3352.2D35858727r62105o29463m59710q57353q51784l45802m89769o20117j083984
$$ 435858727 434896622 434267159 433807449 432950096 432098312 431752510 431262741 430642624 429558640
3360.8D29558640o82984m61273j017647m03099l11317o33927j131057j164208o00014
$$ 429558640 428875656 428414383 427396736 426993637 426682320 426048393 424917336 423753128 423153114
3369.5D23153114l49273l15781r30901q34312j072350j224060m24156l15208m69971
$$ 423153114 422803841 422488060 421557159 420722847 419650497 418426437 418002281 417687073 417217102
3378.2D17217102o38428l97834m58527m86946k9602j50147p42073q95157l41262k42310
$$ 417217102 416578674 416180840 415722313 415235367 415205765 415055618 414313545 413418388 413077126 412834816
3387.8D12834816k10915o67495n93567M3449r67560j021461j22452J02196k11754j100769
$$ 412834816 412623901 411956406 411362839 411406288 410438728 409417267 409294815 409397011 409185257 408084488
3397.5D08084488q59108n1880R6321k11143o39611m02374J50414l28179p48253k70042
$$ 408084488 407225380 407173500 407269821 407058678 406419067 406016693 406167107 405838928 405090675 404820633
3407.1D04820633j30615p54586q23249N6953n2834m53643j87264K31095K20909p57065
$$ 404820633 404690018 403935432 403112183 403169136 403116302 402662659 402475395 402706490 402927399 402170334
3416.8D02170334r05419J35537O75811n98716q34618N96886l8872n56946J15280K54021
$$ 402170334 401264915 401400452 402076263 401477547 400642929 401239815 401200943 400643997 400759277 401013298
3426.4D01013298M692J34354J95541j41106K54975J56288n06706k93007Q7204K49748
$$ 401013298 401017990 401152344 401347885 401206779 401461754 401618042 401111336 400818329 400905533 401155281
3436.1D01155281N13344J49841l6621J79024J72615P86857J17341j85013L56025M55895
$$ 401155281 401668625 401818466 401781845 401960869 402133484 402920341 403037682 402852669 403208694 403664589
3445.7D03664589Q69713j098633q08029R04770Q56475Q37632K8915m2953J29356R31435
$$ 403664589 404534302 403435669 402627640 403532410 404388885 405226517 405255432 405212479 405341835 406273270
3455.3D06273270J430473R6931n50918j97373J138802J118851K23465O46667Q63457
$$ 406273270 407703743 407800674 407249756 407052383 408191185 409310036 409533501 410180168 411043625
3464D11043625K93655M1046L26386j61705J54304O09436L65601O70128M85153O69518
$$ 411043625 411337280 411378326 411704712 411543007 411697311 412306747 412672348 413342476 413827629 414497147
3473.7D14497147J068267L71895M40216Q73642K82097N86968P18803N04456J62887
$$ 414497147 415565414 415937309 416377525 417251167 417533264 418120232 418839035 419343491 419506378
3482.3D19506378p89490Q59757J346893P65000J314277L52745K40670J199798J060906
$$ 419506378 418716888 419576645 420923538 421688538 423002815 423355560 423596230 424796028 425856934
3491D25856934P5035j9722M30755O33812O72417J59607Q81538J245995J000824J050873
$$ 425856934 425931969 425912247 426343002 426976814 427649231 427808838 428690376 429936371 430937195 431988068
3500.7D31988068J103973P17011m67034J10283Q31032M25110P59163K091980M57840
$$ 431988068 433092041 433809052 433342018 433452301 434283333 434708443 435467606 437559586 438017426
3509.4D38017426r57032J353874Q45070N95322M37164M41094J516533P05642N83001
$$ 438017426 437060394 438414268 439259338 439854660 440291824 440732918 442249451 442955093 443538094
3518D43538094N52063Q17527J231003J187744M16069m97970J245689J939049J575661
$$ 443538094 444090157 444907684 446138687 447326431 447742500 447244530 448490219 450429268 452004929
3526.7D52004929M02374J09558O93092P62825P93839M66118P35893M84810J886558
$$ 452004929 452407303 452516861 453209953 453972778 454766617 455232735 455968628 456453438 458339996
3535.4D58339996J309243n11246J104469Q63609R12858Q58421J073913J167832J320000
$$ 458339996 459649239 459137993 460242462 461106071 462018929 462877350 463951263 465119095 466439095
3544.1D66439095J220741j30501J581917p7439O47583K097054J881828K081375j212806
$$ 466439095 467659836 467529335 469111252 469033813 469681396 471778450 473660278 475741653 474528847
3552.7D74528847M92439J103897J337547J829338J06965J879615J948624P01027l43628
$$ 474528847 475021286 476125183 477462730 479292068 479399033 481278648 483227272 483928299 483584671
3561.4D83584671K135277J751823O93321N739823P50542j284066M43917j467019L702889
$$ 483584671 485719948 487471771 488165092 493904915 494655457 493371391 493815308 492348289 496051178
3570.1D96051178J841011J219597J952019R81254N01137J777039K784233O98051K173042
$$ 496051178 497892189 499111786 501063805 502045059 502546196 504323235 507107468 507805519 509978561
3578.8E09978561J594048O68449J979332K419243K075539P22503M592438K918015j455918
$$ 509978561 511572609 512241058 514220390 516639633 518715172 519437675 524030113 526948128 525492210
3587.5E25492210P30439k141571K951469L887444L840789J389237K18010M031219j961670
$$ 525492210 526222649 524081078 527032547 530919991 534760780 536150017 536368027 540399246 538437576
3596.1E38437576J873360M209022R51539L549156P41386K71912J789818J814346K498016
$$ 538437576 540310936 544519958 545471497 549020653 549762039 550033951 551823769 553638115 556136131
3604.8E56136131M290848L794365k417984L685532r82628j447182R648171J172714
$$ 556136131 560426979 564221344 561803360 565488892 564506264 563059082 572707253 573879967
3612.5E73879967k932930M836349j450042M059257N091972k50396J659011j223182
$$ 573879967 570947037 575783386 574333344 578392601 583484573 583234177 584893188 583670006
3620.3E83670006M32853L454819K989540J886597K328453K442780K359390Q271217
$$ 583670006 584102859 587557678 590547218 592433815 594762268 597205048 599564438 607835655
3628F07835655K340164j4086608L152923N512238O597671L79410l370857K748909L819656
$$ 607835655 610175819 596089211 599242134 604754372 611352043 611731453 608360596 611109505 614929161
3636.6F14929161K798576l19862J341171L402291K707824O24237k33612J991616L905830
$$ 614929161 617727737 617407875 618749046 622151337 624859161 625483398 625249786 627241402 631147232
3645.3F31147232P386856q77380l931542P468911j037751o017341j788979O321221
$$ 631147232 638534088 637656708 633725166 641194077 640156326 634138985 632350006 638671227
3653F38671227M364814M048233N694199j1012726J403503O673508J804199J245881
$$ 638671227 643036041 647084274 652778473 641765747 643169250 649842758 651646957 652892838
3660.8F52892838P4462K345429Q07876P99866K133408R06677M820404L432465k40174
$$ 652892838 652967300 655312729 656120605 656920471 659053879 659960556 664780960 668213425 667973251
3669.4F67973251k5482r117050K277756R994659J1596756n09491k5154800M546356
$$ 667973251 667947769 658830719 661108475 671103134 682699890 682190399 657035599 661581955
3677.1F61581955R563980N353165l172150n90210L683243K308273J269531j65100N05524
$$ 661581955 671145935 676499100 673326950 672736740 676419983 678728256 679997787 679832687 680338211
3685.8F80338211N680847Q425293j1111603n736999J0346680o163865j113357N481644
$$ 680338211 686019058 694444351 683332748 677595749 687942429 681778564 680665207 686146851
3693.5F86146851Q95691K354278K91214l08533J241227O44073L693314L860626o133042
$$ 686146851 687042542 689396820 689688034 689379501 690620728 691264801 694958115 698818741 692685699
3702.2F92685699l175582N108718J228486J69982N69077L125687O194305p886047N106353
$$ 692685699 689510117 694618835 695847321 696017303 696586380 699712067 705906372 698020325 703126678
3710.9G03126678O931992j9155960L934097N586090L45154O37360L345413K642059
$$ 703126678 710058670 690902710 694836807 700422897 700768051 701405411 704750824 707392883
3718.6G07392883m430237N15900P744751l186569p281799N867767K407150o86645l840714
$$ 707392883 702962646 703478546 711223297 708036728 700754929 706622696 709029846 708343201 704502487
3727.3G04502487n27267M664688K128372P960587l055039j0417099J2230148K259980
$$ 704502487 703975220 708639908 710768280 718728867 715673828 705256729 717486877 719746857
3735G19746857j5115891n88836L545379O46820L368378N024261l532943L673477J4222565
$$ 719746857 704630966 704042130 707587509 708234329 711602707 716626968 713094025 716767502 730990067
3743.7G30990067j2637406k0085831J2081604P329560R135818k444839j3949890J4920501
$$ 730990067 718352661 698266830 710348434 717677994 726813812 724368973 710419083 725339584
3751.4G25339584n835418j1408615N814209N046691M696351n990143K279052O509781
$$ 725339584 719504166 708095551 713909760 718956451 723652802 717662659 719941711 726451492
3759.1G26451492j0434494j638336N373612J424713O39953M736939k634583o289978
$$ 726451492 716016998 714378662 719752274 721176987 721816940 726553879 723919296 717629318
3766.8G17629318L942185O761169J178742j1028901J262894L584061K61001J320038
$$ 717629318 721571503 728332672 729511414 718482513 719745407 723329468 723590469 724910507
3774.5G24910507j86081J011429N56030L638077J647568j0303116J362763K678298
$$ 724910507 724724426 725735855 726291885 729929962 731577530 721274414 722637177 725315475
3782.3G25315475J826249M008865l337097j684113J369705K72141M77371M4098M14200
$$ 725315475 727141724 731150589 727813492 726129379 727499084 727771225 728248596 728292694 728706894
3790.9G28706894k36130J006851j9836J573486N673218l404694o289520J461563N881424
$$ 728706894 728470764 729477615 729457779 731031265 736704483 733299789 727010269 728471832 734353256
3799.6G34353256R848480o289596j5244904K202683K982025O718445P641754j3220749
$$ 734353256 744201736 737912140 722667236 724869919 727851944 734570389 742212143 728991394
3807.3G28991394n595169O678009K326126L87573R28192J61286K000503P769089j357574
$$ 728991394 723396225 730074234 732400360 732787933 733716125 733877411 735877914 743647003 742289429
3816G42289429j9031601N701828P779617O622772K893906k2650528J448288O598282
$$ 742289429 723257828 728959656 736739273 743362045 746255951 723605423 725053711 731651993
3823.7G31651993K760238M027939Q91037o027374l31879K584153M448394K850113j0564193
$$ 731651993 734412231 738440170 739331207 733303833 732971954 735556107 740004501 742854614 732290421
3832.4G32290421L391418R409561q383865n17807J2317047r978333o871795R984054
$$ 732290421 735681839 745091400 736707535 736189728 748506775 738528442 731656647 741640701
3840.1G41640701p032165l69416R062348l587952o075287L599244K416992K43835K325211
$$ 741640701 734608536 734239120 743301468 739713516 733638229 737237473 739654465 739898300 742223511
3848.8G42223511r62448K945098P306748p886429J331253k0146561K566147J4102784
$$ 742223511 741261063 744206161 751512909 743626480 744957733 724811172 727377319 741480103
3856.5G41480103j773148l419876K975387L922120M265747o812744q83179Q989486
$$ 741480103 739706955 736287079 739262466 743184586 747450333 740637589 739754410 748743896
3864.2G48743896q241424q430786N659485P623901R286194r594193j3111496M561158
$$ 748743896 740502472 732071686 737731171 745355072 754641266 745047073 731935577 736496735
3871.9G36496735Q244857O057206j2515641m42962M477462k82058L777847Q333206
$$ 736496735 744741592 750798798 738283157 737840195 742317657 742035599 745813446 754146652
3879.7G54146652o421280j2533035O957245K115555K164230N994339j6489639J072311
$$ 754146652 747725372 735192337 742149582 744265137 746429367 752423706 735934067 737006378
3887.4G37006378N247879J868744O696854K59475j1575775J216584M176635k550583
$$ 737006378 742254257 744123001 750819855 751079330 739503555 740720139 744896774 742346191
3895.1G42346191J214066J663589L071747L130722j2056884N441970L290329n488052
$$ 742346191 743560257 745223846 748295593 751426315 739369431 744811401 748101730 742613678
3902.8G42613678P261887m031220m664001l16544J036606K770920r9945N99670m0817
$$ 742613678 749875565 745844345 741180344 740863800 741900406 744671326 744571381 745171051 745130234
3911.5G45130234J18484J61438k94342K586136L180695m880448n311966N927506P73315
$$ 745130234 745248718 745410156 745115814 747701950 750882645 746002197 740690231 746617737 747391052
3920.2G47391052n808334K847443K877273J732788k371750m390945J764984K114334
$$ 747391052 741582718 744430161 747307434 749040222 746668472 742277527 744042511 746156845
3927.9G46156845J985931p27233r21631J957245l086701j816482K097396L92380m3411
$$ 746156845 748142776 747415543 746493912 748451157 745364456 743547974 745645370 746037750 745994339
3936.6G45994339Q35037K46201J5564M52652K213897J195755n998458j202774K050857
$$ 745994339 746829376 747075577 747091141 747543793 749757690 750953445 744954987 743752213 745803070
3945.2G45803070J256256K181626k424317P38678M90341k695160K709122L04489j445312
$$ 745803070 747059326 749240952 746816635 747555313 748045654 745350494 748059616 748364105 746918793
3953.9G46918793J06811M67377J88675o99616N80903n63355Q51364P97959j619645
$$ 746918793 747025604 747492981 747681656 746982040 747562943 746999588 747850952 748648911 747029266
3962.6G47029266Q95691O47736n49774k88544L02887J109314n10559j103668P67974
$$ 747029266 747924957 748572693 748022919 747734375 748037262 749146576 748636017 747532349 748300323
3971.3G48300323J73264m51660J032181O69555o37054j256867K73743Q08716o57959
$$ 748300323 748473587 748021927 749054108 749723663 749086609 747829742 748103485 748912201 748254242
3980G48254242m2038Q21838M39301m46854k39715n15137m56772O37894L94287O38199
$$ 748254242 748212204 749034042 749473343 749026489 748786774 748271637 747814865 748452759 748847046 749485245
3989.6G49485245n67398j018143O9733Q5296M73481J65863L85360K77710r6817K24152
$$ 749485245 748917847 747899704 747969437 748054733 748528214 748694077 749079437 749357147 749260330 749484482
3999.2G49484482J46713
$$ 749484482 749631195
4000.2G49631195
$$ 749631195
##END=$$ End of the data block
