##TITLE=$$ Begin of the data block
##JCAMP-DX=5.00 $$ ACD/SpecManager v 10.08
##SPECTROMETER/DATA SYSTEM=Varian
##DATE=20 Nov 2012 14:50:20
##DATA TYPE=INFRARED SPECTRUM
##DATA CLASS=XYDATA
##ORIGIN=
##OWNER=
##NPOINTS=3735
##FIRSTX=399.26403809
##LASTX=4000.35498047
##MAXX=4000.35498047
##MINX=399.26403809
##MAXY=83.06442261
##MINY=39.79323578
##XFACTOR=1.0000000000
##YFACTOR=0.000000100000000
##FIRSTY=60.68718338
##DELTAX=0.96440572
##XUNITS=1/CM
##YUNITS=TRANSMITTANCE
##XYDATA=(X++(Y..Y))
399.3F06871834K378158O810799M471283K604179p940101j1291428N108338J3791389
407F22804451P638359n614662r886780N27916O785202j317215o590614O75697j799736
415.7F13222618o017837k972756m552803N930519J1633835L201981j347390p217712
423.4F11880455m212875j847344J236878L049354k828102j352959M972344L351173
431.1F14248924o32438n939103r906311m468193N151863J710587O78253M174652j280441
439.8F03737793q63228J954613P084694L312454j077919K278976l234748m2649R47190
448.4F14097176j845513K037049L775939O912156K150993l139458k644081K589035
456.2F23933296K064972j1658821l016396l008651k378617J336747L003997L453827
$$ y = [606871834, 609249992, 616060791, 620532074, 623136253, 615196152, 603904724, 609013062, 622804451, 630442810, 624828148, 614941368, 615469284, 622254486, 620937271, 614346657, 615022354, 613222618, 607204781, 604232025, 599679222, 605609741, 617243576, 620445557, 619098167, 611880455, 607667580, 605820236, 607057114, 610106468, 607278366, 605925407, 610897751, 614248924, 613616486, 607677383, 597771072, 593302879, 598454742, 600165329, 600843582, 605018234, 603737793, 602874565, 604829178, 611913872, 615226326, 614148407, 616427383, 613192635, 613149986, 614097176, 612251663, 614288712, 618064651, 624976807, 627127800, 623988342, 621344261, 623933296, 625998268, 614339447, 611323051, 608314400, 605935783, 607272530, 610276527, 613730354]
463.9F13730354J449204L096771k522011o171951p863464n560379L136138J75782o744347
472.6E92726097Q12416L473740K236061R451790O3247j1458015j247864K117234m642678
481.2E93532028m297790L109054M72565P49779P684784L322792l814354m257431J731376
489.9E98232803N13039l661079k683869Q65135K993470J661186K031250l521080Q049
498.6E96438904J602211n122605j631088j736183O25343q27827k328758N4092j808395
507.3E85265694L25584o34499r81979q89168j460685k697754o923828m199639L175240
516E70978966K397117k405090J970558n11207k570954r29603k181282j093521j909829
524.6E63745155r73014o85463J600227J656151q83599K63291M33616J289444k14881
$$ y = [613730354, 615179558, 618276329, 615754318, 609582367, 601718903, 596158524, 599294662, 599470444, 592726097, 593538513, 597012253, 599248314, 608700104, 608763351, 597305336, 596057472, 598174706, 593532028, 589234238, 592343292, 592815857, 593565636, 601250420, 604573212, 600758858, 596501427, 598232803, 598745842, 595084763, 592400894, 593266029, 596259499, 597920685, 599951935, 596430855, 596438904, 598041115, 592918510, 591287422, 589551239, 590176582, 589348755, 587019997, 587074089, 585265694, 585591278, 584956779, 583974800, 583085632, 581624947, 578927193, 572003365, 567803726, 570978966, 573376083, 570970993, 572941551, 572430344, 569859390, 568929787, 566748505, 565654984, 563745155, 562772141, 562086678, 563686905, 565343056, 564459457, 564722748, 565156364, 566445808, 566230927]
533.3E66230927Q31336J930275p2631Q96072J971359L898049L647079L105278J977425
542E84415169n55763k40784M41208N62782k76756j98899p68165o10466J703300L37639
551.6E84809265j033363Q99086N28488l142014l387870k340775n83458n73082k539024
560.3E72637253r2430k23885j379623l065911k718391l30505k851334l021050k892952
569E56061172k423973j668396p47413r06182j621398J732902J386910m56696p59430
577.7E50597496L97911O17333L18374K881890L953971L973618K697945K743454K338829
586.4E70520821K299118J826782R50050J619263O43082J425857P75719O30607J165734
595E81857033O3476J191445N4741k05040p9766j756553j314125j02845J134262R35936
$$ y = [566230927, 567062263, 568992538, 568919907, 569815979, 571787338, 575685387, 579332466, 582437744, 584415169, 583859406, 583618622, 584059830, 584622612, 584345856, 584146957, 583378792, 582768326, 584471626, 584809265, 583775902, 584674988, 585203476, 582061462, 578673592, 576332817, 575749359, 575176277, 572637253, 572544823, 572320938, 570941315, 567875404, 565157013, 564826508, 561975174, 558954124, 556061172, 553637199, 551968803, 551221390, 550315208, 548693810, 550426712, 551813622, 551356926, 550597496, 550995407, 551612740, 551931114, 554813004, 558766975, 562740593, 565438538, 568181992, 570520821, 572819939, 574646721, 575596771, 577216034, 577859116, 579284973, 580060692, 580691299, 581857033, 581920509, 583111954, 583166695, 582961655, 582881889, 581125336, 579811211, 579708366, 580842628, 581778564]
604.7E81778564O13213j160660j238632J840706J459541o03142q9721P59735q1329
613.4E83278275O07986J623573J890869J365204O56205K013206J429329K8419R60350
622E93853416J809006J759415K026062K254600K124520J402893n2185J83029K151565
630.7F07512321J585579j247291p6637J694297J445732J380425K20795P92579J007233
639.4F14315033P68318M62876j59455J252098J21422j035881L99742K161179K139053
648.1F20424385N29862R18312K15759j66283J33057j30158J83716M36745J172905R61151
657.7F24679451K269630J903687q82797m18358k21176m86756k49862L18374J797180
666.4F28709373Q74825m733658K794609L599396J740036N81818P61222J025353j20659
$$ y = [581778564, 582391777, 581231117, 579992485, 581833191, 583292732, 582689590, 582599869, 583359604, 583278275, 583886261, 585509834, 587400703, 588765907, 589422112, 591435318, 592864647, 592893066, 593853416, 595662422, 597421837, 599447899, 601702499, 603827019, 605229912, 605177727, 605360756, 607512321, 609097900, 607850609, 607773972, 609468269, 610914001, 612294426, 612515221, 613307800, 614315033, 615083351, 615546227, 615386772, 616638870, 616760292, 615724411, 616124153, 618285332, 620424385, 620954247, 621872559, 622088318, 621922035, 622055092, 621924934, 622108650, 622545395, 623718300, 624679451, 626949081, 628852768, 627969971, 627551613, 627330437, 626843681, 626593819, 626912193, 628709373, 629584198, 624850540, 627645149, 631244545, 632984581, 633566399, 634327621, 635352974, 635232315]
675.1F35232315j318550m30946O49528Q24318J703949K120667J340332J328659J391296
683.8F42841568O63376j198883j126709Q87451Q0948Q697M56543o29196L11814J115188
693.4F43410797Q68988O4163j721801k290650k042274j551667k63900N6610l34473
702.1F36195793Q9340m46281q88023m02260o72837p30323r75418j471825n09911J108742
711.7F31296997K004776L322792K791557J108857K004776J505203J220550K164002
719.5F47419510P95822K49481J318436K523270L687057L967514L345871K099533J181641
728.1F66588135J592178J809845J102600Q44116L36380m90722J339264L203201K897949
736.8F79222946K531128L63846n417O75125o70700p43256j599960j392135k30866O73676
$$ y = [635232315, 633913765, 633482819, 634132347, 634956665, 636660614, 638781281, 640121613, 641450272, 642841568, 643504944, 642306061, 641179352, 642066803, 642147751, 642156448, 642612991, 641983795, 642295609, 643410797, 644279785, 644343948, 642622147, 640331497, 638289223, 636737556, 636473656, 636530266, 636195793, 636285133, 635838852, 634950829, 634548569, 633875732, 633145409, 632169991, 630698166, 630188255, 631296997, 633301773, 636624565, 639416122, 640524979, 642529755, 644034958, 645255508, 647419510, 648215332, 648464813, 649783249, 652306519, 655993576, 659961090, 663306961, 665406494, 666588135, 668180313, 669990158, 671092758, 671936874, 672273254, 671782532, 673121796, 676324997, 679222946, 681754074, 682117920, 682112503, 682787628, 682116928, 681373672, 679773712, 678381577, 678150711, 678824387]
746.5F78824387J472244o6452p75910j469955k533112k292709k260056k781448k386932
755.1F65730057j385269j313324L09829O38886j515656j450882j670150k179184j932755
763.8F55231552q93707L52173m73252J22376J615829K325669K864151L247604L809509
772.5F68201904K518311J290436K293930K525787J961212K697220L096542L574372
780.2F88159714L761673L334884L824158L002091J101913J01013J16043N21164R59320
788.9G04881973J158219J810531K467499K748718L405762K225189N04990M55856L39585
797.6G19998322k82441P20291K196579K265015J664887J352386K943344K347717O1570
806.2G33267670m83933o23169L41721m349l50952N45044K51999l57056R19266J579513
$$ y = [678824387, 680296631, 680230179, 679454269, 677984314, 675451202, 673158493, 670898437, 668116989, 665730057, 664344788, 663031464, 663341293, 663980179, 662464523, 661013641, 659343491, 657164307, 655231552, 654337845, 654690018, 654216766, 654339142, 655954971, 658280640, 661144791, 664392395, 668201904, 670720215, 672010651, 674304581, 676830368, 678791580, 681488800, 684585342, 688159714, 691921387, 695256271, 699080429, 702082520, 703184433, 703285446, 703401489, 703922653, 704881973, 706040192, 707850723, 710318222, 713066940, 716472702, 718697891, 719202881, 719658737, 719998322, 719715881, 720436172, 722632751, 724897766, 726562653, 727915039, 730858383, 733206100, 733267670, 732783737, 732160568, 732502289, 732497940, 732146988, 732692032, 732944031, 732586975, 733506241, 735085754]
815.9G35085754M08402j20545j805572j151352m1199j343155j125946o52313J61133
824.6G29415207M42886L31574l0136p17545j771851k827911j740570j920013k852021
833.3G18329620k283477r67484n40924q42590j033707j385727q46176j329956j990967
841.9G07108612k345505k783432k474441j744995J1444M84695q09250j285705m86832
850.6F95674591j175003j939468j538315k322388k193451k188415j850815r70230m48075
859.3F81048431R34296R64890R3002p095J739807K846145K180176L002319L707734
868F96509705M334945M275131M415818N020599L971329L671570K827606J390381k45896
876.7G26171188q5983N57633J72653O50329K38037J77994q04519k242203k058487j776581
$$ y = [735085754, 735494156, 735373611, 733568039, 732416687, 732375488, 731032333, 729906387, 729254074, 729415207, 729858093, 730189667, 730159531, 729441986, 727670135, 724842224, 723101654, 721181641, 718329620, 716046143, 715078659, 714537735, 713695145, 712661438, 711275711, 710429535, 709099579, 707108612, 704763107, 701979675, 699505234, 697760239, 697771683, 698256378, 697447128, 696161423, 695674591, 694499588, 692560120, 691021805, 688699417, 686505966, 684317551, 682466736, 681496506, 681048431, 681982727, 682947617, 683040619, 683033524, 684773331, 687619476, 689799652, 692801971, 696509705, 700844650, 705119781, 709535599, 714556198, 718527527, 722199097, 725026703, 726417084, 726171188, 726085205, 726642838, 726815491, 727465820, 727703857, 727881851, 727077332, 724835129, 722776642, 721000061]
886.3G21000061k804031l590088k933884k768097k557602k242050j903152k197571
894G00003586k098160j904602k428665j605988j926117k541656j925965j791229k099304
902.7F81681900k072906j437989j860428k375183k505493l099365l370667l779602
910.4F61180267m310455m165802l457336k973786l633957m177742l602600k980804
918.1F31877785k623978k746200k287484k040748j488915r28421j074486k98309o61507
926.8F17727737k23465R01909O83670L45650M56505Q45108M71153R26819J042023J004715
936.4F24181824J636238P73887M13132J973610K775040J312752J133308J688995N21279
945.1F36410065n96161j752472k243004k423172l234520m106178m986267m862023m627151
$$ y = [721000061, 718196030, 714605942, 711672058, 708903961, 706346359, 704104309, 702201157, 700003586, 697905426, 696000824, 693572159, 691966171, 690040054, 687498398, 685572433, 683781204, 681681900, 679608994, 678171005, 676310577, 673935394, 671429901, 668330536, 664959869, 661180267, 656869812, 652704010, 649246674, 646272888, 642638931, 638461189, 634858589, 631877785, 629253807, 626507607, 624220123, 622179375, 620690460, 619762039, 618687553, 618389244, 617727737, 617504272, 618406181, 619089851, 619435501, 619892006, 620737114, 621208267, 622135086, 623177109, 624181824, 625818062, 626591949, 627005081, 628978691, 631753731, 633066483, 634199791, 635888786, 636410065, 635813904, 634061432, 631818428, 629395256, 626160736, 622054558, 617068291, 612206268, 607579117]
953.8F07579117n135575o299552o181183n829201o283608o624298o845207o163368
961.5E58217125o403923o317635o816940o829414o520272p598381p486992p457237
969.2E02786331p307358q108024p429390p124252p579804p173881p464219o059227
976.9D44540176o456604n648460n122910m556922m806481n587311k712516l165398
984.7D06483574k000313j851845j553688o52237j338691K34413p05223M28047n5123
993.3C98988914p66754k89802J57089J406326J64299O43273J52931J222916O53991
1002D02333183R2354O20804q57773L59573o08787J17760m91639n51261K98156n82313
1011.7D00730057J04103j847801L38974K23236m60091M24957k3994J226425j30958
$$ y = [607579117, 602443542, 596143990, 589962807, 584133606, 577849998, 571225700, 564380493, 558217125, 551813202, 545495567, 538678627, 531849213, 525328941, 517730560, 510243568, 502786331, 495478973, 487370949, 479941559, 472817307, 465237503, 458063622, 450599403, 444540176, 438083572, 432435112, 427312202, 422755280, 417948799, 412361488, 409648972, 406483574, 404483261, 402631416, 401077728, 400425491, 399086800, 399321213, 398615990, 399044037, 398988914, 398222160, 397932358, 398089447, 399495773, 399660072, 400303345, 400456276, 401679192, 402333183, 402425537, 403046341, 402188568, 402548141, 401939354, 402057114, 401565475, 401014214, 401312370, 400730057, 400834160, 398986359, 399325333, 399548569, 399088478, 399513435, 399489441, 400715866, 400584908]
1020.3D00584908J236610R55048J152801J004486L11814J838951J390991K578354N11360
1029D11565323O07834J404648J506042J955566L58048J251297Q48617J691170Q6823
1037.7D21275368l71933J17645p30820P18956k01568R04236q2436L71132O19201K30790
1047.4D22850571R64775q90160J421967R40971J693993J624260J335983K654762J382446
1056D33979568L499489K803307L380470K799568K878380L967552L338356M665909L157234
1064.7D64469833M262886K905045K248001J558762j443940j023635l459855m407234
1072.4D65109863m953613l567314l218079l319053j258011j872559Q7853j49651J038742
1081.1D47898178K51236o6109J401978M15954K983666K344170K247123J896210K631798
$$ y = [400584908, 401821518, 402776566, 403929367, 404933853, 405245667, 407084618, 408475609, 411053963, 411565323, 412173157, 413577805, 415083847, 417039413, 417397461, 418648758, 419497375, 421188545, 421275368, 420903435, 421021080, 420290260, 421009216, 420807648, 421711884, 421629448, 422000580, 422619781, 422850571, 423815346, 422925186, 424347153, 425288124, 426982117, 428606377, 429942360, 432597122, 433979568, 437479057, 440282364, 443662834, 446462402, 449340782, 453308334, 456646690, 461312599, 464469833, 468732719, 471637764, 473885765, 475444527, 474000587, 472976952, 469517097, 465109863, 460156250, 456588936, 453370857, 450051804, 448793793, 446921234, 447009087, 446859436, 447898178, 448149414, 448083305, 449485283, 449901237, 452884903, 455229073, 457476196, 459372406, 462004204]
1089.8D62004204K799034J714096L304481K035790K400894J274300J794204J903611
1097.5D79230614K09655O22864N56183K143669J40381r5215o2637L56216J529160m71916
1107.1D84158974L07693K5673J447182J973572K344703K449951J133919K180138J420936
1115.8D97442741K703133J794968P61223R87586O27633J217994M51508J573982O27670
1124.5E08188438J636277K186203O58798J029014L50380K092934K652893K473412J638527
1133.2E22906876R43107R98917P69348J252289m87251j086998k414170k477989j999321
1141.9E18404808l477631k666893k106170j806336l115501k596779k326279k611732
1149.6D97697487j917725k494812j238060j554146l57055j026459j179771J26838n23987
$$ y = [462004204, 464803238, 466517334, 469821815, 471857605, 474258499, 475532799, 477327003, 479230614, 479440269, 480063133, 480619316, 482762985, 482903366, 482808151, 482745514, 483101730, 484630890, 484158974, 484466667, 484492340, 485939522, 487913094, 490257797, 492707748, 493841667, 496021805, 497442741, 500145874, 501940842, 502702065, 503689651, 504317284, 505535278, 505986786, 507560768, 508188438, 509824715, 512010918, 512669716, 513698730, 514049110, 516142044, 518794937, 521268349, 522906876, 523849983, 524848900, 525618248, 526870537, 526383286, 525296288, 522882118, 520404129, 518404808, 514927177, 512260284, 510154114, 508347778, 505232277, 502635498, 500309219, 497697487, 495779762, 493284950, 492046890, 490492744, 490135689, 489109230, 487929459, 488056297, 487532310]
1158.3D87532310J134034L39546J059341J018181J504517K168922J524506K887611
1166D99168968K648506M056168L066368M145241M905014L674316N062447M156074N205498
1174.6E36088600M871979N009842N881882M983825M870911M542999N413742M862213
1182.4E76525993M429055M271392M168435M552803M162330M159622L336106L026581
1190.1F08632317K735061K088547K209358J976776R59053J63346N96657P88307J024131
1198.8F21173553J022759R19266J266365N70411J45646L40576L93829M74548J486588
1207.4F27793541J676216R09920J493797J462441J556129K003822J838723J507568
1215.1F40242157P62558O58493J147690J598434J285401Q16345J142197J075439Q62122
$$ y = [487532310, 488666344, 489005890, 490065231, 491083412, 492587929, 494756851, 496281357, 499168968, 501817474, 505873642, 508940010, 513085251, 517990265, 521664581, 526727028, 530883102, 536088600, 540960579, 545970421, 551852303, 556836128, 561707039, 566250038, 571663780, 576525993, 580955048, 585226440, 589394875, 593947678, 598110008, 602269630, 605605736, 608632317, 611367378, 613455925, 615665283, 617642059, 618601112, 618764458, 619361115, 620149422, 621173553, 622196312, 623115578, 624381943, 624952354, 625098000, 625438576, 625832405, 626306953, 627793541, 629469757, 630379677, 631873474, 633335915, 634892044, 636895866, 638734589, 640242157, 641004715, 641663208, 642810898, 644409332, 645694733, 646511078, 647653275, 648728714, 649590836]
1223.8F49590836M86526k06680m20685p51038j273117j245422m60968j61591O4087
1232.5F45621948L17383j45111o56128o89468k16294n70678j212235j274567q38089
1241.2F40336761j00097K67486P84989Q93326R06524P22199j11771K4490J74180J69296
1250.8F44067383M82178L06778O76803J168671J258545J470489J247406N34516r3918
1259.5F51118851k49024J65711L93448l78647k16370R46121J411667J401901J306534
1268.2F55900192J357041P71942O70395P94677J6938j03150j32675k3575M79050Q04291
1277.8F60535126P53479Q80737P11060k00272n49164o75278q04824j036301p17087
1286.5F58897476j24740M89044R48486O01578O77490K71988m26178r85107j915360
$$ y = [649590836, 650077362, 649870682, 649449997, 648698959, 647425842, 646180420, 645719452, 645557861, 645621948, 645939331, 645794220, 645138092, 644448624, 644232330, 643661652, 642449417, 641174850, 640336761, 640236664, 640504150, 641289139, 642182465, 643088989, 643811188, 643699417, 643723907, 643898087, 644067383, 644549561, 644856339, 645533142, 646701813, 647960358, 649430847, 650678253, 651212769, 651118851, 650869827, 651035538, 651428986, 651050339, 650833969, 651780090, 653191757, 654593658, 655900192, 657257233, 658029175, 658699570, 659494247, 659511185, 659408035, 659275360, 659251785, 659730835, 660535126, 661288605, 662169342, 662880402, 662680130, 662130966, 661455688, 660650864, 659614563, 658897476, 658772736, 659261780, 660210266, 660811844, 661489334, 661761322, 661335144, 660350037, 658434677]
1295.2F58434677j756744j089325p87583n72433k68784M7684J13831m8676m03366r92661
1304.8F52676620j475143j510162j601334j526794m50592L10440q73871q35114K13929
1313.5F44927979j96229k83584q23288j204071j193924j328659r77860p72476k03476
1322.2F37944412k60620l68996j46369q04902j636619k260285k393188k282715k325058
1330.9F25465660j900902r54590r28611q53653l25012l06740o92482n50194p79839
1339.6F18173637j751747j021652m51889m14810J04561J045913J235161R29985O22063
1348.2F18471222J335k80304q07228j114349r74732o76460m94270k30599P13959O93092
1357.9F15301666M00276l471q50220q97827r19075k327232j316643k15263k84005N81170
$$ y = [658434677, 656677933, 655588608, 654801025, 654228592, 653959808, 654007492, 654121323, 654072647, 653669281, 652676620, 651201477, 649691315, 648089981, 646563187, 646112595, 646423035, 645549164, 644714050, 644927979, 644731750, 644448166, 643624878, 642420807, 641226883, 639898224, 638920364, 638147888, 637944412, 637683792, 637314796, 637168427, 636363525, 634726906, 632466621, 630073433, 627790718, 625465660, 623564758, 622610168, 621681557, 620827904, 620502892, 620196152, 619503670, 618953476, 618173637, 616421890, 615400238, 614948349, 614533539, 614638100, 615684013, 616919174, 617849159, 618471222, 618472557, 618192253, 617385025, 616270676, 615295944, 614619484, 614125214, 613894615, 614608574, 615301666, 615701942, 615698471, 614848251, 613950424, 613031349, 610704117, 609387474, 609172211, 608888206, 609469376]
1367.5F09469376P04574L64304P89337N875K01377R4452r70764j360092j7319J293373
1377.2F10574493P75795O98929Q24929J200752R82551P23687O02760L11775J154518
1385.8F17850189R20410M2916P54776J976585J982880J374588J646271J954307Q89244
1394.5F29392166k528953o40526j08719m38805j753158j185990R63555K86941P97119
1403.2F24783630J013184j320610j778984n24979q86574j669349j270409p72934P134
1411.9F17580109k61002l64914q2664J51252P34063o78521M1733l812790j529426J653633
1421.5F13431473N74226O40373j357040P07245J289368L46870J331978L3836p67898
1430.2F16230431m55666J044235L73764k20451J995506J717835j737709k55700K706070
$$ y = [609469376, 610173950, 610538254, 611327591, 611333466, 611534843, 611629295, 610658531, 609298439, 609281120, 610574493, 611350288, 612049217, 612874146, 614074898, 615057449, 615781136, 616383896, 616695671, 617850189, 618770599, 618813515, 619568291, 621544876, 623527756, 624902344, 626548615, 628502922, 629392166, 626863213, 626222687, 626113968, 625675163, 623922005, 622736015, 623699570, 623986511, 624783630, 625796814, 624476204, 622697220, 622172241, 621285667, 619616318, 618345909, 617572975, 617580109, 617319107, 616954193, 616871529, 617022781, 617756844, 617078323, 617120056, 613307266, 611777840, 613431473, 614005699, 614646072, 613289032, 613996277, 615285645, 615632515, 616964493, 616998329, 616230431, 615774765, 616819000, 617192764, 616972313, 618967819, 620685654, 618947945, 618692245, 621398315]
1438.9F21398315J061707K59972L01590m69742P46002J59607P63740J100083R78889
1447.6F26300163q98552l89518J049537o60362q23135j141930O41022P29370k65579
1456.2F24541016j267090m556465K128334m54789J582337O07910L94898K425537j392479
1464.9F24009209N21965J227417K484970K071380K944642M407310K567635L395385
1472.6F43629913N23148M891128M407502J872253J733551L371887L568421K286987
1480.3F66284790L396530K208862L229905K543640J501999K819824J435852K068863
1488.1F85490265J994324J343155l47519K870559L328476J587143K742691K327042
1495.8G01336136j494522R72900J468735p83539K055512K431106O66275K380142L266755
$$ y = [621398315, 622460022, 622719994, 623021584, 622551842, 623297844, 623457451, 624221191, 625321274, 626300163, 625401611, 625012093, 626061630, 625401268, 624578133, 623436203, 624077225, 624806595, 624541016, 623273926, 618717461, 620845795, 620391006, 621973343, 622581253, 622976151, 625401688, 624009209, 624531174, 625758591, 628243561, 630314941, 633259583, 637666893, 640234528, 643629913, 644153061, 649044189, 653451691, 655323944, 657057495, 660429382, 663997803, 666284790, 669681320, 671890182, 675120087, 677663727, 679165726, 681985550, 683421402, 685490265, 687484589, 688827744, 688480225, 691350784, 694679260, 696266403, 699009094, 701336136, 699841614, 700814514, 702283249, 701499710, 703555222, 705986328, 706652603, 709032745, 712299500]
1504.5G12299500M996490j220016p332078K582779K26593J148301J883010J301346
1512.2G15885925j029892K399979K351608O56739Q67462m424668L813248L315887j158371
1520.8G22677917l099899r28192M662323K781143m06646M23049K153855o86951k89230
1529.5G27287369J749191N51987J394043j354676l096389K502594J633148K002258
1537.2G32669525L144531m77676q444290O558838Q64029l217316K293091L14407k714004
1545.9G30991135J223220J613312J531754K38495l363266N46875J608963J111068k477340
1554.6G33024216q99124M876403M543991l832855n811310n549697M433212J868439
1562.3G32653275J108322N77240k844239j352539O97937J538468O40564n934372O53229
$$ y = [712299500, 717295990, 716075974, 708743896, 711326675, 711553268, 712701569, 714584579, 715885925, 714856033, 717256012, 719607620, 720264359, 721131821, 716707153, 720520401, 723836288, 722677917, 719578018, 718649826, 723312149, 726093292, 725686646, 726109695, 728263550, 727576599, 727287369, 729036560, 729588547, 730982590, 729627914, 726531525, 729034119, 730667267, 732669525, 735814056, 735336380, 726892090, 733450928, 734314957, 731097641, 733390732, 733705139, 730991135, 732214355, 733827667, 735359421, 735597916, 732234650, 732781525, 734390488, 735501556, 733024216, 732125092, 737001495, 741545486, 737712631, 731901321, 726351624, 730784836, 732653275, 733761597, 734338837, 731494598, 730142059, 730839996, 732378464, 733019028, 727084656, 727737885]
1571G27737885J845626l27377q72040Q17108j2817q972168J637573K040634K73209
1579.7G24167633j8616o29654p13577j440277j162415j541366j211166n94712r33532
1588.4G15922318p90787j329651Q2626q66470j273880j230087k471161j626129k189942
1597G04226837j243210j454620r44138p72094j037064p25937k390518j498108j455536
1605.7F92705612j475067k953415k047806j869964l278656o94733j732788n73196l84217
1614.4F77695770N51377R4757j1235810J79520l99017j187668j821137J91193O790
1623.1F64075775n750656O39343O81763O56815k120591k755508o49109j214142p75680
1631.7F52788010j127396J584396K374802n320358j989823K244721j23673K26441M86068
$$ y = [727737885, 729583511, 729256134, 728384094, 729201202, 729188385, 720216217, 721853790, 723894424, 724167633, 724149017, 723519363, 722805786, 721365509, 720203094, 718661728, 717450562, 716855850, 715922318, 715131531, 713801880, 713884506, 713018036, 711744156, 710514069, 708042908, 706416779, 704226837, 702983627, 701529007, 700584869, 699812775, 698775711, 698049774, 695659256, 694161148, 692705612, 691230545, 688277130, 686229324, 684359360, 681080704, 680385971, 678653183, 678079987, 677695770, 678247147, 678341904, 667106094, 667285614, 666886597, 665698929, 663877792, 664068985, 664075775, 658325119, 658964462, 659646225, 660303040, 658182449, 655426941, 654777832, 653563690, 652788010, 651660614, 653245010, 655619812, 650299454, 648309631, 650554352, 650430679, 650657120, 651143188]
1640.4F51143188j142425K11487n6763K144013L085403j84174N76020p83997J732407
1649.1F56725159K432937M319687N894470M96598j1923828L167114L921280K579803
1656.8F67613220K320862K155533K311706L080445L411636O26145j484986K319260
1664.5F82353821J953735J599579K456818L164825P24793K067565L827897J050720
1672.3F99199753K523651L800430L98102l114090L140640L508454L066101K531204
1680G15054245O51932M448395O400222K744217j0672226L229676N458145K905273P85751
1688.6G31005630J767807J127244K225647L005142K719040M745407L792953o447143
1696.4G43941727K157135L897247M794922j496201q453827O031037M534607K378387
$$ y = [651143188, 650000763, 650212250, 650155487, 652299500, 655384903, 655200729, 655776749, 654992752, 656725159, 659158096, 663477783, 669372253, 669868851, 657945023, 661112137, 665033417, 667613220, 669934082, 672089615, 674401321, 677481766, 680893402, 681519547, 680034561, 682353821, 684307556, 685907135, 688363953, 691528778, 692253571, 694321136, 698149033, 699199753, 701723404, 705523834, 705921936, 702807846, 705948486, 709456940, 712523041, 715054245, 715706177, 720154572, 726554794, 729299011, 718626785, 721856461, 727314606, 730219879, 731005630, 732773437, 733900681, 736126328, 739131470, 741850510, 746595917, 750388870, 743941727, 746098862, 749996109, 754791031, 753294830, 744841003, 750872040, 755406647, 757785034]
1704.1G57785034R30557K185746j442948j50528J971436K91595q50372L64990J776581
1712.8G62862091K472153Q14438m73481L556900L028565p803192J64184J900940N92575
1721.4G67115173L26538J60294k94495J202393J207886Q44268K083283K462387p47375
1730.1G74360352k654419K336959L140030l523483p574387L825989M447174K097702
1737.8G76455917L020707q7739m283447K674866K210541j463700j413421K151336J891404
1746.5G81156464J552734J452637p33872L837357J01089l012390K621231R73816P19910
1755.2G88668976J373367j423416M46777K070389K253342L565674n04151j385650J903152
1763.9G96968460M79431o256P29523J211014k754670J191254M315491J678390j436538
$$ y = [757785034, 758715591, 760901337, 759458389, 759307861, 761279297, 761570892, 760720520, 761085510, 762862091, 765334244, 766148682, 765675201, 769232101, 772260666, 764457474, 764621658, 766522598, 767115173, 767441711, 767602005, 767307510, 768509903, 769717789, 770562057, 772645340, 775107727, 774360352, 771705933, 774042892, 777182922, 773659439, 766085052, 769911041, 774358215, 776455917, 779476624, 779388885, 775105438, 777780304, 779990845, 778527145, 777113724, 779265060, 781156464, 782709198, 784161835, 783427963, 787265320, 787366409, 784354019, 786975250, 787949066, 788668976, 790042343, 788618927, 789065704, 791136093, 793389435, 796955109, 796450958, 795065308, 796968460, 797447891, 797441635, 798171158, 799382172, 796627502, 797818756, 802134247, 803812637, 802376099]
1772.5H02376099l037415L169785J348877k337418J321640O09665R43375L81622j379776
1781.2H03396454O62994K121964K056808p72171o66351Q68454j94626o38733J100464
1789.9H07935257R02863N18798j859893j297379L911362K069320j479721k90603J333465
1798.6H11743469K35672k093658R34524l15933m06113J079178R00879J211167J96151
1807.3H13485336r6817O96183R15374j723633j101532L67661J81961R08279M21677
1815.9H14054489J166535N1803n8288Q59298m06265J48010o51397O26144J069412l228760
1825.6H13630981J77765K985688K934951R04313m930726l91006J991196j33820k65579
1834.3H16903763K2201K20719L5629K8915J244355J32293K07596k4261J345825J414566
$$ y = [802376099, 799338684, 802508469, 803857346, 801519928, 802841568, 803451233, 804394608, 804776230, 803396454, 804059448, 806181412, 808238220, 807466049, 806799698, 807668152, 807473526, 806834793, 807935257, 808838120, 809356918, 807497025, 806199646, 810111008, 812180328, 810700607, 810410004, 811743469, 811979141, 809885483, 810820007, 810504074, 810097961, 811177139, 812078018, 813289185, 813485336, 813388519, 814084702, 815000076, 813276443, 812174911, 812542572, 812724533, 813632812, 814054489, 815221024, 815272827, 815214539, 816073837, 815667572, 815815582, 815164185, 815790329, 816859741, 813630981, 813808746, 816794434, 819729385, 820633698, 815702972, 815311966, 817303162, 817169342, 816903763, 816925964, 817146683, 817182312, 817211227, 818455582, 818587875, 818795471, 818771210, 820117035, 821531601]
1843.9H21531601n974503M57993J898804O5231j78223P43943Q95614k95486P5531l24784
1853.6H18895721J23978P7057j77917R4604k84729M51508k7619o7444j02005O97022
1863.2H19680176O38885j35803M12903n61905M44031j154862j882477J118699J118087
1871.9H19677734P70188J92947M89350l67966m42429J908r2621J3199j68381P51571
1881.5H20825500J28479N81894K47727j004181q4076R766J319656L50647k234802Q4991
1891.2H20225601P09076L17078J309280L47290j222305L52173r5520m69666j99203
1899.8H21273804k09961L1509l2806R56039J28403l65524K83355J31989J64413J27869
1909.5H22489090q77380q32444Q24662j82801N9204K90833L06625K212830j245728
$$ y = [821531601, 815557098, 816015091, 817913895, 817979126, 817800903, 818544846, 819440460, 819144974, 819220505, 818895721, 819019699, 819096756, 818918839, 819013443, 818728714, 819180222, 819152603, 819085159, 818983154, 819680176, 820319061, 820183258, 820596161, 820034256, 820478287, 819323425, 817440948, 818559647, 819677734, 820447922, 820640869, 821130219, 820762253, 820319824, 820321732, 820229111, 820242310, 820073929, 820825500, 820953979, 821535873, 821783600, 820779419, 820695343, 820705109, 822024765, 822375412, 820140610, 820225601, 820934677, 821251755, 822561035, 822908325, 821686020, 822038193, 821942673, 821473007, 821273804, 821063843, 821095352, 821062546, 822018585, 822146988, 821781464, 822064819, 822196808, 822361221, 822489090, 821611710, 820779266, 821603928, 821421127, 821480331, 821771164, 822077789, 824290619, 823044891]
1918.2H23044891j600647P95975L83530O65817j165390j177216O19050O11038M3335
1926.8H22220383K06146J57852J77002J09787l19061M3335o44608l70025J07727L52401
1936.5H22040939O65207J39084J40534l05253P72934j23214k387924L63159O44607
1945.2H21950073m00772j4496P30133N27802M80804M4251k91825M1733n92041l38592
1954.8H22137070l55988k43683L1205p6447P36618P54547N28793q8729l62626k11563
1964.5H22849197q4533J01394r57031p65915M87366O71616K32772N78156P90939N4932
1974.1H23958893l09220l69720j18332l75671o61545m99115J02158O60324L19976K13776
1983.7H22921524L27530L77121k79312m55475k83661n24750O07682O01425j058426
$$ y = [823044891, 821444244, 822240219, 822623749, 823289566, 822124176, 820946960, 821566010, 822177048, 822220383, 822426529, 822584381, 822761383, 822871170, 822552109, 822595444, 821950836, 821580811, 821688538, 822040939, 822706146, 822845230, 822985764, 822680511, 823453445, 823330231, 820942307, 821305466, 821950073, 821549301, 821534805, 822264938, 822792740, 823273544, 823317795, 823025970, 823067703, 822475662, 822137070, 821781082, 821537399, 821568604, 821492157, 822228775, 822983322, 823512115, 823423386, 823060760, 822849197, 822764664, 822866058, 821909027, 821143112, 821630478, 822302094, 822534866, 823113022, 823903961, 823958893, 823649673, 823279953, 823161621, 822785950, 822124405, 821625290, 821727448, 822387772, 822707748, 822921524, 823249054, 823626175, 823346863, 822891388, 822607727, 822082977, 822690659, 823292084, 822233658]
1992.4H22233658l21884J038360O61316J1673r3994l09753q86002q22372J34048j37024
2002.1H21508026L9520M27018J35879L61405K00195N23681R7123n15213n14679p47223
2011.7H21515732n55725m82559J13143M10386R4833j51291L39279O03943j42593j81504
2021.3H21563644n92727p86057n81360l26233P3777r613L41949L72543K92664K16141
2031H20564728p2098m28314p08084o74057m36325L891k35749J41373M03290K14920
2040.6H18773575L00369J9302m57n79148l33557k03476o05774q8501P9880J37787K56195
2051.2H17756195M94766n8136k90222m0436j55792n1651o05469k16674K01721L2272
2060.9H17066574O7520L46833Q85314K64969j57470k5940K13699k12936j022873n62058
$$ y = [822233658, 821911774, 822950134, 823611450, 823623123, 823529129, 823219376, 822333374, 821511002, 821645050, 821508026, 821547546, 821974564, 822110443, 822471848, 822672043, 823195724, 823292847, 822777634, 822262955, 821515732, 820960007, 820477448, 820590591, 821000977, 821095810, 820944519, 821283798, 821887741, 821745148, 821563644, 820970917, 820184860, 819603500, 819277267, 819351044, 819341431, 819683380, 820055923, 820348587, 820564728, 820492630, 820064316, 819356232, 818682175, 818245850, 818249741, 818013992, 818155365, 818558655, 818773575, 819073944, 819093246, 819092789, 818513641, 818180084, 817976608, 817370834, 817282333, 817362213, 817500000, 817756195, 818250961, 818192825, 817902603, 817862167, 817706375, 817654724, 817049255, 816832581, 817034302, 817066574, 817134094, 817480927, 818366241, 818631210, 818473740, 818447800, 818661499, 818448563, 817425690, 816863632]
2070.5H16863632J75629L06396J22757N24216J58920j13601K42004K5940O3324k84348
2080.2H18084869k01339k04316k10189K59246J46943N3253M6692K31323K25220J87225
2089.8H18618927k55508l52173j25122j10245K78397k08207J0071L34473K69394M46853
2099.5H18906860O9428r6283l52097J14594K9373k28958L3645J44425O49109O2103
2109.1H19332199l6316K22778L4104m3182p9270j33285n33600k0066J19095J36261
2118.7H18998718K31400O180J33438o6529q3465r1629K09121Q6060R8801J99203m72717
2129.4H19248581l11127j75323J77154L45612L59497M83093o6604k89460k71530j21460
2139H19378433k44522n3482o3400j89743J32446K5101J37939M4861M03595M59290j01777
$$ y = [816863632, 817039261, 817345657, 817468414, 817992630, 818151550, 818037949, 818279953, 818305893, 818369217, 818084869, 817883530, 817679214, 817469025, 817728271, 817875214, 817928467, 817975159, 818206482, 818431702, 818618927, 818363419, 818011246, 817886124, 817775879, 818054276, 817846069, 817856140, 818190613, 818460007, 818906860, 818976288, 818880005, 818527908, 818642502, 818671875, 818442917, 818476562, 818620987, 819270096, 819332199, 819295883, 819518661, 819552765, 819509583, 819430313, 819297028, 818763428, 818743362, 818862457, 818998718, 819230118, 819236298, 819369736, 819303207, 819219742, 819128113, 819337234, 819423294, 819522095, 819721298, 819248581, 818937454, 818762131, 818939285, 819284897, 819644394, 820127487, 820060883, 819771423, 819499893, 819378433, 819133911, 819080429, 819017029, 818827286, 818959732, 818984833, 819122772, 819167633, 819571228, 820030518, 819928741]
2149.6H19928741k83126l84293m2801J66931M25034Q0490l7918J67999r918K83203
2159.3H20294342K26898J26343k25754k34222J9531%j03226j831N33219J13144J79061
2169.9H20927505K47574J54267L21426R7199J87072r1629K95029Q8501j06201J27029
2179.5H22247772j30920M68063L81775L52936q6670m48380p3318L1738L55835J01242
2189.1H23200073L49808L11890J96228J42517j40686J26953r4757L662k67258j51062
2198.8H23677368K92130K43759N52292L52478k1363j11770J89667j26343k14081J30310
2208.4H24964447K37122K54592m9819N75714M06952P7438J32675K5635J75247m12292
2218.1H26387711k49558N5542L10516J10093j39466M01306M51737O60858K60696k79998
$$ y = [819928741, 819645615, 819261322, 819218521, 819385452, 819810486, 819890976, 819853058, 820021057, 820011139, 820294342, 820521240, 820647583, 820421829, 820187607, 820207138, 820207138, 820103912, 820102081, 820635300, 820748444, 820927505, 821175079, 821329346, 821650772, 821747971, 821935043, 821843414, 822138443, 822226944, 822120743, 822247772, 822116852, 822584915, 822966690, 823319626, 823232956, 822784576, 822711258, 822742996, 823098831, 823200073, 823549881, 823861771, 824057999, 824200516, 824059830, 824186783, 824092026, 824095688, 823828430, 823677368, 823969498, 824213257, 824765549, 825118027, 825096664, 824984894, 825174561, 825048218, 824834137, 824964447, 825201569, 825456161, 825406342, 825982056, 826389008, 826466446, 826599121, 826624756, 826800003, 826387711, 826138153, 826193695, 826504211, 826614304, 826474838, 826876144, 827327881, 827988739, 828249435, 827969437]
2227.7H27969437m21524L1204J36719l11966j87836k04620M31518L78800L18450N9739
2237.4H28199921r0409N61753k51465l62473m34952j91040j64260l66745O96182N44586
2247H28141098M26559Q2856L26919M13971l39660k40021n44129l8147k00805k67868
2256.7H27760773N60074M39224J96152K59094K72903j49383J27182j71204m00772j99127
2266.3H28694916k69623q7280k57187M21982O55593R24912N60913l49655l27149o97402
2275.9H29270020j87150k14843j09253R8495N1194L25546M32434Q71353k975l7461
2285.6H30497360r6054j15890N1422r18961k43835j34125M83856N75867L8757L30658
2295.2H30469055k80075j5564m76456k74047K9144k25830l2425k79236J75629K4643
$$ y = [827969437, 827547913, 827579117, 827715836, 827403870, 827216034, 827011414, 827442932, 827821732, 828140182, 828199921, 828109512, 828671265, 828419800, 828057327, 827622375, 827431335, 827267075, 826900330, 827596512, 828141098, 828567657, 828650513, 828977432, 829391403, 829051743, 828811722, 828267593, 828229446, 828028641, 827760773, 828320847, 828760071, 828956223, 829215317, 829488220, 829338837, 829466019, 829294815, 828894043, 828694916, 828425293, 828338013, 828080826, 828502808, 829158401, 830083313, 830644226, 830294571, 829967422, 829270020, 829082870, 828868027, 828758774, 828857269, 828908463, 829234009, 829666443, 830537796, 830534821, 830497360, 830401306, 830285416, 830336838, 829417877, 829174042, 829039917, 829523773, 830099640, 830138397, 830469055, 830188980, 830173416, 829696960, 829422913, 829452057, 829226227, 829193802, 828914566, 829090195, 829114838]
2304.9H29114838N24673K77100j23368N4017l38364j45416j139145k33689L55378p8278
2314.5H28267746J96075l23791M07867P40509J58615j120986r10569k95334o41326
2323.2H26478806l26844p6980P68966m16183j60751M10003L67813R19266p13730j053467
2332.8H26196899j428985q7204O38885J33591M64020N1498J73874j272812j66015M16412
2342.5H25120163n68543j46408p45468Q9035N0049M73023J591949J328049j58005r36890
2352.1H26096954o23092o78635j80969k40860p55081p99866l94440n6152J06735r59320
2361.8H21515274p45621K072068N22537j098938o59638R31855J438675m01230N74951
2370.4H24149933N08499k74353k1973M5395n8899j11465M95910M48456J59989k16828
$$ y = [829114838, 829639511, 829916611, 829793243, 829847260, 829508896, 829363480, 828224335, 827990646, 828346024, 828267746, 828463821, 828140030, 828547897, 829288406, 829447021, 828326035, 827415466, 827120132, 826478806, 826151962, 826074982, 826843948, 826427765, 826267014, 826677017, 827044830, 827964096, 827250366, 826196899, 824767914, 824680710, 825319595, 825453186, 825917206, 825968704, 826142578, 824869766, 824703751, 825120163, 824551620, 824405212, 823659744, 823748779, 823798828, 824271851, 825863800, 827191849, 827033844, 826096954, 825473862, 824795227, 824614258, 824373398, 823618317, 822818451, 822424011, 822367859, 822474594, 821515274, 820769653, 822841721, 823364258, 822265320, 821605682, 822537537, 823976212, 823574982, 824149933, 824658432, 824384079, 824362106, 824407501, 824348602, 824237137, 824733047, 825181503, 825341492, 825124664]
2380.1H25124664k8381L89709L62702K37198n8899J29623J98212J38702l15780n05753
2389.7H25671997j84250j64566J98212R1629P9956k15225k99454L22571q4610j97449
2399.4H25218811j46637k47192k93122j32675J35498k35367J04905M27780n9586l43857
2409H24428558m27780m21066J3046P5531n50232n01022J57394M26026j10627j43508
2418.7H22946320J60522k13852o01196o11344J37406J06048n06515l22266n1956R6970
2428.3H21140137j17722l59039j40915o1951l99627n2720J38779l24478l71170l82080
2438H19069214l6240K03705l8299p28531o24390L26767K1744m33045m75998j07345
2447.6H17177582P8888j45340p9499j3275O0425m88739n16815l14484m28772j06201
$$ y = [825124664, 825096283, 825485992, 825848694, 826085892, 826026993, 826156616, 826354828, 826493530, 826177750, 825671997, 825487747, 825323181, 825521393, 825613022, 825692978, 825477753, 825178299, 825500870, 825416260, 825218811, 825072174, 824824982, 824531860, 824399185, 824534683, 824299316, 824404221, 824832001, 824772415, 824428558, 824000778, 823579712, 823592758, 823668289, 823118057, 822617035, 822774429, 823200455, 823089828, 822946320, 823106842, 822892990, 822291794, 821680450, 821817856, 821923904, 821417389, 821095123, 821043167, 821140137, 821022415, 820663376, 820522461, 820460510, 820060883, 820008163, 820146942, 819822464, 819451294, 819069214, 819032974, 819236679, 819198380, 818469849, 817845459, 818172226, 818193970, 817760925, 817284927, 817177582, 817256470, 817111130, 817031631, 817018356, 817078781, 816590042, 816073227, 815758743, 815329971, 815223770]
2457.2H15223770J38855j26877n85251j82952q7433J78680J00479n73349m38080o07528
2466.9H13040314J9684J54724K5482K26288m46930k01416N2871j56173n39322l75900
2476.5H11799622j09711l74146r1476J63879M63410M1122m14505l32489m17404o35681
2486.2H10092621k51618M71421k35520k68631j21689j96685K59018J97830K79083m11301
2495.8H09814529n24597k75879l43170l06396n24674J61972K68326J17569J26801J29623
2505.5H08644104J35880m10080o04096p53708k21329J45569o9275o3171j60065J20621
2515.1H06764450L60642J94015j92108j72272j81427l38363l35312k35520r0790k02560
2524.7H05570755k213j9454J98669K0142m08936r8190n16053o93588m04892J25199
$$ y = [815223770, 815362625, 815235748, 814650497, 814467545, 814380112, 814558792, 814659271, 814085922, 813647842, 813040314, 813059998, 813214722, 813240204, 813466492, 813019562, 812818146, 812871017, 812714844, 812175522, 811799622, 811689911, 811315765, 811224289, 811388168, 811851578, 811892700, 811478195, 811145706, 810728302, 810092621, 809841003, 810312424, 810076904, 809808273, 809686584, 809489899, 809748917, 809946747, 810225830, 809814529, 809289932, 809014053, 808670883, 808364487, 807839813, 808001785, 808270111, 808387680, 808514481, 808644104, 808779984, 808369904, 807765808, 807012100, 806790771, 806936340, 806867065, 806803894, 806643829, 806764450, 807125092, 807319107, 807126999, 806954727, 806773300, 806434937, 806099625, 805864105, 805773315, 805570755, 805568542, 805549088, 805747757, 805767899, 805358963, 805260773, 804744720, 804051132, 803646240, 803771439]
2534.4H03771439K15072k42157m34799j97449P19834Q0108n48324j96610n81970r31168
2544H01653976n15441J13143k66952j56479J85242N58853O10657n26505o44989o11572
2553.7H00399933n02396o408J1596l59268o04248j64185K76490M56543l10822n65262
2563.3G98631973k53906n66406o48346o44913j97754R079k24228j33514O45370L82386
2573G96999741m84314K36816k24762r07593m35104k66190m42657l83301K11868J17340
2582.6G94421844K20032K2431l45383M3030k5330n68466r03473k56119k81601j78985
2592.2G92147980L97415J97220L25012k58408l11279J40915l72543l94135k58713m34951
2601.9G91178513l36075j62659k44217j98593J26648L93219M120j81580l17764j004410
$$ y = [803771439, 803986511, 803744354, 803309555, 803112106, 803831940, 803912048, 803363724, 803167114, 802585144, 801653976, 801138535, 801251678, 800984726, 800828247, 801013489, 801572342, 802182999, 801656494, 801011505, 800399933, 799897537, 799891129, 799902725, 799543457, 798939209, 798775024, 799051514, 799508057, 799197235, 798631973, 798378067, 797811661, 797163315, 796518402, 796320648, 796329727, 796105499, 795971985, 796617355, 796999741, 796515427, 796752243, 796527481, 795619888, 795184784, 794918594, 794475937, 794092636, 794304504, 794421844, 794641876, 794664307, 794318924, 794361954, 794336624, 793768158, 792864685, 792608566, 792326965, 792147980, 792545395, 792742615, 793067627, 792809219, 792497940, 792638855, 792266312, 791872177, 791613464, 791178513, 790842438, 790679779, 790435562, 790236969, 790363617, 790756836, 790760956, 790579376, 790261612, 789257202]
2611.5G89257202q35953m05197m6463k2049L08686N10635n01633n18112m68445m23126
2621.2G86855545k60849o14624j89056j03608n26123n40390j23214o7749o1341K1668
2630.8G84390259m04663p02210o72912k52610o01043o64139j29624j54418p8049n87311
2640.5G80143280n91507k07901k98538l31650m49905n02472m52118j831j45416m45023
2650.1G76716919l03421m35104o22559r58710q08258O7063M70275m04663m51202J81198
2659.8G73451538l77731l71323M6616k25373o35528m63562l81546o10581m55551m66079
2669.4G69510880o1417K09808k64740o76498m91181L3570M9591o8817l19825m40597
2679G67480774o37817r32923l98331L17688K75116k29950j98745l16162p88269q85163
$$ y = [789257202, 788421249, 788016052, 787969589, 787947540, 788256226, 788766861, 788265228, 787747116, 787278671, 786855545, 786594696, 785980072, 785791016, 785687408, 785161285, 784620895, 784497681, 784429932, 784368591, 784390259, 783985596, 783283386, 782610474, 782357864, 781756821, 781092682, 780963058, 780808640, 780730591, 780143280, 779551773, 779343872, 779045334, 778713684, 778263779, 777761307, 777309189, 777307358, 777161942, 776716919, 776413498, 775978394, 775355835, 774397125, 773588867, 773655930, 774126205, 773721542, 773270340, 773451538, 773073807, 772702484, 772749100, 772523727, 771888199, 771424637, 771043091, 770432510, 769976959, 769510880, 769449463, 769659271, 769394531, 768718033, 768226852, 768260422, 768310013, 768241196, 767921371, 767480774, 766842957, 765910034, 765511703, 765829391, 766104507, 765874557, 765675812, 765359650, 764571381, 763686218]
2688.7G63686218k71301K34070m96369n62515k76260l45459J29623J21384l1357l71399
2698.3G61816635q63800n73654m75082m57993j29929p3776j9379k87323k15911q5526
2708G58634262o73141n22309n85251o12030l45916o37818m03824j69220J07575n34
2717.6G54791794j29624k10723o77720o0272k78015p10373J4572j33056m53568j59378
2727.3G51993637j38779l16009l50495m73861j34201q5984l68576l07693m49371k98691
2736.9G49069977m69895n02014K7085K79464j75705p99179j88369L7918l62473k23007
2746.5G46693802j25809m08401k68631M54712K4337o50940o76956n63965m3258K02560
2756.2G44637451m06952n63278J29852N9510J18637O3095n11475m77447m07868j93634
$$ y = [763686218, 763414917, 763648987, 763152618, 762590103, 762313843, 761968384, 762098007, 762219391, 762188034, 761816635, 760952835, 760379181, 759904099, 759446106, 759316177, 759242401, 759223022, 758935699, 758719788, 758634262, 757961121, 757438812, 756853561, 756241531, 755895615, 755257797, 754853973, 754684753, 754792328, 754791794, 754662170, 754451447, 753773727, 753713455, 753435440, 752725067, 752739639, 752606583, 752153015, 751993637, 751854858, 751538849, 751188354, 750714493, 750580292, 750494308, 750125732, 749818039, 749368668, 749069977, 748600082, 748098068, 748125153, 748404617, 748228912, 747429733, 747241364, 747279282, 746916809, 746693802, 746567993, 746159592, 745890961, 746345673, 746370010, 745719070, 745042114, 744478149, 744434891, 744637451, 744230499, 743667221, 743797073, 743856583, 743975220, 744038315, 743526840, 743049393, 742641525, 742447891]
2765.8G42447891j29776j31302l47671l94745O0577J44120j50223o22177K6550N1117
2775.5G40954361q31223n58929l26080k73438m09393l87650k05078l72085l75595l92838
2785.1G36822052l05099J43127o7444q05588m46167k85492n45806o59562m96597J86234
2794.8G33539658j13068j50757k31476o79855r81751j400299o89392l06320l02048
2803.4G28684692m52499n53970k47345n58472p46536p27616n31463q97675j071625
2812.1G22897491o58416n71137m48303n35660l27377o25000m93775k38571j137695
2820.8G17861557j132507q23822p88956r98154r60693q48999j005936n64117n12772
2829.5G10225601o27212p69883r04464q26874r95560j350860j407090r51995r61686
$$ y = [742447891, 742318115, 742186813, 741839142, 741444397, 741504974, 741649094, 741498871, 740876694, 740903244, 740954361, 740123138, 739564209, 739238129, 738964691, 738555298, 738167648, 737962570, 737590485, 737214890, 736822052, 736516953, 736660080, 736592636, 735787048, 735340881, 735055389, 734509583, 733850021, 733353424, 733539658, 733426590, 733275833, 733044357, 732364502, 731382751, 729982452, 729293060, 728986740, 728684692, 728232193, 727678223, 727430878, 726872406, 726125870, 725398254, 724866791, 723969116, 722897491, 722239075, 721667938, 721219635, 720683975, 720356598, 719731598, 719237823, 718999252, 717861557, 716729050, 715905228, 715116272, 714118118, 713157425, 712308426, 711302490, 710738373, 710225601, 709598389, 708828506, 707924042, 707097168, 706101608, 704750748, 703343658, 702391663, 701429977]
2838.2G01429977r49554j182098j354905q48922j267548j840057j769791j484909j068497
2846.8F89663696j288910j904831j827850j772613j265030m71344j160813j345749
2854.6F78626556r56573j150589j308823p10144j07651j007614r89685m56619q66165
2863.2F71072693j361771j604843r78928r95712j929779k325439j667099j187973j276245
2871.9F57744904j347580j703568j540832j652298k041397j897202j645432j477432
2879.6F44439163j528168j593704j388435q40759j010399j001320q80699j081658o36367
2888.3F34477654n99556m22364n99441m76303q5869m13971O4201k09999l18413l4675
2897.9F31381264n02320p22732m60854o3362n22690m41742p51762p59048K19421m36287
$$ y = [701429977, 700480423, 699298325, 697943420, 697094498, 695826950, 693986893, 692217102, 690732193, 689663696, 688374786, 686469955, 684642105, 682869492, 681604462, 681133118, 679972305, 678626556, 677669983, 676519394, 675210571, 674500427, 674392776, 673385162, 672395477, 671938858, 671072693, 669710922, 668106079, 667127151, 666131439, 664201660, 661876221, 660209122, 659021149, 657744904, 656397324, 654693756, 653152924, 651500626, 649459229, 647562027, 645916595, 644439163, 642910995, 641317291, 639928856, 639088097, 638077698, 637076378, 636195679, 635114021, 634477654, 633878098, 633455734, 632856293, 632379990, 632294121, 631880150, 631944351, 631734352, 631415939, 631381264, 630878944, 630156212, 629695358, 629631996, 629109306, 628667564, 627915802, 627156754, 627376175, 626939888]
2907.6F26939888p65533q24967j326141j257477r90295j334839j499977j131592j771584
2916.3F16037483j581573j150322j383896j179962j047325r88427j944236k009697
2924F04752045p57256l44238j60370m9095n20783k73285J072579P00378k25792L47557
2933.6F04541740Q98705R34486J035195J521988J699447J711502J858406J984482J975403
2942.3F18161354K001877J949577J833077K121772J631890J318397J755791K216835
2950F32990570K536774K060127J591301J268387J692276K159042J829071J797104J823731
2958.7F49748383J665420J516419J696395J695099J794052K019501J958924J776504
2966.4F63870697J418610J403732J208801J212692J407547J479722J642074J571732
$$ y = [626939888, 626174355, 625349388, 624023247, 622765770, 621775475, 620440636, 618940659, 617809067, 616037483, 614455910, 613305588, 611921692, 610741730, 609694405, 608705978, 606761742, 604752045, 603994789, 603650551, 603490181, 603441086, 602920303, 602647018, 603719597, 604419975, 604194183, 604541740, 605440445, 606374931, 607410126, 608932114, 610631561, 612343063, 614201469, 616185951, 618161354, 620163231, 622112808, 623945885, 626067657, 627699547, 629017944, 630773735, 632990570, 635527344, 637587471, 639178772, 640447159, 642139435, 644298477, 646127548, 647924652, 649748383, 651413803, 652930222, 654626617, 656321716, 658115768, 660135269, 662094193, 663870697, 665289307, 666693039, 667901840, 669114532, 670522079, 672001801, 673643875, 675215607]
2974.1F75215607J319656J192856J693725J702576J526566J181335O92673Q10699O71692
2982.8F86007385R94339R88846J025772J257172R12552J031875Q22602P35550Q27713
2991.5F94603806M44335J60752L47214L94516O01577P52182L9749J39008m3030O7826
3001.1F97507935Q39843L95890n3254l71704m48150m62265N8059K60849j03912M5853
3010.8F97669144l93677m04434m03595n98984q88138n31235J0148q96073n67322k63519
3020.4F92732315n25360l09753l68424o73675j241227p40280l90091m28467m71344
3029.1F87583694p57370j393203j593247l02963n43518r55124p02362r90601q01849
3037.8F79543457p71255m37546m47541j034545j050721j076812j347962p19757n23682
$$ y = [675215607, 676535263, 677728119, 679421844, 681124420, 682650986, 683832321, 684524994, 685335693, 686007385, 687001724, 687990570, 689016342, 690273514, 691186066, 692217941, 693040543, 693776093, 694603806, 695048141, 695208893, 695556107, 695950623, 696552200, 697304382, 697344131, 697483139, 697440109, 697507935, 698347778, 698743668, 698690414, 698318710, 697870560, 697408295, 697466354, 697727203, 697623291, 697669144, 697275467, 696871033, 696467438, 695868454, 694980316, 694449081, 694459229, 693563156, 692995834, 692732315, 692206955, 691897202, 691528778, 690855103, 689613876, 688873596, 688483505, 688055038, 687583694, 686826324, 685433121, 683839874, 683536911, 682993393, 682038269, 681335907, 680345306, 679543457, 678772202, 678334656, 677887115, 676852570, 675801849, 674725037, 673377075, 672657318, 672133636]
3046.5F72133636j148834q61740r16214o32782p34939j137925o61468r61456p57523
3055.1F64320755q98895j451950j256104j083145q00247r27277r79538o91681o75506
3063.8F55556412j167374p85370j020813j811218o24390o15539j045685q14743j135864
3072.5F46535416j011734r01032p41272r65729j397934r65423n75829j129608j053085
3081.2F37793770m37584o40488q30650j228104j259308j122131j308479j235390j080627
3089.9F28651009q58460j007614q03528p74574o79703n82313j450653j281205r66606
3098.5F20246353j015892q68835j180878j445580j140785n45387p66945r98611n57709
3107.2F11725731m73251q89855j033363j091881j323242j152039j047172p49855m06952
$$ y = [672133636, 670984802, 670123062, 669206848, 668574066, 667839127, 666701202, 666039734, 665078278, 664320755, 663421860, 661969910, 660713806, 659630661, 658830414, 657903137, 656923599, 656231918, 655556412, 654389038, 653603668, 652582855, 650771637, 650147247, 649531708, 648486023, 647671280, 646535416, 645523682, 644622650, 643881378, 642915649, 641517715, 640552292, 639976463, 638846855, 637793770, 637356186, 636715698, 635885048, 634656944, 633397636, 632275505, 630967026, 629731636, 628651009, 627792549, 626784935, 625981407, 625206833, 624527130, 623944817, 622494164, 621212959, 620246353, 619230461, 618361626, 617180748, 615735168, 614594383, 614048996, 613282051, 612283440, 611725731, 611252480, 610362625, 609329262, 608237381, 606914139, 605762100, 604714928, 603965073, 603558121]
3115.9F03558121j042176j418533r49097j014022q69904q02765j757049j231575n20325
3124.6E93952675o79169q90770j213531o96526r48562j426774r93957o03638j026954
3133.3E85472794j413651q38394q87985p04995n93490r00879q63342r84955j151962
3141.9E77133141j321183q55140q35038o85424o18897j274910j024895q08372q17757
3150.6E68891525j031227p13806q71391j546746r98802o60896l17612p02743j066933
3159.3E60981369r45625j037903o48384p68509p87811j018410j104813q71277q42895
3168E52955742r31320j422654j028823k88926j73034j023865q57124k61078j075401
3176.6E45893517j153527j164894r44252q99582j072082q83370p88612k24228m88167
$$ y = [603558121, 602515945, 601097412, 600148315, 599134293, 598264389, 597461624, 595704575, 594473000, 593952675, 593273506, 592382736, 591169205, 590472679, 589524117, 588097343, 587103386, 586499748, 585472794, 584059143, 583220749, 582332764, 581627769, 581034279, 580133400, 579270058, 578285103, 577133141, 575811958, 574956818, 574121780, 573436356, 572817459, 571542549, 570517654, 569709282, 568891525, 567860298, 567146492, 566275101, 564728355, 563729553, 563068657, 562751045, 562048302, 560981369, 560035744, 558997841, 558349457, 557580948, 556793137, 555774727, 554669914, 553798637, 552955742, 552024422, 550601768, 549572945, 549284019, 549110985, 548087120, 547229996, 546968918, 545893517, 544739990, 543575096, 542630844, 541731262, 540659180, 539775810, 538987198, 538762970, 538274803]
3185.3E38274803o55556p71522r28650p65915r43031p88269r80110j007042q69751
3194E30564957m47884n42297r53713m41437o13899p93762j114883j039086n82313p18422
3203.6E23317261p88994j054497q53119o41975n73769o13289m17938p89642j237107
3212.3E16346931k15873o83441j119881n58663m24041k49329q81462r94682m65813
3221E10753746l82881r68819j050987o34880o40030m23012n40657o21414q99010j013946
3230.7E03578110l31192j1330l22113m54674m20837r53713r15794o83670l93105m52613
3240.3D98639069q48046o09321r76029m73938l93753q05168n7945o04897q49266k88544
3249.9D92732162o51969j096802o18363k43530n10330o66542p91245m52461j9188l60756
$$ y = [538274803, 537619247, 536847725, 535919075, 535153160, 534210129, 533421860, 532441750, 531434708, 530564957, 530117073, 529574776, 528621063, 528179626, 527565727, 526771965, 525657082, 524617996, 524035683, 523317261, 522528267, 521473770, 520620651, 519978676, 519404907, 518791618, 518373680, 517584038, 516346931, 516131058, 515447617, 514327736, 513769073, 513345032, 513095703, 512214241, 511219559, 510753746, 510370865, 509402046, 508351059, 507716179, 507076149, 506653137, 506112480, 505491066, 504592056, 503578110, 503246918, 503235588, 502913475, 502458801, 502037964, 501084251, 500168457, 499484787, 499091682, 498639069, 497791023, 497181702, 496205673, 495731735, 495337982, 494532814, 494474869, 493869972, 493020706, 492732162, 492080193, 490983391, 490365028, 490121498, 489611168, 488944626, 488153381, 487700920, 487681732, 487320976]
3259.6D87320976j178970m57153L43551m24232q25577r42383l68957j12877m2458J31989
3269.2D83443909o34499q70323o78711l64189o85616m87709j18294p68852n60188o02226
3278.9D77673302m56238k82135k97852j27716p41501n20706R7122m0741n23033p34405
3288.5D74046097o92368m20036k25182l69148m53873q88938l06511P858p02324n92194
3298.2D69403381n43365n58472l47023o6795o44989j255722m80461k17095m50325j70364
3307.8D64668770m29878p61223l05901n35888n84145m43497o00204l73917q05054p48100
3317.4D59080963o95038o68754m85535p36999k47651k83317o00586p87544l73536l00903
3327.1D53901100j056022p29523p10259n47752o92062n74227k37045j308670q32329
$$ y = [487320976, 486142006, 485684853, 486028404, 485604172, 484778595, 483836212, 483467255, 483354378, 483311920, 483443909, 482809410, 481939087, 481260376, 480896187, 480210571, 479722862, 479604568, 478835716, 478275528, 477673302, 477217064, 476934929, 476637077, 476509361, 475767860, 475247154, 475344276, 475303535, 474780502, 474046097, 473353729, 472933693, 472708511, 472339363, 471885490, 470996552, 470690041, 470697899, 469995575, 469403381, 468860016, 468301544, 467954521, 467887726, 467242737, 465987015, 465506554, 465289459, 464839134, 464668770, 464238892, 463477669, 463171768, 462635880, 462051735, 461608238, 461008034, 460634117, 459829063, 459080963, 458385925, 457717171, 457231636, 456494637, 456246986, 455963669, 455363083, 454575539, 454202003, 453901100, 452845078, 452115555, 451405296, 450857544, 450165482, 449591255, 449354210, 448045540, 447213211]
3335.8D47213211j61705m70276m38347p20710j287003j098442k17705m67415q76083
3344.4D41475525o95152l07923k37198q99391r41200l67928l41034j035270j132279
3353.1D35518150q09669p15332o31523q18138r02787o20994n00641p71790m62608p82738
3362.8D28501930j147651l39432p33071r29679m7532l54309j276855j162567r16176
3371.4D21594658q83827m15306m28772o32630n81894n22346r60236n59501L3416r16099
3381.1D15727463o63262j48430l27301o29272r58900m97628k99492r3498l26462j79596
3390.7D11603622N5237q05664p11937j07879l04909j124993j292533n72434J59722
3399.4D06898232J94320o30569p39327l33481o4125K53411K937r81064n28793P477
$$ y = [447213211, 447051506, 446581230, 446142883, 445422173, 444135170, 443036728, 442819023, 442351608, 441475525, 440780373, 440472450, 440235252, 439335861, 438394661, 438026733, 437685699, 436650429, 435518150, 434708481, 433993149, 433361626, 432543488, 431640701, 431019707, 430519066, 429747276, 429284668, 428501930, 427354279, 427014847, 426281776, 425352097, 425304565, 424950256, 423673401, 422510834, 421594658, 420710831, 420295525, 419866753, 419234123, 418652229, 418129883, 417169647, 416610146, 416643562, 415727463, 415064201, 414915771, 414588470, 413959198, 413000298, 412502670, 412203178, 412109680, 411783218, 411603622, 411658859, 410853195, 410141258, 410033379, 409728470, 408603477, 407310944, 406738510, 406898232, 407092552, 406461983, 405722656, 405389175, 405325050, 405578461, 405581398, 404600334, 404071541, 404079018]
3409.1D04079018p22008l36037j28479k70462k36244N5428o8436m86984J01127J04752
3418.7D02091675M79774j26877j165428n51490j75057J65520j73226j10817q3465m1123
3428.3D00309486L22686O3972j12076m48112K80227L48053l38478k70538K86484O05125
3438D01046829q3771J26992O91566Q80394k30522k36778P03926L85017O29730q19282
3447.6D03094101k33612Q46290M42772N75295l60680O9580Q47397J328736L81813o10009
3457.3D06381683M53034P87239R63936J59073L30810M16336K5406O43387M70848O81534
3466.9D11313286R842M97818Q70704J30654M95949N91392J016693N86052K06299L30772
3476.6D16049461M27590M28200N24597J108970N46990l4371n74493P70225J734429
$$ y = [404079018, 403357010, 403020973, 402892494, 402622032, 402385788, 402441216, 402372780, 401885796, 401986923, 402091675, 402571449, 402444572, 401279144, 400727654, 400552597, 400718117, 400544891, 400434074, 400350609, 400309486, 400632172, 400696144, 400584068, 400135956, 400416183, 400764236, 400425758, 400155220, 400441704, 401046829, 400963058, 401090050, 401781616, 402662010, 402431488, 402194710, 402898636, 403283653, 403913383, 403094101, 402860489, 403706779, 404149551, 404724846, 404364166, 404433746, 405281143, 406609879, 406991692, 406381683, 406834717, 407621956, 408585892, 408744965, 409075775, 409492111, 409517517, 410160904, 410631752, 411313286, 411323128, 411820946, 412691650, 412822304, 413318253, 413909645, 414926338, 415512390, 415718689, 416049461, 416477051, 416905251, 417429848, 418538818, 419085808, 419051437, 418476944, 419247169, 420981598]
3485.2D20981598R29298J271439N15633L0555P37152O42815J53N72166R22890M12750
3494.9D27016449R76181k11639j07079J637077J596489R78928R22775J124306l82309
3503.6D33551178n60265N89180Q32329O29883J143341J063156k60620J102028J447029
3512.2D39537239Q59337Q40454P92198P19719j47667N34668J351814R29261L33290
3520.9D45750313J669388J971016p54204K34146J441879J184578K67372K13585R69620
3529.6D52947693P02972N52559N27039J417351J274986J495666O48842m07677J119614
3538.3D60279045J111183J445198J003189J374436J589775J265488R00497k02942J808853
3547D70574722o91261J32103K218742J953926K191735j065293R12781J029930J213570
$$ y = [420981598, 421910896, 423182335, 423697968, 423728523, 424465675, 425108490, 425108643, 425680809, 426603699, 427016449, 427992630, 427780991, 427673912, 429310989, 430907478, 431886406, 432809181, 433933487, 433551178, 432990913, 433580093, 434412422, 435042305, 436185646, 437248802, 436988182, 438090210, 439537239, 440396576, 441237030, 442029228, 442748947, 442601280, 443135948, 444487762, 445417023, 445750313, 447419701, 449390717, 448636513, 448870659, 450312538, 451497116, 451764488, 451978073, 452947693, 453650665, 454203224, 454730263, 456147614, 457422600, 458918266, 459567108, 459159431, 460279045, 461390228, 462835426, 463838615, 465213051, 466802826, 468068314, 468968811, 468765869, 470574722, 469883461, 470015564, 472234306, 474188232, 476379967, 475314674, 476227455, 477257385, 478470955]
3555.6D78470955K207870k3574J845169J984672P27120K40936K288360J057015j73149
3564.3D88625374N351639R96551p12242P87087j088257L259506J870232J712913J427345
3573E02230148J253701J128387J302605K232284P02172L445358K576713M4823J205864
3581.7E16122055K064285K182694J134987M690170K222786k100258J052933j293526
3589.4E26076126L059273L328667L723983K005005O94580L870621j927032K140884
3597.1E42972107M181824M57191L090439R44023P91626K345848J677628K038192L929329
3605.8E62428207L363114j665344L246154j467056j94282R310035P54700k607460M543495
3614.5E77711563p73010N061111N877190q52318M6578j339455J352005L534241K340164
$$ y = [478470955, 480678825, 480655251, 482500420, 484485092, 485212212, 485453148, 487741508, 488798523, 488625374, 493977013, 494973564, 494261322, 495048409, 493960152, 497219658, 499089890, 500802803, 502230148, 503483849, 504612236, 505914841, 508147125, 508849297, 512294655, 514871368, 514916191, 516122055, 518186340, 520369034, 521504021, 526194191, 528416977, 526316719, 527369652, 526076126, 529135399, 532464066, 536188049, 538193054, 538887634, 542758255, 540831223, 542972107, 547153931, 547611122, 550701561, 551645584, 552437210, 554783058, 556460686, 558498878, 562428207, 565791321, 564125977, 567372131, 565905075, 565710793, 575020828, 575775528, 573168068, 577711563, 576938553, 581999664, 587876854, 587024536, 587071114, 585731659, 587083664, 590617905, 592958069]
3623.1E92958069K117233L364372K898407J935158Q144493K349396j6297417L865242
3630.9F01334953O299782O542549J065979l453483K055931M074630L285065j60065
3638.6F21045341J103058L271523K898865N72548o10886K582893M905510P110329j513367
3647.3F41365814l703575P063866j831818n901031k505722N746154N998612N341186
3655F51573486M414902j1590042J695557O756363K164764J662750O32095K397233R10110
3663.6F60617218P33795J046753N50156N723648M228821j83487j007462r837189K530823
3672.3F64403076J0029831J1922913J890945k4587479J717301Q722000O035156k799988
3680F77333755j125793L519974K267151J055755L79486J099472N194016P413483j1756440
$$ y = [592958069, 595075302, 598439674, 601338081, 603273239, 611417732, 613767128, 597469711, 601334953, 607634735, 614177284, 615243263, 611789780, 613845711, 617920341, 621205406, 621045341, 622148399, 625419922, 628318787, 628891335, 628280449, 630863342, 635768852, 642879181, 641365814, 637662239, 644726105, 642894287, 636993256, 634487534, 640233688, 646232300, 651573486, 655988388, 644398346, 646093903, 652850266, 655015030, 656677780, 657309875, 659707108, 660617218, 661351013, 662397766, 662947922, 668671570, 672900391, 672716904, 671709442, 661872253, 664403076, 674432907, 686355820, 688246765, 663659286, 665376587, 674098587, 680133743, 677333755, 676207962, 679727936, 681995087, 683050842, 683430328, 684529800, 689723816, 697137299, 685380859]
3688.7F85380859m766693J0184098o964875J93024O306534L11126K093964K58560o50329
3697.4F92346268K212372R45510K423096L501511n522232k824860N311661J279144
3705.1F99672470J15433R17435K806625M797516p169647N523223O173554j7766037
3712.8F95070572L611069M897155L38440O38657K875137K129364l890838J456222P413101
3721.5G14538879m304428o377639O288833K213593n87082l758698k67334M740219J993485
3730.2G14479828P581863k963485r824067J2448655K928466j4649505q63419K910080
3737.9G12048416J057739L190079L831558l816757M194641J4963532j4874954k0689316
3745.6F99904938J4027328Q041764Q711319m072800j3798981J4249268q548737j0195389
$$ y = [685380859, 680614166, 690798264, 683833389, 684026413, 690332947, 690644073, 692738037, 692996597, 692346268, 694558640, 695504150, 697927246, 701428757, 695906525, 693081665, 698393326, 699672470, 699787903, 700705338, 703511963, 708309479, 701139832, 706663055, 712836609, 695070572, 698681641, 703578796, 703917236, 704555893, 707431030, 709560394, 705669556, 707125778, 714538879, 710234451, 703856812, 710145645, 712359238, 711772156, 708013458, 707746124, 712486343, 714479828, 722061691, 719098206, 709274139, 721722794, 724651260, 710001755, 709138336, 712048416, 713106155, 716296234, 720127792, 716311035, 720505676, 735469208, 720594254, 699904938, 713932266, 721974030, 730685349, 726612549, 712813568, 727062836, 718514099, 708318710]
3753.3G08318710P946778O482849M042740o707688L163147O989670j1098480k011490
3761G17126236N567856J644897J330567M903946k974778o364898L467178O902313J433487
3769.7G33036804j1794739P46384L817215J077728J568451m80270O00662J064758M415284
3778.4G34052277J153335j0712509J534271K711945J658783L935013l607941j699295
3786.1G29025879K082443O54984L53088q82568L3188M00314P65839k56806J548996
3794.8G33725357M769211m247284n138855K925720O050339Q642654q355789j3595047
3802.5G24776306M347382L025894O114654Q189087j2342300o691437N824204K389526
3810.2G35633316Q50601R81369N47943J912308O774140j340104j8261337N973663Q251114
$$ y = [708318710, 716265488, 722748337, 726791077, 720083389, 723246536, 730236206, 719137726, 717126236, 722694092, 724338989, 725669556, 730573502, 727598724, 721233826, 724701004, 731603317, 733036804, 721242065, 721988449, 725805664, 726883392, 728451843, 727971573, 728572235, 729636993, 734052277, 735205612, 724493103, 726027374, 728739319, 730398102, 734333115, 730725174, 729025879, 731108322, 731763306, 732116394, 731233826, 731267014, 731667328, 732433167, 732176361, 733725357, 738494568, 734247284, 729108429, 732034149, 738084488, 746727142, 738371353, 724776306, 729123688, 732149582, 738264236, 746453323, 734111023, 727419586, 733243790, 735633316, 736483917, 737465286, 738013229, 739925537, 746699677, 745359573, 727098236, 733071899, 741323013]
3818.9G41323013O542435J618195k2644730K137909O065140K982711M666138P09305
3826.6G43400116o485291q54644K551117M699020K501831j0932770L505097R551925
3834.3G47936401p201995K86712J1594086j1342163p067795J0869980o361847j393967
3842.1G37319412R009629l000641o123505L501968K056122J48316K597808j099777
3849.8G44409332K935410Q152008p482605K16751k0680084L172149J4357377j446915
3857.5G43633423k932434K181091L097458M208145o747436N95550R625778r448700
3865.2G44212875q311920N531388P084274Q585434j0361023j2029114N702896Q422394
3872.9G48837204M585876j3748703N26658N377883j07498L300858Q302231n413437
$$ y = [741323013, 747865448, 749483643, 726838913, 728976822, 735041962, 738024673, 742690811, 743400116, 736914825, 736060181, 738611298, 743310318, 745812149, 734879379, 738384476, 747936401, 740734406, 741021118, 752615204, 741273041, 734205246, 745075226, 738713379, 737319412, 746329041, 743328400, 737204895, 740706863, 742762985, 742911301, 745509109, 744409332, 747344742, 755496750, 748014145, 748230896, 727550812, 730722961, 745080338, 743633423, 740700989, 742882080, 745979538, 750187683, 743440247, 744035797, 753661575, 744212875, 735900955, 741432343, 748516617, 757102051, 746741028, 734711914, 740414810, 748837204, 753423080, 739674377, 740201035, 745578918, 745471420, 748772278, 757074509, 751661072]
3880.6G51661072j2463837O600647J901245K289353O602249j6936951L98483N370865
3888.3G45423126K209549O404190r5138j0791550Q83026L874207k303772J005859J683502
3897G48292999L497620L336182j1587296O291046L144226p193222O416779m176560
3904.7G48021774l890457K40173J313248L014298n47791M9439M93011Q53500O9428
3913.4G49616623q40225J699371K629623m025650m381561N855332M14199n661621K995987
3922.1G48302078L346329K658615k390594n610810J312027K501602J606064j224441
3929.8G50500870j63803K718506l651352l041916J719894L04871L15857J380767N93491
3938.5G50677185K66342l45917J580735J910553n009232j331100J809158J381607K322083
$$ y = [751661072, 739197235, 745797882, 747699127, 749988480, 756590729, 739653778, 740052261, 745423126, 747632675, 754036865, 753941727, 743150177, 744033203, 747907410, 745603638, 746609497, 748292999, 751790619, 755126801, 743539505, 749830551, 752974777, 745781555, 752198334, 748021774, 744131317, 744371490, 745684738, 748699036, 748151245, 748200684, 748693695, 749547195, 749616623, 748776398, 750475769, 753105392, 749079742, 744698181, 750553513, 750967712, 745306091, 748302078, 751648407, 754307022, 751916428, 746305618, 747617645, 750119247, 751725311, 750500870, 750337067, 753055573, 749404221, 746362305, 748082199, 748387070, 748702927, 750083694, 750677185, 750943527, 750597610, 752178345, 754088898, 749079666, 747748566, 749557724, 750939331, 753261414]
3947.2G53261414k054444N96085J25732l463516K121201Q28628j139450M16489N69763
3955.8G51261902J449o31027K26212m26636J266022P58972k291946L02505P21359l0594
3965.5G51158218M27628j80664M47998k57263o17752J327743j33819p80564R32160
3974.2G52323685J27487m48303n73578L69110M88129l57056O76803N44358m86908n65796
3983.8G52097931L68271j77613r51156n9967N07889J013870m76837o81458O25763l128
3993.5G52263565r5062k82288l2730Q49762M94309q63419r14841
4000.2G51419296
$$ y = [753261414, 751206970, 751803055, 751928787, 748465271, 750586472, 751415100, 750275650, 750692139, 751261902, 751263351, 750632324, 750858536, 750431900, 751697922, 752456894, 750164948, 750467453, 751188812, 751158218, 751585846, 751405182, 751853180, 751595917, 750978165, 752305908, 752172089, 751391525, 752323685, 752451172, 752002869, 751429291, 751798401, 752286530, 751929474, 752606277, 753150635, 752663727, 752097931, 752466202, 752288589, 751337433, 751277466, 751785355, 752799225, 752322388, 751640930, 752266693, 752263565, 752168503, 751886215, 751853485, 752703247, 753197556, 752334137, 751419296]
##END=$$ End of the data block
