##TITLE=$$ Begin of the data block
##JCAMP-DX=5.00 $$ ACD/SpecManager v 10.08
##SPECTROMETER/DATA SYSTEM=Varian
##DATE=20 Nov 2012 14:36:04
##DATA TYPE=INFRARED SPECTRUM
##DATA CLASS=XYDATA
##ORIGIN=
##OWNER=
##NPOINTS=3735
##FIRSTX=399.26403809
##LASTX=4000.35498047
##MAXX=4000.35498047
##MINX=399.26403809
##MAXY=81.44432831
##MINY=37.54674149
##XFACTOR=1.0000000000
##YFACTOR=0.000000100000000
##FIRSTY=62.17897034
##DELTAX=0.96440572
##XUNITS=1/CM
##YUNITS=TRANSMITTANCE
##XYDATA=(X++(Y..Y))
399.3F21789703M366837K340164m395027L40538J964035k748146k069588q579521n700760
407.9F07308235N532761J91231K96707O353264Q724021Q571358p707748q850403k406693
416.6F18012733l086624P357750K508507P54013q5487j996155j781006r32617L928337
425.3F24679451l180656o719819j051864k49138m589043m072990L668594J046868r47419
434F08583984M28200J895752M605179O99615l48968j607552k363701p83615m56543
442.7F10652351q61549K683945O145248J922455j466637K467957P328720M133568j673203
451.3F31332855k58140m85764j546898m997711p390976j07803Q158455M439239j336479
460F27806778m401856j163711K173004N207710J531449o168671l154755M4442m907685
$$ plain form
399.3 621789703 626156540 628496704 624101677 624442215 626406250 623658104 621588516 613008995 607308235
407.9 607308235 612840996 613032227 613328934 619682198 628406219 636977577 629269829 620419426 618012733
416.6 618012733 614926109 622283859 624792366 625546379 625460892 623464737 621683731 620751114 624679451
425.3 624679451 621498795 614778976 613727112 613477974 608888931 604815941 608484535 609531403 608583984
434 608583984 609012184 610907936 615513115 616212730 615863762 614256210 611892509 611108894 610652351
442.7 610652351 609790802 612474747 618619995 620542450 619075813 621543770 628872490 633006058 631332855
451.3 631332855 631074715 630588951 629042053 624044342 616653366 616545563 624704018 629143257 627806778
460 627806778 623404922 622241211 624414215 629621925 631153374 624984703 621829948 621874390 616966705
468.7F16966705q758888j963844J781616q51212P323380K996254l362007l69148K952804
477.4F16715660K009239n537681m727516j718636l733749l744164p321892O63605N045586
486.1E97650452J700935J33400L569069N957985j510086j745148l36380J12953j744575
494.7F03788605n982819r42230N68199L6659L24364L190193K897034m37622J184463
503.4F04626846k419471k010117q48351n083122p457962l292122J547051l256951k756843
512.1E79048958m00086L442116N292092R94453j063080n626373k285309k732620m069443
520.8E72600708j939163m537773l545456r72672M6692j265678L748817N775604K381211
529.5E72292290J65786k296867j352844m84047l30010j487312k017288n760J905327
$$ plain form
468.7 616966705 608207817 606243973 608025589 607174377 614497757 617494011 614132004 613762856 616715660
477.4 616715660 618724899 613187218 608459702 606741066 603007317 599263153 591941261 592604866 597650452
486.1 597650452 599351387 599484787 603053856 609011841 607501755 605756607 605420227 605533180 603788605
494.7 603788605 597805786 596863556 597431755 597468414 597792778 600982971 603880005 603442383 604626846
503.4 604626846 602207375 600197258 599348907 594265785 586807823 583515701 585062752 581805801 579048958
512.1 579048958 578648872 582090988 587383080 588377533 587314453 581688080 579402771 576670151 572600708
520.8 572600708 570661545 566123772 562578316 561605644 561652336 560386658 564135475 569911079 572292290
529.5 572292290 572458076 570161209 568808365 568324318 567994308 566506996 564489708 564483948 566389275
538.1E66389275N336761N552483M746093M065934L783302K634506J126099R231l571739
546.8E90071945k912292j206627k403069j522255o87599O63872K640037K725487J749268
555.5E89118767j20926j739044j567002l852729m445763k384224m580765l813095k082176
564.2E64533043j950836j534310K30103J389198j985130k463608l042526k329903k137298
572.9E50708733l793755k094345j435928o1646q30460J675721M445839M031829M053345
581.5E56699333N140991P118721L833466J857643O35529j082535j385880j506576L48739
590.2E71659431Q72117K352485L940888L529663J988640K391891L569794P30781k064361
598.9E88971329l025666l085556m269714l238449r55696j44501J731873J487159K967377
$$ plain form
538.1 566389275 571726036 577278519 582024612 586090546 589873848 592508354 593634453 593643684 590071945
546.8 590071945 587159653 585953026 583549957 582027702 581340103 582003975 584644012 587369499 589118767
555.5 589118767 588997841 587258797 585691795 581839066 577393303 575009079 570428314 566615219 564533043
564.2 564533043 562582207 561047897 561278000 562667198 560682068 558218460 555175934 552846031 550708733
572.9 550708733 546914978 544820633 543384705 543323059 542492599 544168320 548614159 552645988 556699333
581.5 556699333 561840324 568959045 572792511 574650154 575285683 574203148 572817268 571310692 571659431
590.2 571659431 572531548 574884033 578824921 582354584 584343224 586735115 590304909 591035690 588971329
598.9 588971329 585945663 582860107 578590393 575351944 574396248 574251747 575983620 577470779 580438156
607.6E80438156L992729L646927K254677r92622j700402j849098j095390k116852l003731
616.3E79574394k60277J649209K677536L955001N201912M450836M550972K845040R24721
624.9F05569344M6310j544342j424980k414208k298660K68097K933464L494034K651901
633.6F07280960L060074L681450M915542K119713j752434k054138j958618k658577
641.3F12633972l394508j885643o93588J206703L117904K644959L097267K910652K936554
650F22574272K194367K0523j652375k343521k638931k948761j566086j57661N52139
658.7F14033966J955338K981109L472634M520530L290024L56941N91393P75184j918067
667.4F30059052j4967576l62434K270279M75693J251487J572571M584885N958519L640747
$$ plain form
607.6 580438156 584430885 588077812 590332489 589339867 587639465 585790367 584694977 582578125 579574394
616.3 579574394 579314117 580963326 583640862 587595863 592797775 597248611 601799583 604644623 605569344
624.9 605569344 605615654 604071312 602646332 600232124 597933464 598201561 601135025 604629059 607280960
633.6 607280960 610341034 614022484 618938026 621057739 619305305 617251167 615292549 612633972
641.3 612633972 609239464 607353821 606660233 607866936 610984840 613629799 616727066 619637718 622574272
650 622574272 624768639 624789162 623136787 620793266 618154335 615205574 613639488 613481827 614033966
658.7 614033966 615989304 618970413 622443047 626963577 630253601 630610542 631201935 631977119 630059052
667.4 630059052 615091476 614729042 616999321 617475014 618726501 620299072 624883957 630842476 634483223
676.1F34483223K623367M83856p86552j172295j902084k073212k598953k574692o46782
684.7F25835876K343560L380127L759231L626366L477707K565384j89896j967926k987251
693.4F39843178m103699m698830l633918k170296r74236P86057J958694L136940K462960
702.1F32606850J377754r4605j656570k405357l756562k989502l111877l287735o69937
710.8F16012459J601753K384262L006058N975723N726318K728119L088303K709503
718.5F43232498l78723j522064j101761j728172j071740Q91419K622223L917389N652694
727.2F50513763O949158N672836M145737J832962J43585p72552k477417j746750j847992
735.8F62413330j915054N74341J674194K627106L552169M042359M284439K284317p85065
$$ plain form
676.1 634483223 637106590 637590446 636803894 635631599 633729515 631656303 629057350 626482658 625835876
684.7 625835876 628179436 631559563 635318794 638945160 642422867 644988251 644798355 642830429 639843178
693.4 639843178 635739479 631040649 627406731 625236435 624262199 625048256 627006950 630143890 632606850
702.1 632606850 633984604 633889999 632233429 629828072 626071510 623082008 619970131 616682396 616012459
710.8 616012459 617614212 619998474 623004532 628980255 634706573 637434692 640522995 643232498
718.5 643232498 642853775 641331711 640229950 638501778 637430038 638321457 640943680 644861069 650513763
727.2 650513763 657462921 663135757 667281494 669114456 669258041 668485489 666008072 664261322 662413330
735.8 662413330 660498276 661072617 662746811 665373917 668926086 672968445 677252884 679537201 678752136
744.5F78752136j317749j700897n921707p051239m664688k775040r90524L09524J935730
753.2F56575546J252518O84662K064819J210175r86939l784179n185395m703674m176102
761.9F42951431k888031k222633j492386J224022K618103L787537N781555N177383
769.6F54936981K977600K058640J322174J57165j153869j778183j21002J845703L109131
778.3F63354340M782104M965057N503464P293930O598358M346238J844101n00412j679841
787F96507339j695098j106415k493897j529388J336975L530121N011062M389115N261841
795.6G09211655M802398K774430J281509m69665j488724k935333j696091q69141j223602
804.3G09387436M25949K814255M760208M698334M067306L072052J547012l60412j571045
$$ plain form
744.5 678752136 677434387 675733490 669811783 662760544 658095856 655320816 654330292 654639816 656575546
753.2 656575546 657828064 658512726 660577545 661787720 660800781 657016602 651831207 647127533 642951431
761.9 642951431 640063400 637840767 636348381 637572403 640190506 643978043 649759598 654936981
769.6 654936981 657914581 659973221 661295395 661452560 660298691 658520508 658399506 660245209 663354340
778.3 663354340 668136444 673101501 678604965 685898895 692497253 696843491 698687592 698187180 696507339
787 696507339 694812241 693705826 691211929 689682541 691019516 694549637 699560699 703949814 709211655
795.6 709211655 714014053 716788483 718069992 717600327 716111603 713176270 711480179 710611038 709387436
804.3 709387436 709813385 712627640 717387848 722086182 726153488 729225540 730772552 730412140 728841095
813G28841095k738266l476105l269119k904587j48315N85327J110992L021012K955093
821.7G23977127L048630K373276J332016j076813k953873m139938n802994m632645
829.4G12124786k679443j817932j555863j89437J909561J715240P72629J363831j62354
838.1G11481018l251572l904266m541931l989182m226074m524612k174454q21609P43865
846.8F84791183J802826K017060K028885O64444l25165k308502m317475m721756m332275
855.4F75299225l295288k269135j932831j505279k02484J614609K416687L146209M286118
864.1F77557831L745422K843552K783813J681061J369019K371978K894211L416825
871.8F98663712M289856M268646M793472O065521M379120K294464R89151M68750p35702
$$ plain form
813 728841095 726102829 722626724 719357605 716453018 716304703 716890030 718001022 721022034 723977127
821.7 723977127 727025757 729399033 730731049 729654236 726700363 722560425 716757431 712124786
829.4 712124786 709445343 707627411 706071548 705882111 707791672 709506912 710279541 711643372 711481018
838.1 711481018 708229446 704325180 699783249 695794067 691567993 687043381 684868927 684047318 684791183
846.8 684791183 686594009 688611069 690639954 691304398 690979233 688670731 684353256 679631500 675299225
855.4 675299225 672003937 669734802 667801971 666296692 666094208 667708817 670125504 673271713 677557831
864.1 677557831 681303253 684146805 686930618 688611679 689980698 692352676 695246887 698663712
871.8 698663712 702953568 707222214 712015686 718081207 722460327 724754791 725743942 726212692 725476990
880.5G25476990l455887l937149l350830k382202k693024j420593J26190o82907k19269
889.2G07461319j88370k76336r99375k411117l607865m226150m632492m746094k779389
897.9F83594131j820449n11017r2926n13306J174240L66669r51920k400360m107818
906.5F74737244m032746m498596m207230m122161m215851l872452m178009k465439
914.3F43144760k069778k570839k137871l105164k519416l102608m174423l539276
922F19925385l261834k823982k181396n570M99993N1803Q96378J459198J750602J652146
931.6F17962723J137771P9842J15128M0245k29874K42996R0828J126480K582627L017005
941.3F26165771L018265L276520L216209K102929K82592j583938k264977l434868m798927
$$ plain form
880.5 725476990 722021103 718083954 714733124 712350922 709657898 708237305 708363495 707680588 707461319
889.2 707461319 707272949 706996613 705997238 703586121 699978256 695752106 691119614 686373520 683594131
897.9 683594131 681773682 681262665 681169739 680656433 681830673 682197342 681245422 678845062 674737244
906.5 674737244 670704498 666205902 661998672 657876511 653660660 649788208 645610199 643144760
914.3 643144760 641074982 638504143 636366272 633261108 630741692 627639084 623464661 619925385
922 619925385 616663551 613839569 611658173 611652603 612152596 612204399 613100777 614559975 616310577 617962723
931.6 617962723 619100494 619180336 619295464 619335709 619105835 619348831 619439659 620566139 623148766 626165771
941.3 626165771 629184036 632460556 635676765 637779694 638062286 636478348 634213371 630778503 625979576
949.9F25979576m711609m802551m472122m203301l642044l904533n025749n224762
957.7E89992905n805168o202355o280594p093239p765007p592125q250160p799682
965.4E33204575p515030p838974p148590o963768o261177p766419p359428o929322
973.1D75421867q506393r268684j0106087q000679p840386p212753o896820o660690
980.8D10929375n046807m722099l814506n038033l026276k020454j951103k093811
988.5C83216286k301827m80537k542267j530342q93898J1978P27539N14069J614761
997.2C78335762o294R54513M48838O69555L18070J01280Q56819j167564m21067n78117
1006.8C79511795N71175l81241p36351N43632l46985N72319l98788K22282o60553n6571
$$ plain form
949.9 625979576 621267967 616465416 611993294 607789993 604147949 600243416 595217667 589992905
957.7 589992905 584187737 577985382 571704788 564611549 556846542 549254417 541004257 533204575
965.4 533204575 525689545 517850571 510701981 503738213 497477036 489710617 482351189 475421867
973.1 475421867 466915474 457646790 447540703 439540024 431699638 424486885 417590065 410929375
980.8 410929375 405882568 401160469 397345963 392307930 389281654 387261200 385310097 383216286
988.5 383216286 380914459 380433922 377891655 376361313 375467415 375479393 376206932 376721001 378335762
997.2 378335762 378329468 379283981 379732819 380402374 380720444 380821724 381678543 380510979 380089912 379511795
1006.8 379511795 380082970 379701729 378965378 379509010 379162025 379734344 379335556 379557838 378897285 378840714
1016.5C78840714N22384l30429L50304p62863J247253O61774J750106J971665J632538
1025.2C85883446L367576J577301K344933J247940J786575Q97026O59294K505951O42014
1033.8D00912056J320953M79851J382980J371003J523819J376266m48341P03735l49350
1042.5D08272972N89104k14119n63126o48346p5416K169800J68991L89022K81296K710610
1052.2D13080788L091278K841758L493309J632844L972969L557968L472137K848206
1059.9D37991257L141670L354683K612915N701942N508767N285758L883362L714791
1067.6D71195145K906189L52325j819267n469704n860901p089958n911789n358391
1075.3D42943649l777771q62846k257767k63481O9428J621780L24821N11666K432556
$$ plain form
1016.5 378840714 379363098 379032669 379382973 378620110 379867363 380529137 382279243 384250908 385883446
1025.2 385883446 389251022 390828323 393173256 394421196 396207771 397104797 397764091 400270042 400912056
1033.8 400912056 402233009 402712860 404095840 405466843 406990662 408366928 407918587 408622322 408272972
1042.5 408272972 408862076 408647957 408084831 407436485 407361069 409530869 409699860 410088882 410370178 413080788
1052.2 413080788 416172066 419013824 422507133 424139977 428112946 431670914 435143051 437991257
1059.9 437991257 441132927 444487610 447100525 452802467 458311234 463596992 467480354 471195145
1067.6 471195145 474101334 474453659 472634392 467164688 461303787 454213829 448302040 442943649
1075.3 442943649 439165878 438303032 436045265 435781784 435851212 437472992 437797813 438309479 440742035
1084D40742035Q95119K180786O06537J970062J712456K228088L283463K036209M097061
1092.7D59751816L007164L358917K293243K764969L267021J201249Q02345j175232
1100.4D75271492q15926q71925P56187O58570k80647J289215J663093K396126P66907
1109.1D80833092J985321J809120J675682J946640l6888J298180J479682K352944J589928
1117.7D94933701J462402J978836J610985K176590P18345J203881K91099M40789R63592
1126.4E05780220M10881Q59718Q83446K860832J931229J340256J489677K083779K934570
1135.1E20574608J407966P14379j022988j595954k318154l676948m545288m471817
1142.8E05065804l203202l638305k801247l160591k032509k210884l314362j468887
$$ plain form
1084 440742035 441637154 443817940 444424477 446394539 448106995 450335083 453618546 455654755 459751816
1092.7 459751816 462758980 466117897 468411140 471176109 474443130 475644379 476446724 475271492
1100.4 475271492 474455566 473583641 474339828 474998398 474717751 476006966 477670059 480066185 480833092
1109.1 480833092 482818413 484627533 486303215 488249855 488212967 489511147 490990829 493343773 494933701
1117.7 494933701 496396103 498374939 499985924 502162514 502880859 504084740 504375839 504816628 505780220
1126.4 505780220 506191101 507050819 507934265 510795097 512726326 514066582 515556259 517640038 520574608
1135.1 520574608 521982574 522696953 521673965 520078011 517759857 514082909 509537621 505065804
1142.8 505065804 501862602 498224297 495423050 492262459 490229950 488019066 484704704 483235817
1150.5D83235817j608505j119881k258339j902046j708450j267701P973m07486R01184
1159.2D73872566K16065J811371J828880J827240L080177K325249L145027K718086
1166.9D90824661L808289L466148L509674L756905L652878N704803N761147O581993
1174.6E27066498P141304P202492O489257N502816M472732M567337N580483M396400
1182.4E72419319L966255L565903L762550L951149M120789M815407M540596M657936
1190.1F05799904M096336L569412K119446O94847J3428m27894J10588j08109J17455
1198.8F15985413N6305N65071J765327J484223J968383K105561J616592Q25920L57475
1207.4F26730270P06978L41263q4648K50702J002731J299896K184067L107186L337821
$$ plain form
1150.5 483235817 481627312 480507431 478249092 476347046 474638596 473370895 473378868 472971382 473872566
1159.2 473872566 474088631 475900002 477728882 479556122 482636299 484961548 488106575 490824661
1166.9 490824661 494632950 498099098 501608772 505365677 509018555 514723358 520484505 527066498
1174.6 527066498 534207802 541410294 547899551 553402367 557875099 562442436 568022919 572419319
1182.4 572419319 576385574 579951477 583714027 587665176 591785965 596601372 601141968 605799904
1190.1 605799904 609896240 613465652 615585098 616279945 616293373 615865479 615976067 615867958 615985413
1198.8 615985413 616041718 616606789 618372116 619856339 621824722 623930283 625546875 626372795 626730270
1207.4 626730270 627437248 627778511 627693863 627944565 628947296 630247192 632431259 635538445 638876266
1216.1F38876266L416520K869033K363892J447067L00446j74027q61435j417160j501617
1224.8F45318985j210861m52881L76968R14841P79419J014481Q94088K02484j03988
1233.5F47733536j478119k254639j915054k075577j949921j482849p65152J04218O58035
1242.2F36574478J338463J659050J577606J010513M34189K65351l38745r20258j120300
1250.8F40480347r88541j31874P50999J104432J707458K332535K058945J901550J347732
1259.5F50563583O62995J55487j047287j792526j355362p72248l5019O49186J294174
1268.2F48322983K030487K580337K426224J838532J349029P29141k32696j218414j679459
1276.9F56146164j155014j370773j517563o44532N92728J375351J584244J630936R87930
$$ plain form
1216.1 638876266 642292786 645161819 647525711 648972778 649273224 649099197 648237762 646820602 645318985
1224.8 645318985 644108124 643655243 644032211 644947052 645726471 646740952 647635040 647837524 647733536
1233.5 647733536 646255417 644000778 642085724 640010147 638060226 636577377 635812225 635916443 636574478
1242.2 636574478 637912941 639571991 641149597 642160110 642594299 642859650 642520905 641600647 640480347
1250.8 640480347 639491806 639359932 640110931 641215363 642922821 645255356 647314301 649215851 650563583
1259.5 650563583 651226578 651382065 650334778 648542252 647186890 646414642 646379623 647028809 648322983
1268.2 648322983 650353470 652933807 655360031 657198563 658547592 659276733 659044037 657825623 656146164
1276.9 656146164 654991150 653620377 652102814 651458282 652051010 653426361 655010605 656641541 657629471
1285.5F57629471N29709l28827j397629j576920k017059k025452j883239j443329m69437
1294.2F47017288K61078M53110J158066J436462O44760l7231j301041j630249j759033
1302.9F46243210k343674k468185k574272j574135j092377l0174J153106J125489J465530
1311.6F39904518O57921j47400m20151j410026k047997k294349j903801j785088j586380
1320.3F28967247o10428J89095P71026Q58078L74222k57873r18732j799660k951507
1328.9F24621468l519783l584557l717880k920990k152138j128654n37186K7580N88303
1337.6F07676163M22973j3466K56463Q86344j47514j106911j785469j714286o77567
1346.3F03796730l26195N5428N15404J219863J615830J550331J130142M65622o42624
$$ plain form
1285.5 657629471 658159180 657830353 656432724 654855804 652838745 650813293 648930054 647486725 647017288
1294.2 647017288 647278366 647731476 648889542 650326004 650970764 650933533 649632492 648002243 646243210
1302.9 646243210 643899536 641431351 638857079 637282944 636190567 636160393 637313499 638438988 639904518
1311.6 639904518 640562439 640415039 639994888 638584862 636536865 634242516 632338715 630553627 628967247
1320.3 628967247 628356819 628545914 629316940 630175018 630549240 630291367 629372635 627572975 624621468
1328.9 624621468 621101685 617517128 613799248 610878258 608726120 607597466 607060280 607087860 607676163
1337.6 607676163 608099136 608085670 608342133 609228477 609080963 607974052 606188583 604474297 603796730
1346.3 603796730 603470535 603525963 604041367 605261230 606877060 608427391 609557533 610023155 609380531
1355F09380531j136474j105461k098313k153053j202202j064262q58460n02586J007576
1363.7F00267296K088203K022362J007004K27890q38547r38034o34346j531296q60061
1372.3F00810471j529084j221847R38263J748619K005043J619530K054557J271172
1380.1F07696724J217766N95474m22287n59731p59429J92565j47514N00984K338982
1388.7F10653534K822838K801666K480240K469253J212731k90299j229744L44544m33006
1397.4F20831757j863404l576622j634178M96750l26462M06304L85894m88700R22317
1406.1F15153656J223068K92549j093750j497383k541809k612381j987572j187706
1413.8F05748672q06198r94606l43895j87454N77431o28700J805839K753411M80194
$$ plain form
1355 609380531 608244057 607138596 605040283 602887230 601685028 600620766 599762306 599259720 600267296
1363.7 600267296 602355499 604377861 605384865 605612755 604774208 603836174 603201828 601670532 600810471
1372.3 600810471 599281387 598059540 598997803 600746422 602751465 604370995 606425552 607696724
1380.1 607696724 608914490 609509964 609087677 608527946 607768517 607961082 607813568 608314552 610653534
1388.7 610653534 613476372 616278038 618758278 621227531 622440262 622149963 620920219 621264763 620831757
1397.4 620831757 618968353 615391731 613757553 614254303 613927841 614334145 614720039 614231339 615153656
1406.1 615153656 616376724 616669273 615575523 614078140 611536331 608923950 606936378 605748672
1413.8 605748672 604942474 603947868 603603973 603416519 603993950 603365250 605171089 607924500 608404694
1422.5F08404694m99230k496338n80063j81999r53598M18778n39093K75039J620407
1431.2F05468597K836991K647018J394081J447258k14004k719307J42555J703491K6207
1439.8F12732887k17628N20477M49867J460228R72023J919136J435967N11436l61519
1448.5F19422874R9640L25051j702423j721039k111016r20600j373826j777076j756668
1457.2F08484917l212624M486008K621536K928162J012954P58095J613312l097801
1464.9F15594559n3711P27997K038154J766281K667122L508759J159553K984352M313202
1473.6F34706268P786408L826446K361298K906341K411652K057114Q73337K106857
1481.3F59035721J707306L039016L004227L312607L966980J047287K410965K175217
$$ plain form
1422.5 608404694 607905464 605409126 604829063 604647064 603693466 604112244 603573151 603848190 605468597
1431.2 605468597 608305588 610952606 612346687 613793945 613579941 610860634 611003189 612706680 612732887
1439.8 612732887 612515259 613035736 613485603 614945831 615917854 617836990 619272957 619784393 619422874
1448.5 619422874 619522514 619847565 618145142 616424103 614313087 613392487 612018661 610241585 608484917
1457.2 608484917 605272293 609758301 612379837 615307999 616320953 617079048 618692360 615594559
1464.9 615594559 615540848 616268845 618306999 620073280 622740402 626249161 627408714 630393066 634706268
1473.6 634706268 642492676 646319122 648680420 651586761 653998413 656055527 656928864 659035721
1481.3 659035721 660743027 663782043 666786270 670098877 674065857 675113144 677524109 679699326
1489F79699326J503067J94778K463303K522201K87705Q65249l42407m59061K325974
1497.7F89060135J964645K923813L296814K679596J209717K408600J639251Q04749
1505.4G05987320q010864p318192N827027L159027K635879J409683J943360K060318
1513.1G07693558K789077J777115J5946j271515k878723M699783J988602m496918n215149
1521.8G05101776O44608M961853J483612n96314J678162L528671J743851J708069K120666
1530.5G22374954r76639Q0109k823028m846650J954193J050568J523666P54471n246811
1539.2G13844833m736709P955246J389389j110687L452453k66647k285538P06787N55268
1547.9G19504395K41241k383041k389069J709366J270981j69449j670532K563476M624100
$$ plain form
1489 679699326 681202393 681397171 683860474 686382675 686670380 687535629 687193222 686734161 689060135
1497.7 689060135 691024780 693948593 697245407 699925003 701134720 703543320 705182571 705987320
1505.4 705987320 697976456 690658264 696485291 699644318 702280197 703689880 705633240 707693558
1513.1 707693558 710482635 712259750 712275696 711004181 708125458 712825241 714813843 710316925 705101776
1521.8 705101776 705746384 710708237 712191849 711595535 713273697 716802368 718546219 720254288 722374954
1530.5 722374954 721398315 721478424 718655396 713808746 715762939 716813507 718337173 719091644 713844833
1539.2 713844833 709108124 717063370 718452759 717342072 720794525 720527878 718242340 718949127 719504395
1547.9 719504395 719745636 717362595 714973526 716682892 717953873 717784424 716113892 718677368 723301468
1556.5G23301468K503204j0761871j0298615M10157M976349J820373J156769O19354
1564.2G13727188j237945R68780J380463J164932p01218n154724K842102K082520o64826
1572.9G14407272j469650p29599k486343p684937L467560K621384P69653Q34961P80716
1581.6G10511017Q43582L76282l49274j310196j527405j324997j625824j350860j614533
1590.3G02627792q56247n27114J98593K24838k29034L84063n59311o66504j079101
1599F99517975j464157j908188k237930j789856k168045j018067q74939o68945n41535
1607.6F86846313j6326o39649j061325j63193k010040j832123k211609j100464j611633
1616.3F76199951q249130J167679K14004k17819m37317N62973j425400l871612J819534
$$ plain form
1556.5 723301468 725804672 715042801 704744186 705154343 710130692 711951065 713107834 713727188
1564.2 713727188 712489243 713458023 714838486 716003418 715302200 710147476 712989578 715072098 714407272
1572.9 714407272 712937622 712208023 709721680 702036743 705504303 708125687 708895340 709730301 710511017
1581.6 710511017 711354599 711730881 711381607 710071411 708544006 707219009 705593185 704242325 702627792
1590.3 702627792 701771545 701244431 701443024 701667862 701438828 701822891 701263580 700597076 699517975
1599 699517975 698053818 696145630 693907700 692117844 689949799 688931732 688056793 687387848 686846313
1607.6 686846313 686829987 686190338 685129013 684965820 682955780 681123657 678912048 677811584 676199951
1616.3 676199951 667950821 669118500 669332504 669114685 668677368 669240341 667814941 663943329 665762863
1625F65762863L35770n17273l638077k747574l73382j254654o14395p83692J022110
1633.7F57191696Q64105m201583p94144J180878J218872J415329P76519o08062m38385
1642.4F56605225j253586O03027N98908k743454o09665Q43734M442749L530045L568192
1651F65585175L105850l206406q470688N214081M095001J763306J540527J438523J359710
1659.7F72425079J471024J961670J374969J186600L569870K812347K200089J783829
1667.4F88785477J119384k376251J7243K415390J108246K670669K963181K99224O66733
1676.1F97669296M850159L993759K167206Q62198j59989K881394K887039k061996o319352
1684.8G06769714N198593N224152K847061J536484K120743K106399K746659K253036
$$ plain form
1625 665762863 666098633 665581360 661943283 659195709 658822327 657567673 656953278 656169586 657191696
1633.7 657191696 658055801 653854218 653060074 654240952 655459824 656875153 657651672 657043610 656605225
1642.4 656605225 655351639 655954666 656553574 653810120 653200455 654044189 658486938 662016983 665585175
1651 665585175 668691025 665484619 657013931 662228012 666323013 668086319 669626846 671065369 672425079
1659.7 672425079 673896103 675857773 677232742 678419342 681989212 684801559 687001648 688785477
1667.4 688785477 689904861 687528610 687545853 689961243 691069489 693740158 696703339 697002563 697669296
1676.1 697669296 702519455 706513214 708680420 709542618 709382629 712264023 715151062 713089066 706769714
1684.8 706769714 711968307 717192459 720039520 721576004 723696747 725803146 728549805 730802841
1692.5G30802841J126251K349396P33338p922059J501313L262863L638611l620911
1700.2G31871643j952591P106094L849869J404953L24936J254654n94559J138916J960450
1708.9G46364365J16272p55616Q6060M15649l26843j726837J72806L149261M95224
1717.6G47990341m249191N118637L568420R27964m41742j046906m38003N12466M5471
1726.3G51987457L37601J492767J315918n90439O60325L538055L146286l010101o662598
1734.9G52215271L700867L448639N00335O43769j637879j130981L253708Q07342j047821
1743.6G60753250J650238L208237J462707j15890J81427l26004K173843j656875j129227
1752.3G66201706L514099J639557J312790J227722p56912J649933K629242K159271
$$ plain form
1692.5 730802841 731929092 734278488 735011826 727089767 728591080 731853943 735492554 731871643
1700.2 731871643 729919052 737025146 740875015 742279968 742604904 743859558 743264999 744403915 746364365
1708.9 746364365 746480637 745725021 745811081 746226730 745899887 744173050 744345856 747495117 747990341
1717.6 747990341 743741150 748859787 752428207 753356171 752914429 751867523 751429520 751941986 751987457
1726.3 751987457 752325058 753817825 755133743 754543304 755203629 758741684 761887970 758877869 752215271
1734.9 752215271 755916138 759364777 759865112 760508881 758871002 757740021 760993729 761801071 760753250
1743.6 760753250 762403488 765611725 767074432 766958542 767139969 766813965 768987808 767330933 766201706
1752.3 766201706 769715805 771355362 772668152 773895874 773138962 774788895 777418137 779577408
1760G79577408K111358k173995r87244J857223M28391K59476L98101J17951j774445
1768.7G79814224J727371K557221j418762k285309J157532M357681J709900r51538
1776.4G86668320J570511j56784o01807q83637j359710P79724J275101J043396j32523
1785.1G88202591Q12302J798095J031037N29022P53021q09479q76159j987381r09043
1793.8G88544006K205582k16675n32608J683808J455764j69525m39911K456742M04586
1802.4G95391769k15377O45675m83169l24784o81381n30853J79291q8425q28476J307907
1812.1G94372177J956253J222534J552430P42645Q6670j264954m57611J56403j039200
1820.8G97327347l19061m04130O90690K22702j631623J588593K541961J707917q15125
$$ plain form
1760 779577408 781688766 779514771 778527527 780384750 780813141 781072617 781470718 781588669 779814224
1768.7 779814224 781541595 784098816 782680054 780394745 781552277 785909958 787619858 786668320
1776.4 786668320 788238831 788082047 787480240 786596603 785236893 786016617 787291718 788335114 788202591
1785.1 788202591 789014893 790812988 791844025 792373047 793126068 792316589 791440430 789453049 788544006
1793.8 788544006 790749588 790532913 790000305 791684113 793139877 792970352 792530441 794987183 795391769
1802.4 795391769 795176392 795822067 795338898 795014114 794332733 793801880 793981171 793892746 793064270 794372177
1812.1 794372177 796328430 797550964 799103394 799846039 799932709 798667755 798210144 798366547 797327347
1820.8 797327347 797008286 796604156 797294846 797517548 795885925 797474518 800016479 801724396 800909271
1829.4H00909271l368454R49326J780701l86735o08901k66953m63104o93436p9651
1838.1G97772064J564713J088867Q30841N24368J482849M65775m879456J584168J189499
1846.8H01623688j239014p30514n7602O3705j40991Q60214P21054Q84857O82755N69763
1856.4H03237915Q93402k16064m74930j046600q41141n78308l04795m3869r1018M07180
1866.1H00941772J08185J068497j12839p03659J617432J436615K12555r55582r37653
1874.8H02675323j143951o55594j42822L00217R68399Q82797J146622Q25119J034698
1883.4H05890808M21295m11911n00335j099549m58374j447067k121658M79278J176148
1892.1H01928635P13653R06449P15560O94352J726837M33121j66703j85699p99332
$$ plain form
1829.4 800909271 797540817 798490143 800270844 799884109 799275208 799008255 798545151 797851715 797772064
1838.1 797772064 799336777 800425644 801256485 801780853 803263702 803729477 798850021 800434189 801623688
1846.8 801623688 800384674 799654160 799596558 799660263 799519272 800379486 801100540 801985397 802668152 803237915
1856.4 803237915 804131317 803915253 803440323 802393723 801552582 800974274 800669479 800625610 800534592 800941772
1866.1 800941772 801049957 802118454 802005615 801301956 802919388 804356003 804568558 803612976 802675323
1874.8 802675323 801531372 800875778 800732956 801033173 802001572 802884369 804030991 804856110 805890808
1883.4 805890808 806312103 805900192 805399857 804300308 803841934 802394867 800273209 800752487 801928635
1892.1 801928635 802642288 803548737 804264297 804958649 806685486 807118607 806951904 806766205 805966873
1900.8H05966873j181183j261444l34091p63397j23291O88019P46612Q18329P70798
1909.5H05327225J158600P38983Q60672p20368j467361j458130r72443K32468k606277
1918.2H01093369l11127K071457J292038R00802J36032J160736J128006K49253m27628
1926.8H07292938p26547j182632j369858q76007o80313M8828M99878J349792J437378
1935.5H05793457J156464J156006L11965r8266r23462q71353k095185k459182N03998
1944.2H02474442J56860k7771P28378J222229J272202J248245J002197L38898j35117
1952.9H08280563n57022p38754j190872j088715j086960n52597M84925M52499R86404
1961.6H04989471J303711J311875P52868M76532L33329j150284j428223j012878q71659
$$ plain form
1900.8 805966873 804785690 803524246 803190155 802426758 802303467 802991486 803738098 804556427 805327225
1909.5 805327225 806485825 807224808 808085480 807365112 805897751 804439621 803467178 803699646 801093369
1918.2 801093369 800782242 802853699 804145737 805046539 805182571 806343307 807471313 807720566 807292938
1926.8 807292938 806566391 805383759 804013901 803137894 802457581 802506409 803006287 804356079 805793457
1935.5 805793457 806949921 808105927 808417892 808319626 807396164 806524811 804429626 801970444 802474442
1944.2 802474442 802631302 802603531 803331909 804554138 805826340 807074585 808076782 808415680 808280563
1952.9 808280563 807723541 806984787 805793915 804705200 803618240 803065643 803550568 804003067 804989471
1961.6 804989471 806293182 807605057 808357925 808834457 809167786 808017502 806589279 805576401 804704742
1970.2H04704742p88345l98025k3804K65274J153183J237640J424866J394882Q36563
1978.9H09806976p0648j062317j328277j308136r91211r67255m96063J86844O51779
1987.6H04421692R92813J011963J704788J258240r8801k15072m89655j324158j406326
1996.3H05855484j004333r16825n45120K01187O97250Q21457J232224J350174Q64563
2005H08556061M50287k86255p44095j186676j352158j297531j054077j06659L43323
2013.6H03322220N88837P54699N58319N47638R76486R81217j4420r83352j192322j146622
2023.3H04392700j609344r04312l42331k99607M77143P78503J204910J114579P24716
2032H05536957M31289l23791q49838j064301j053696j291275p95364m91104n51529
$$ plain form
1970.2 804704742 803916397 803518372 803494568 803759842 804913025 806150665 807575531 808970413 809806976
1978.9 809806976 809736328 808674011 807345734 806037598 805046387 804079132 803583069 803769913 804421692
1987.6 804421692 805414505 806426468 808131256 809389496 809290695 809075623 808585968 807261810 805855484
1996.3 805855484 804851151 803934326 803389206 803590393 804287643 805109100 806341324 807691498 808556061
2005 808556061 809006348 808720093 807975998 806789322 805437164 804139633 803085556 802978897 803322220
2013.6 803322220 803911057 804665756 805224075 805771713 806748199 807729416 807714996 806731644 805539322 804392700
2023.3 804392700 802783356 801879044 801536713 801237106 801714249 802492752 803697662 804812241 805536957
2032 805536957 805968246 805644455 804794617 803730316 802676620 801385345 800589981 800098877 799547348
2040.6G99547348J08871Q54416J408310J237641Q26492K49176o9351n33524j307983
2049.3H02321396j242218j203766o00662j19171J12609L56675O76803J124726J007156
2058H02433548J151504O80619p9117q89359j144790p28455j279831j121597j85089
2066.7G98837433O50635N16357N69000J370087R36813O11267L40958j09558m64935
2075.4H03258057p84226j234741j254807n98526l72314J66702M88663P85522J149903
2084H01604233J220703J019211K16064l51486p56073m65851p47604j106568r02404
2092.7G99730225o49872L74756N39245R51386J241836Q04901R41544Q76541L02353
2101.4H05112915p31125q63876r51996j163940q56858l85513o6071J86386J051331
$$ plain form
2040.6 799547348 799656219 800510635 801918945 803156586 803983078 804232254 804162903 803629379 802321396
2049.3 802321396 801079178 799875412 799274750 799155579 799268188 799624863 800301666 801426392 802433548
2058 802433548 803585052 804265671 804186554 803297195 802152405 801423950 800144119 799022522 798837433
2066.7 798837433 799488068 800004425 800573425 801943512 802880325 803491592 803832550 803722992 803258057
2075.4 803258057 802473831 801239090 799984283 799385757 799013443 799180145 799668808 800454330 801604233
2084 801604233 802824936 803844147 804060211 803708725 802952652 802486801 801739197 800632629 799730225
2092.7 799730225 799080353 799455109 799994354 800945740 802187576 802992477 803934021 804810562 805112915
2101.4 805112915 804381790 803517914 802565918 801401978 800545120 800159607 800093536 800279922 801331253
2110.1H01331253J009369Q05664N51605M66309M33349n16433n45731q16650q19168
2118.7H01899567n94864m41132m58J99662R40323P09381N51834N26123J23977L83530
2128.4H04297943K42691n31235j140899p26853p11975q58078n41229L21197J038209
2137.1H01389771J029281J239700L71933K88392N37872l05252r67407j132813n56335
2145.8H01895142p94983l93296J33439q240L01361Q61358J293717P80258R29566K86331
2155.4H05284653p10678o27900o17065p42035j133728l91769j20240L10975R89913
2164.1H02242126Q48008J036758P47528P70188P1640l95890l17764m72260l97872j027070
2173.7H03105392n93948n5008M60129Q35724Q01544J151123Q02918O02340j5106q7967
$$ plain form
2110.1 801331253 802340622 803146286 803697891 804164200 804597549 804081116 803535385 802718735 801899567
2118.7 801899567 801304703 800863571 800863113 801062775 802003098 802712479 803264313 803790436 803914413 804297943
2128.4 804297943 804540634 804009399 802868500 802141647 801429672 800571594 800030365 800351562 801389771
2137.1 801389771 802419052 803658752 804030685 804319077 804856949 804551697 803584290 802451477 801895142
2145.8 801895142 801100159 800706863 800840302 800832062 801133423 801994781 803288498 804068756 804998322 805284653
2155.4 805284653 804573975 803946075 803329010 802586975 801453247 801061478 800941238 801252213 802242126
2164.1 802242126 803090134 804126892 804874420 805644608 805716248 805320358 805002594 804530334 804132462 803105392
2173.7 803105392 802511444 802456436 802916565 803752289 804553833 805704956 806507874 807110214 807095108 807007141
2183.4H07007141P4463m77676q90808j098557j96228N8289K17666P53479N93567O89850
2193H06731186Q89587R89685N59159j29013n46418p44247r50165o89163l31802j53733
2202.6H05625076L02277M61731R51385R24225P00608R92279N67398q5373n75104p26852
2212.3H09137650p36313m96750o01273n38635K17209Q51059J139831O05393P49664
2221H10327835R02329N48782J50757p56302q05435p06406p64770o73981k64511L7384
2230.6H07995682L58276Q88672P85217R46656Q77990O08750q9875o87713m50516n41916
2240.3H10691223p29599j166458o14548K15149O62537Q44879Q05664J151810O36062
2248.9H12496719K20337j28555m5395m40674j306610q39386p85675o7749M19617L77273
$$ plain form
2183.4 807007141 807081604 806603928 805713120 804614563 804418335 804476624 804694290 805447769 806041336 806731186
2193 806731186 807620773 808610458 809169617 809040604 808494186 807749939 806799774 806110611 805778809 805625076
2202.6 805625076 805927353 806389084 807340469 808264694 808965302 809957581 810524979 810439606 809864502 809137650
2212.3 809137650 808401337 807904587 807303314 806764679 806981888 807832947 808972778 809578171 810327835
2221 810327835 811230164 811778946 811929703 811173401 810367966 809661560 808896790 808222809 807958298 807995682
2230.6 807995682 808353958 809242630 810027847 810974503 811852493 812461243 812371368 811683655 811233139 810691223
2240.3 810691223 809961624 808795166 808180618 808395767 809058304 809903183 810708847 811860657 812496719
2248.9 812496719 812717056 812588501 812543106 812102432 810795822 809956436 809170761 809103012 809522629 809899902
2258.6H09899902L07999N79605J519241P44706L48587L47061n38254j401520r74579
2267.3H10832748l02276p11670l52249k15531N08042P50656O23932J201629Q09479
2275.9H13144760P35550K60315j91650o31180p19834q82797j326599l94516o6528N75485
2285.6H10503006O36291P53022J183624P17697O49643j21460l36532j258545j434708
2294.3H11292038n75714p15790q4839k58484K79084O48956P71408O70776L01285Q60138
2303.9H13188858j32980n19638j141663j311874n38788o74362k45972q88977j97296
2312.6H07537308N17959Q99201J263504J78757N493n24216q38165q28400q95691o92520
2322.2H06623230p78275n51681j70746k7771k22168Q33969M19693N90134J160431m30908
$$ plain form
2258.6 809899902 810207901 810787506 812306747 813051453 813400040 813747101 813208847 811807327 810832748
2267.3 810832748 810530472 809818802 809466553 809251022 809759064 810509720 811133652 812335281 813144760
2275.9 813144760 813880310 814140625 813948975 813317795 812597961 811715164 810388565 809994049 809927521 810503006
2285.6 810503006 811139297 811892319 813075943 813793640 814443283 814321823 813985291 812726746 811292038
2294.3 811292038 810716324 810000534 809915695 809657211 809936295 810585251 811356659 812027435 812328720 813188858
2303.9 813188858 813055878 812536240 811394577 810082703 809543915 808869553 808623581 807734604 807537308
2312.6 807537308 808055267 808954468 810217972 810396729 810402222 809878006 809039841 808211441 807315750 806623230
2322.2 806623230 805844955 805293274 805122528 805094757 804872589 805706558 806126251 806716385 807876816 807445908
2331.9H07445908r54972j059723l48892q10013q09631J25122m25720k26822k976M37623
2341.5H03369904Q84552P67593m02756O72302P83082r73206L35159O67267o66656k194367
2351.2H03242874j610870L19137K68174l30964j30615L70941m60968J53275j81275
2359.8H01639709j618499n30243J47400q7815n80597J35575P50427J744003J240540
2368.5H02840500R1019O63986J135330O52237j000824J27182P03049l3036l8757m45633
2378.2H04695053M79736Q22297R10415J084290Q54110O99006K80151j06735n90058
2386.8H09128265l54995o71692p37305p8430j41754m120N188M34875N84717M88815
2396.5H08653564M76609J31836J50222m76608q66089n02701k90603m60968m82559j99738
$$ plain form
2331.9 807445908 806490936 805431213 805082321 804272308 803462677 803587799 803162079 802935257 802932281 803369904
2341.5 803369904 804254456 805022049 804619293 805291595 806074677 805101471 805436630 806103897 805437241 803242874
2351.2 803242874 801632004 801951141 802219315 801888351 801757736 802128677 801667709 801820984 801639709
2359.8 801639709 800021210 799490967 799638367 799550552 798969955 799105530 799855957 801599960 802840500
2368.5 802840500 802931519 803595505 804730835 805383072 804382248 804509430 805212479 805179443 805140686 804695053
2378.2 804695053 805174789 805997086 806907501 807991791 808845901 809544907 809825058 809718323 809128265
2386.8 809128265 808773270 808101578 807364273 807285843 807144089 807139969 807145157 807580032 808164749 808653564
2396.5 808653564 809130173 809262009 809412231 808935623 808069534 807566833 807276230 806815262 806332703 806132965
2406.1H06132965P9880L11279L52020K64512l20359o6986j3656l41950k45666n32227
2415.8H05619812k16370o67419p67365l5934N45502L59039l37219M38766K8305k59475
2425.4H04707642j24512l77808M9973l67508m33426n64728j85547o3553j10778L28979
2435.1H02858734k96936l4027j38855j49918q5525m38919J8692k90680l61481n13458
2444.7H00567627q02689k54211L91540J27488j59226m272l49198P0649J10321R384
2454.3G99707413j24359m58451j67618n04455m84390l09296J13373M9972m97894k73437
2464G97050858J26190M77676k71606k55585k22702m88968l2959k96249j49308o24084
2473.6G95313263p52029j41068Q5144M12216j86996k72141L58429M09317k4414l58200
$$ plain form
2406.1 806132965 806212845 806524124 806876144 807140656 806820297 806753311 806739655 806397705 806152039 805619812
2415.8 805619812 805403442 804736023 803968658 803932724 804478226 804837265 804500046 804938812 804967117 804707642
2425.4 804707642 804583130 804205322 804255295 803887787 803454361 802889633 802704086 802640533 802529755 802858734
2435.1 802858734 802561798 802527771 802388916 802238998 802153473 801714554 801733246 801442566 801081085 800567627
2444.7 800567627 799764938 799510727 799902267 800029755 799870529 799866257 799517059 799587708 799698029 799707413
2454.3 799707413 799583054 799124603 798956985 798452530 797968140 797658844 797772217 797822189 797324295 797050858
2464 797050858 797177048 797654724 797383118 797127533 796904831 796415863 796382904 796086655 795937347 795313263
2473.6 795313263 794561234 794420166 794505310 794917526 794730530 794458389 794816818 795226135 795201721 794843521
2483.3G94843521l71399j59759k96631o61774k58713k73361m47311L8452O14090K85187
2492.9G93312302k75879j13220j37330Q3390j67389m06952l10974m19007k68402k41012
2502.6G91055527k22473m17939K42234M30603j1902K00882O1493k5864m88663k49786
2512.2G90574112p5302j11313N9433n42297k82212k44751k15072j32676L4562O62002
2521.9G89726486L04947k59552m64859j42212n78537n51910j27869n31540k26364l67279
2531.5G86781311j77994J50528L73535N78614n341n0354k04849o51550q90961l38135
2541.1G85564804k34833q50219n24598R1019M32816n8899q0719K60238K49634K05002
2550.8G85054245k82059k95181m39224r04389j103363o82525j20697m9286q774J78604
$$ plain form
2483.3 794843521 794472122 794312363 794015732 793353958 793095245 792821884 792374573 792413025 793027115 793312302
2492.9 793312302 793036423 792923203 792785873 792869263 792701874 792294922 791983948 791564941 791296539 791055527
2502.6 791055527 790833054 790415115 790657349 791087952 791076050 791276932 791338425 791312561 790823898 790574112
2512.2 790574112 790498810 790387497 790446930 789904633 789622421 789377670 789162598 789029922 789064484 789726486
2521.9 789726486 790031433 789771881 789307022 789164810 788586273 788034363 787906494 787374954 787148590 786781311
2531.5 786781311 786603317 786753845 787127380 787705994 787700653 787650299 787445450 786793900 785902939 785564804
2541.1 785564804 785329971 784479752 783955154 784046173 784478989 784420090 784339371 784599609 784849243 785054245
2550.8 785054245 784772186 784477005 784037781 783133392 782030029 781347504 781226807 781177521 781168747 781347351
2560.4G81347351L26614Q6136L54004K60468j82343p29370j150589l17306n23224p75147
2570.1G78696594j86310L5096j56479j94855M56085N00031O43539J10779n27649m21295
2579.7G78955536q08487n66406o44074p99789l56140p7134L3722K90070O39801M71878
2589.4G77138977K72751j18256l84826m25187l34320o37893q79898k65961m73480k80915
2599G73610992J96534K44369N28488J56174J5259L18985K8381o83212o72684n34439
2608.6G73208847o51321q05893m80423K54745j49917K3193O19812O09360Q0948k86103
2618.3G72423248l00216j194992p39365o11801j059189n44891n28717j36338k9754
2627G67277985J78909L81393K10953r5062j92948k3498q61816j097413j048965p95822
$$ plain form
2560.4 781347351 781673965 781760101 782114105 782374573 782192230 781462860 780312271 779994965 779471741 778696594
2570.1 778696594 778510284 778545380 778388901 778194046 778650131 779150162 779793701 779904480 779376831 778955536
2579.7 778955536 778147049 777580643 776936569 776136780 775780640 775703506 775737228 776027298 776667099 777138977
2589.4 777138977 777411728 777293472 776908646 776483459 776149139 775511246 774631348 774365387 773891907 773610992
2599 773610992 773807526 774051895 774580383 774736557 774751816 775070801 775099182 774415970 773743286 773208847
2608.6 773208847 772557526 771751633 771271210 771525955 771376038 771399231 772019043 772628403 772709351 772423248
2618.3 772423248 772123032 770928040 770188675 769576874 768517685 767972794 767444077 767307739 767277985
2627 767277985 767456894 767838287 768049240 767954178 767761230 767737732 766875916 765778503 764729538 763933716
2636.6G63933716n79529o07300j40228j26648K56958K58560K98691N5389l89022l76816
2646.3G62583771r81751o07757o73981j195908j136474m43878K37045j03073J75323
2654.9G57853317o1493J92719N60150l10593o52771q37555q81424j089172q34122o68792
2664.6G53270264o39496K9220J69983K47269J17798P8506L13187L35083j80435j025543
2674.2G52715836j228562q20770l18070m02450n24063n02472K6169M70733J60065J84860
2683.9G49761276J68839j4115o85196q91113n59692o22559p72552j105805o07071K747
2693.5G44674759L62167K64969k9297M75769J93711p25174q42057k79846p44095j128387
2703.1G42222519n78842o51474p23496k87704O46667O37589Q2550p5531j81122o5308
$$ plain form
2636.6 763933716 763354187 762746887 762606659 762480011 762736969 762995529 763294220 763349609 762960587 762583771
2646.3 762583771 761602020 760994263 760320282 759124374 757987900 757544022 757781067 757677994 757853317
2654.9 757853317 757791824 757984543 758544693 758234100 757581329 756743774 755862350 754773178 753939056 753270264
2664.6 753270264 752630768 752659988 752829971 753077240 753195038 753273544 753586731 753921814 753741379 752715836
2674.2 752715836 751487274 750666504 750348434 749945984 749421921 748919449 748945618 749416351 749576416 749761276
2683.9 749761276 749930115 749916000 749230804 748339691 747779999 747157440 746384888 745279083 744672012 744674759
2693.5 744674759 745036926 745301895 745272598 745748367 745942078 745216904 744374847 744095001 743350906 742222519
2703.1 742222519 741643677 740992203 740268707 739981003 740627670 741265259 741347809 741272278 741091156 741025848
2712.8G41025848n91430r37043j082077j064453p82470n96772l49044M1427N76935
2721.5G36240921J35880j13602J44958L71323n2948o93131m51126j175079j195450
2730.2G33211746o43539m70658J76926L79562L46680p1487l7766k33307j78146K58026
2739.8G32738037n77621j067429p86209j88980k56424m36249j57699O2408K31400M14581
2749.4G29975815O09436n31845o10657k66571q29849l11966j87454n52216j044388
2758.1G26250305n93643O6223R7351M75922K08740M29077O01349o0730o01654p68204
2767.8G26104736p13119n86624l14637l63922j01318j61972m45175j88828K00348M29840
2777.4G23859329o4544n21698o31791m34723m01382n70373n95551n90591m75464R6817
$$ plain form
2712.8 741025848 740434418 739497375 738415298 737350845 736568375 735971603 735622559 735663986 736240921
2721.5 736240921 736376801 736263199 736408157 736779480 736726532 736033401 735582275 734407196 733211746
2730.2 733211746 732568207 732097549 732274475 732654037 733000717 732929230 732891464 732658157 732480011 732738037
2739.8 732738037 732160416 731092987 730306778 730117798 729861374 729425125 729267426 729329834 729561234 729975815
2749.4 729975815 730585251 730053406 729442749 729176178 728346329 728034363 727846909 727294693 726250305
2758.1 726250305 725656662 725722885 725820236 726296158 726504898 726933975 727535324 727474594 726872940 726104736
2767.8 726104736 725391617 724804993 724490356 724126434 724025116 723863144 723417969 723229141 723429489 723859329
2777.4 723859329 723794785 723273087 722641296 722206573 721805191 721234818 720639267 720048676 719573212 719670029
2787G19670029N24063m51126k07291o2408q45490l34701n09644m86298p98263r62067
2796.7G15536804l10364l72848m51202j044465p05566j14136j9836j49002p07321n02854
2806.3G11159210n54199m56619n37262r63593j103058r06067n63125p95059n62287
2815G04717941n02472l12042k01340n24063l89862q22067j117249j143951r33685p16248
2824.7F98054962q93402p59201o01044p30514p76825l53241n77240q44040r36127j238632
2834.3F90344696p87811q47779j389465j362610j169739j434707j389542p95822m53262
2843F80713959p88574j610413j259995j048507j392060j409530j698075j734161j740112
2851.7F68032532j259995r13543j041337r63745m26864j95465q36945k72674m77906
$$ plain form
2787 719670029 720194092 719742966 719535675 719473267 718627777 718293076 717783432 717297134 716498871 715536804
2796.7 715536804 715226440 714853592 714402390 713357925 712652359 712538223 712518387 712369385 711662064 711159210
2806.3 711159210 710605011 710148392 709611130 708647537 707544479 706638412 706075287 705280228 704717941
2815 704717941 704215469 703903427 703702087 703178024 702788162 701966095 700848846 699704895 698771210 698054962
2824.7 698054962 697161560 696402359 695801315 695070801 694293976 693940735 693363495 692519455 691583328 690344696
2834.3 690344696 689556885 688709106 687319641 685957031 684787292 683352585 681963043 681167221 680713959
2843 680713959 679925385 678314972 677054977 676006470 674614410 673204880 671506805 669772644 668032532
2851.7 668032532 666772537 665858994 664817657 663853912 663427048 663231583 662394638 662121964 661644058
2860.3F61644058j722641j363296r38645j287536j385193j159439j369477j296386
2868.1F51121445j185074j310730j291657j580276j643677j568832j656800k146186
2875.8F38738213k093773j669236j784019j725655j741943j582146j078872o76575
2883.5F26385994j095429j123313o14472r48410o73370n66750n55038m65126p13158
2892.2F19630928l68614k40212N6153j51291o02074l66363j05668j23786n44091m00657
2901.8F16784325k24152m96254o52695l27911m97322r04312n45693p61795q15201p71522
2911.4F10787468p70531q35151j313210j446495j845207j767273j597214j505661j388054
2920.1E98318672j570015j419906j184159n03158m49181n85709m00466r6741m4060
$$ plain form
2860.3 661644058 659921417 658558121 657619476 656331940 654946747 653787308 652417831 651121445
2868.1 651121445 649936371 648625641 647333984 645753708 644110031 642541199 640884399 638738213
2875.8 638738213 636644440 634975204 633191185 631465530 629723587 628141441 627062569 626385994
2883.5 626385994 625290565 624167252 623552780 622604370 621931000 621364250 620809212 620344086 619630928
2892.2 619630928 619262314 619022102 619078255 618926964 618324890 617958527 617852859 617729073 617184982 616784325
2901.8 616784325 616560173 616063919 615411224 615083313 614585991 613681679 613135986 612374191 611558990 610787468
2911.4 610787468 610016937 609181786 607868576 606422081 604576874 602809601 601212387 599706726 598318672
2920.1 598318672 596748657 595328751 594144592 593641434 593192253 592606544 592206078 592109337 592065277
2928.8E92065277q69102m96292K24380O84090P27195K15683N86739J287994J758232
2937.5E96184196J665955J852837J957359J791038J914406K012062K023430J672440
2945.2F11073723K067299K032661J476097J658783J780815J905365J960488K004204
2952.9F25959435J914672J878052J631432J638412J802864J468048J521492J724892
2960.6F39539299K007179J636124J575470J879349J632919J766815J277847R73359
2968.3F52288361J417999J668777J433182J345368J492996J163025P54852O33545J484299
2977F63682404J550140Q72955Q87985J055985R76257L88031P01371P42721Q73108J178055
2986.7F72909012M43268P90329J087875Q28934P69729O91986L27683J02081M81796
$$ plain form
2928.8 592065277 591196175 590699883 590924263 591608353 592335548 592551231 593137970 594425964 596184196
2937.5 596184196 597850151 599702988 601660347 603451385 605365791 607377853 609401283 611073723
2945.2 611073723 613141022 615173683 616649780 618308563 620089378 621994743 623955231 625959435
2952.9 625959435 627874107 629752159 631383591 633022003 634824867 636292915 637814407 639539299
2960.6 639539299 641546478 643182602 644758072 646637421 648270340 650037155 651315002 652288361
2968.3 652288361 653706360 655375137 656808319 658153687 659646683 660809708 661564560 662198105 663682404
2977 663682404 665232544 666105499 666993484 668049469 669025726 669413757 670115128 670857849 671730957 672909012
2986.7 672909012 673352280 674142609 675230484 676059418 676829147 677521133 677848816 677950897 678432693
2995.3F78432693L11509K8915k0599J15280n5847J74637N43594J0681n0430J95465
3005F79685898O81534J24817p48368n47104k60925J33286l73993p38526n61065l29438
3014.6F77066116l19290p15561m11529j34125j84631o89545p39136m68902p93305r24301
3024.3F71685791r86328r95636q91876k40784o4392n19714p75605q18863n48629q41370
3033.9F65002594r55353j031189q38775m53186p73545p05414n12771q69141j311188
3042.6F57552032o97708l34243r00956j384124j348114o23627p04117j001511j205749
3051.3F49351883q11997m68139j158753r50851q73261j054916r35669o28967o93054
3060F41776276r88388p78733j018219r19189j085587q99315p50961j185341q66279
$$ plain form
2995.3 678432693 678744202 678773117 678752518 678867798 678811951 678986588 679530182 679540863 679490433 679685898
3005 679685898 680367432 680492249 679743881 679196777 678935852 679069138 678695145 677956619 677395554 677066116
3014.6 677066116 676746826 676031265 675619736 675485611 675300980 674611435 673872299 673403397 672610092 671685791
3024.3 671685791 670699463 669703827 668811951 668571167 668506775 667987061 667211456 666392593 665843964 665002594
3033.9 665002594 664047241 663016052 662177277 661724091 660950546 660245132 659732361 658863220 657552032
3042.6 657552032 656854324 656520081 655619125 654235001 652886887 652263260 651559143 650557632 649351883
3051.3 649351883 648539886 648071747 646912994 645962143 645088882 644033966 643098297 642469330 641776276
3060 641776276 640787888 640009155 638990936 638071747 636986160 636086845 635335884 634150543 633284264
3068.6F33284264r18808o89583p15828o92940q79478j409912j105729j046791r09424
3077.3F24915771j226310o93627o11801j530342q60863n20935m64554r10682j103745
3086F16992912p58667j197891j295967q64716o24771r94262p27616j055755j413308
3094.7F08059959p72514q79555p29980q48656p85026n22499j032982j412468j229477
3103.4E99846802q53272r31930r95941j213761o77757l79524r24263p22275o69251
3112E92478828p21664r47723j048050j305313j557579j087151o55899l48320n75104
3120.7E84232025q34083j076851p47261q74405j319390q62121j165276q98056q39462
3129.4E75615120j439743j140366o20384q33855j174965k44293n70602j011582n68389
$$ plain form
3068.6 633284264 632365456 631675873 630960045 630267105 629387627 627977715 626871986 625825195 624915771
3077.3 624915771 623689461 622995834 622384033 620853691 619992828 619471893 619007339 618096657 616992912
3086 616992912 616234245 615036354 613740387 612875671 612250900 611256638 610529022 609473267 608059959
3094.7 608059959 607287445 606407890 605677910 604829254 604044228 603521729 602488747 601076279 599846802
3103.4 599846802 598993530 598061600 597065659 595851898 595174141 594794617 593870354 593148079 592478828
3112 592478828 591757164 590809441 589761391 588456078 586898499 585811348 585155449 584807129 584232025
3120.7 584232025 583397942 582321091 581573830 580699425 579380035 578517914 577352638 576454582 575615120
3129.4 575615120 574175377 573035011 572414627 571580772 570405807 570161514 569590912 568579330 568010941
3138.1E68010941j059189j446839j096229l35312j017990j175537m77066p85485j006813
3146.8E59610481r15451k27699n83611j193733o46591k49634q03528j569099j364212
3155.4E52056923j104622p84454r40171q42514l4141k8725r06868j693535r98153p11823
3165.1E44011917r86061q69980q41675j071815j156387k69280k74620n63927p25021
3173.8E37253151r04846p62329n72319l49884j499749j307830m34494o66237o79245
3182.4E30076218m32701l23678j520347j161347q8958j99051l38631q89358j019822
3191.1E24102325r15145l12996m77295j100045j089668r86366p78236j263085l43361
3199.8E16836128J91651r15299p28416k00119o04973r12438p35817r28993n54008n17884
$$ plain form
3138.1 568010941 566951752 565504913 564408684 564073372 563055382 561879845 561402779 560617294 559610481
3146.8 559610481 558695030 558467331 557883720 556689987 556043396 555793762 554990234 553421135 552056923
3155.4 552056923 550952301 550167847 549227676 548385162 548351021 548322296 547415428 545721893 544723740 544011917
3165.1 544011917 543025856 542155876 541314201 540242386 539085999 538816719 538542099 537978172 537253151
3173.8 537253151 536348305 535585976 535013657 534663773 533164024 531856194 531421700 530755463 530076218
3182.4 530076218 529643517 529319839 527799492 526638145 526549187 526350136 526011505 525122147 524102325
3191.1 524102325 523187180 522874184 522396889 521296844 520207176 519220810 518442574 517179489 516836128
3199.8 516836128 517027779 516112480 515384064 515183945 514578972 513666534 512930717 512001724 511447716 510929832
3209.4E10929832q15124m31099m61998k30675o60095j067200m23240M7149l58886j122780
3219.1E05405884r85604o87179m80461o26030o69403n97687o26297k68173l16963j39046
3228.7E00009041l08685p53136n65033m47846q39004q99582k99950l89747n80979p54165
3238.4D94170914n09796l80516o97289r499K44255k16407r76448p75032n07012p82547
3248D89560623k69203p06711q89854n08423j68724j93520o03256r8534j94969l91731
3257.7D85535698m15459n00183n27153p14683o55632n57175j49803j33667o4469J20850
3267.3D81938324j36032o14624n21622l29475q98094k57988n15328j002998M654j44387
3276.9D77522430n01403p50199l24783P8430k03209J18637n4512n74989o91032l99132
$$ plain form
3209.4 510929832 510114708 509683609 509221611 508990936 508330841 507263641 506840401 506887550 506528664 505405884
3219.1 505405884 504420280 503733101 503252640 502626610 501957207 501359520 500733223 500465050 500148087 500009041
3228.7 500009041 499700356 498947220 498382187 497934341 497095337 496195755 495895805 495506058 494925079 494170914
3238.4 494170914 493661118 493280602 492583313 492573814 492818069 492601662 491625214 490850182 490343170 489560623
3248 489560623 489291420 488584709 487694855 487186432 487017708 486824188 486220932 486122398 485927429 485535698
3257.7 485535698 485120239 484620056 484092903 483378220 482722588 482165413 482015610 481881943 481817474 481938324
3267.3 481938324 481802292 481187668 480666046 480336571 479438477 479180489 478665161 477662163 477666817 477522430
3276.9 477522430 477021027 476270828 475946045 476024475 475821266 475939903 475885391 475310402 474619370 474220238
3286.6D74220238m59976o55594l45841K327M8409m51508m68864p7286k31247n44815
3296.2D71035843j81198j450m92668p99561n63850J78528k8725p08465p67212l52555
3305.9D67318687l34854o58645j49079k71797l41530n3291l35388o93321j065789n72471
3315.5D62842522j44310j16349k03170o08559m59633J7166j82647m93584n95284r47532
3325.2D59108620j64986j30539j033020o09550j80626j07651q09059q65669l10975
3333.8D54896545k53486j95809n12085j74217j82762o50177j011429p29637l6507o83059
3343.5D50467377p69272k68631j50452p0152l34549q27026n61409k0638o96525p07474
3353.1D46061249m46739n57366o48689r16062j54762r5901n83077k71682l39737o48461
$$ plain form
3286.6 474220238 473760262 473104668 472758827 472761154 472809563 472358055 471889191 471811905 471580658 471035843
3296.2 471035843 470854645 470853195 470360527 469560966 468997116 469175644 469146919 468438454 467671242 467318687
3305.9 467318687 466983833 466325188 466176109 465904312 465562782 465509491 465174103 464480782 463414993 462842522
3315.5 462842522 462698212 462581863 462378693 461770134 461310501 461327667 461145020 460651436 460056152 459108620
3325.2 459108620 458943634 458813095 457780075 457170525 456989899 456882248 456073189 455207520 454896545
3333.8 454896545 454643059 454447250 453935165 453760948 453578186 452928009 451916580 451186943 451150436 450467377
3343.5 450467377 449698105 449429474 449279022 449208870 448874321 448047295 447485886 447465248 446768723 446061249
3353.1 446061249 445614510 445057144 444408455 443492393 443337631 443241730 442658653 442386971 442047234 441398773
3362.8D41398773l05710m06685r07020l82843l68233q72040j149940p53822K13279
3371.4D36465759J25428l96424n31921M8027J51787n81437q00361n49355m33197o41823
3381.1D32856483j85623k71759r96017p22695k88238K0943Q8729j37825j84059o1111
3390.7D30118828j77727m58755m83780k53144k04429o8589m920n84412j85890K98500
3400.4D27995682j92337l97263k59971l62168p00531k88353j85547q8310P0915o78901
3410D24913216l91503K91939N22347M19311l62854q10089j06926K77252r8343j01852
3419.7D24552498o59294n13687M6463K52609M27017Q9531K17323k50816l68462N37987
3429.3D24331169R71451J81274p29217j74637J0147l1853j82762l63807m15764K21710
$$ plain form
3362.8 441398773 441093063 440686378 439779358 439396515 439028282 438156242 437006302 436252480 436465759
3371.4 436465759 436591187 436194763 435662842 435710869 435862656 435281219 434480858 433931503 433498306 432856483
3381.1 432856483 432670860 432399101 431403084 430680389 430392151 430413094 430501823 430363998 430179939 430118828
3390.7 430118828 429941101 429482346 428998566 428745422 428540993 428472404 428467484 427883072 427697182 427995682
3400.4 427995682 427803345 427406082 427146111 426783943 426083412 425795059 425609512 425521202 425592117 424913216
3410 424913216 424521713 424813652 425335999 425755310 425392456 424582367 424475441 424752693 424654350 424552498
3419.7 424552498 423893204 423379517 423425980 423678589 424105606 424195137 424412460 424161644 423793182 424331169
3429.3 424331169 425302620 425483894 424754677 424580040 424590187 424558334 424375572 424011765 423596001 423817711
3439D23817711P86400J21689N27725K99797K22778M23508O44874Q65441j317482o2752
3448.6D26329689Q19550K8953N18150J51520M17137M24195P9918k02484M79011P93724
3458.2D29839363P8507M74548J92757L74374K18658K40364O83594L16582M09203J9378
3467.9D32847328Q82683J280937K19231k57187J58958J031418M83132j10894K94075
3476.6D36829681M49753P8926O09703R08013K20070j16272M41551J890564O89697j27296
3486.2D41874390P54356J87645M3564N42908R27124j69335M26064J266060J52053M17252
3495.8D46422081k43111m4937J240692J325646J069221J025543M51661r38492m19083
3504.5D49889221N99327J176148J306534J450271Q3542r11865J151733J183663P11937
$$ plain form
3439 423817711 424604111 424725800 425253525 425553322 425776100 426199608 426844482 427709923 426392441 426329689
3448.6 426329689 427149239 427178192 427696342 427847862 428264999 428689194 428769112 428566628 429045639 429839363
3458.2 429839363 429917870 430392418 430585175 430959549 431178207 431418571 432102165 432418747 432827950 432847328
3467.9 432847328 433730011 435010948 435230179 434972992 435131950 436163368 436646500 436535606 436829681
3476.6 436829681 437279434 437358360 437968063 438876076 439096146 438979874 439421425 441311989 442001686 441874390
3486.2 441874390 442628746 442816391 442859955 443402863 444329987 444160652 444586716 445852776 446004829 446422081
3495.8 446422081 446178970 446134033 447374725 448700371 449769592 450795135 451246796 450308304 449889221
3504.5 449889221 450488548 451664696 452971230 454421501 454505043 453593178 454744911 455928574 456640511
3513.2D56640511p7019M04358J401520M00962N78347L56063N11017Q71277Q97522M54826
3522.9D62439384m94651O81038J170845J055107J82113j39656L94059J091308Q75969
3531.5D67255516L34816J083717P44248J615104P6180o52008J843224Q27560J207428
3540.2D74335785P85599K62718N44624P40967N73845n63507J349029J15509R53865
3548.9D79098434J453362J232719J978379r17397P12128P33871J736908K132683l16391
3557.6D87844696J593018R98497J80435K29225J929321J428604P59163M466896r01947
3566.2D98527908j486129N42755l66097L453827J454544J122437J437721J577339P27692
3574.9E06991997J203232K494239k7961J548500J259994L55530J708260K435798K097855
$$ plain form
3513.2 456640511 456563492 456967850 458369370 458770332 459348679 459704742 460215759 461087036 461984558 462439384
3522.9 462439384 461944733 462625771 463796616 464851723 465033836 464894180 465288239 466379547 467255516
3531.5 467255516 467590332 468674049 469418297 471033401 471109581 470457573 472300797 473128357 474335785
3540.2 474335785 475121384 475384102 475928726 476669693 477243538 476680031 478029060 478144569 479098434
3548.9 479098434 480551796 481784515 483762894 482845497 483557625 484291496 486028404 488161087 487844696
3557.6 487844696 489437714 490436211 490616646 490845871 492775192 494203796 494962959 499429855 498527908
3566.2 498527908 497041779 497584534 497218437 500672264 502126808 503249245 504686966 506264305 506991997
3574.9 506991997 508195229 510689468 510661507 512210007 513470001 513825531 515533791 517969589 520067444
3583.6E20067444P03125L790970K68593k681122K250442m90036L040352L376617L210335
3592.3E33536720J080857L79905L085480j927071K582741L461495q13561K295036J486283
3601E45167885J123199K155075K190056K116318K488632J605187j489525L244552j843490
3609.6E56757889k04392R094925J164437l789216L302269j56288M848824M272041r19418
3618.3E74371071K004890j624336R99641L846589K333641J811332K170067K233467
3626E88146362J942864N803489k786827j1581535O162224N948906O403160Q33435k194367
3634.7E98677711K792550K897186K186088l93371J259689K723274J613389J22413M80156
3643.4F12359085L064156L714714N084037l006286k992630N787010l066635l076248
$$ plain form
3583.6 520067444 520770569 524561539 524830132 522149010 524399452 523909416 526949768 530326385 533536720
3592.3 533536720 534617577 534997482 538082962 536155891 538738632 542200127 541386566 543681602 545167885
3601 545167885 546291084 548446159 550636215 552752533 555241165 556846352 555356827 558601379 556757889
3609.6 556757889 556553497 565648422 566812859 563023643 566325912 566169624 571018448 575290489 574371071
3618.3 574371071 576375961 574751625 575751266 579597855 581931496 583742828 585912895 588146362
3626 588146362 590089226 595892715 593105888 581524353 587686577 593635483 600038643 600872078 598677711
3634.7 598677711 601470261 604367447 606553535 606160164 607419853 610143127 611756516 611878929 612359085
3643.4 612359085 615423241 619137955 624221992 621215706 618223076 624010086 620943451 617867203
3651.1F17867203J414222O579247L852615L732796M969521r759827J892319N769806
3658.8F36317902J525268J394577J001053K431030K64359J107178J488113J36490L765640
3667.5F49431610J068878j756515m5853m838180M350662R134216Q545303o266784j9346237
3676.2F40277100P037429Q452149M550629k241822M52271K931900J668091J879730
3683.9F65007477P06253Q43963M599000N555953j1154479l272095Q708191o058960
3691.6F64935303J478958O469192L44468J274642K02256J01700J536026K48031K926407
3700.3F79516983K680283o697388j346741N750733J246719J36948Q87909K835998L908997
3709F88920441q092728L945007L498154j4365616O155548N705109R81293J333236K525330
$$ plain form
3651.1 617867203 619281425 625860672 629713287 633446083 638415604 628655777 630548096 636317902
3658.8 636317902 637843170 639237747 640238800 642669830 642934189 644041367 645529480 645665970 649431610
3667.5 649431610 650500488 648743973 648698120 643859940 648210602 657344818 665890121 659623337 640277100
3676.2 640277100 647314529 655766678 660317307 658075485 658527756 661459656 663127747 665007477
3683.9 665007477 665713730 666557693 671156693 676712646 665558167 662286072 670994263 664935303
3691.6 664935303 666414261 672883453 673227921 674502563 674704819 674806519 676342545 676590576 679516983
3700.3 679516983 682197266 675499878 674153137 679903870 681150589 681287537 682175446 685011444 688920441
3709 688920441 680827713 684772720 688270874 673905258 680060806 685765915 686747208 688080444 690605774
3717.7F90605774M57458m398803J192779O108475l872223l985290O187591P21207j217423
3726.3F91799545l039779M04129M593048J161117N194626l896637o942825J0048904
3734F99322128o10275j1544952J486435L468246J119843L524475L933563k948303L145065
3742.7G00896225J0743561j4581833j5369492J2613373O347885O049423l606262j1006851
3750.4F92086029J0747910p407227n150833P325363N440903K725677n691757L772202
3758.2G03848267M370575r617463N90210N697327K263641Q22220L222275l931351n044098
3766.8G02221603M401169N339279j524582r477157L502960M309845P55997R44748l11127
3775.5G10162735P03278N03692K385636j815262p073059M572067K884140R29489K176514
$$ plain form
3717.7 690605774 691063232 686664429 687857208 693965683 690093460 686108170 692295761 693016968 691799545
3726.3 691799545 688759766 689163895 693756943 694918060 700112686 696216049 689273224 699322128
3734 699322128 698711853 687166901 688653336 692121582 693241425 696765900 700699463 697751160 700896225
3742.7 700896225 711639786 697057953 681688461 694301834 700649719 706699142 703092880 692086029
3750.4 692086029 702833939 695426712 690275879 697601242 703042145 705767822 700076065 703848267
3758.2 703848267 708218842 698601379 699191589 704888916 707152557 707974777 711197052 707265701 702221603
3766.8 702221603 706622772 711962051 710437469 700960312 704463272 708773117 709529114 710473862 710162735
3775.5 710162735 710866013 711369705 713755341 711940079 704867020 709439087 712323227 713252716 715429230
3784.2G15429230l172760j501618R22547J477813J089631p80640O95953M59519k17057
3792.9G14402618j27945J979981K939377n504303l712616L555679N163727N074081
3800.6G23770599j1469650q786011O986390L857498N190658N215149j1344452l350754
3808.3G10069427N811387K322845L90244L85742L05862J652909N425491m986038j4320450
3817G07057419P939911O109009L741683p28225j7605133N167160O355056K160111K163238
3825.7G22360229j126327m333572J895980L297043L232880p6523r418487M199447P104340
3834.3G27135010p357178P03201R119492j0876770m765625Q711929n442810J898956
3842.1G19126205P632294m420318l421708M208374J720810N9967K162934j251450J901627
$$ plain form
3784.2 715429230 712256470 710754852 711677399 713155212 714244843 713464203 714160156 714619675 714402618
3792.9 714402618 714274673 716254654 719194031 713689728 709977112 713532791 718696518 723770599
3800.6 723770599 712300949 703514938 710501328 714358826 719549484 724764633 713420181 710069427
3808.3 710069427 715880814 718203659 718593903 718979645 719285507 720938416 726363907 721377869 707057419
3817 707057419 714997330 721106339 724848022 724119797 706514664 711681824 718036880 720196991 722360229
3825.7 722360229 721233902 716900330 718796310 722093353 725326233 725249710 715831223 720030670 727135010
3834.3 727135010 719777832 720481033 729600525 718723755 713958130 722670059 717227249 719126205
3842.1 719126205 726758499 722338181 718916473 723124847 724845657 724905624 727068558 725817108 727718735
3850.7G27718735N686645q154297o36291j7506180N036850J2928925o84891j555329
3858.4G22834167K536545K661515K054748p306518M59442P615356o845474m480972
3866.2G19528809N375747N816422N755081j0874786q376007N782699O746445K068023
3873.9G31822433j1339874K003708M842606J162033K936172L761444o596527o381149
3881.6G22210846O974869J262741J729507M157715j4578781K421646N027771O32095
3889.3G29838409L944550j816864r581680L028717M515304q56399J998367P07626K300492
3898G34078522K187423j0041961N165939L00293o487808N230179k795945m52957P28989
3906.7G27912674R11941K503815k83127M17328J40915O28357K29569j144410J590729
$$ plain form
3850.7 727718735 733405380 725251083 724614792 707108612 712145462 725074387 724389496 722834167
3858.4 722834167 725370712 728032227 730086975 722780457 723239899 730855255 724009781 719528809
3866.2 719528809 724904556 730720978 736476059 725601273 717225266 723007965 729754410 731822433
3873.9 731822433 720482559 722486267 727328873 728490906 731427078 735188522 728591995 722210846
3881.6 722210846 729185715 730448456 732177963 736335678 721756897 724178543 729206314 729838409
3889.3 729838409 733782959 731966095 722384415 725413132 729928436 729072037 731070404 731778030 734078522
3898 734078522 736265945 726223984 731389923 731690216 725202408 730432587 727636642 727183685 727912674
3906.7 727912674 728824615 731328430 731045303 731462631 731603546 732231903 732461472 731317062 732907791
3915.3G32907791K155609m753570l517227N307312M25872l844223K957535K624817
3923.1G34263916J228485l509216l339310K542343J251145R82132p02210l18680J834030
3931.7G34232635l147201q47702J938705R8343J161881J015548o25762k08512J46790
3940.4G33764725J165390k4643m899674k41928K433777J774139J258164k285461P62100
3949.1G33706589P9193j968079K376633Q84705q15659l46680K33383k4566o10275N08956
3958.7G34024200k44064R33609Q43048j336059K86407P30362n35736j72958Q34961
3967.4G35363770r4910j277161j82266J089478L02505m95529J50299R07364P34482
3976.1G36498032n74112R5749K18277n34440K33231o3095k62146k41394j67847J37863
$$ plain form
3915.3 732907791 735063400 730309830 726792603 732099915 732525787 728681564 731639099 734263916
3923.1 734263916 735492401 731983185 728643875 731186218 732437363 733419495 732717285 732398605 734232635
3931.7 734232635 731085434 730237732 732176437 732274780 733436661 734452209 733826447 733617935 733764725
3940.4 733764725 734930115 734905472 730005798 729763870 732197647 733971786 735229950 732944489 733706589
3949.1 733706589 733785782 731817703 734194336 735079041 734263382 733916702 734150085 734125519 733515244 734024200
3958.7 734024200 733780136 734713745 735556793 734220734 734507141 735237503 734701767 734528809 735363770
3967.4 735363770 735268860 733991699 733809433 734898911 735201416 734705887 734856186 735763550 736498032
3976.1 736498032 735923920 736019669 736237946 735703506 735936737 735873642 735611496 735370102 735202255 735340118
3985.7G35340118p7056n71900R2316J061325n9128L87497N95169n22690m33273o81686
3995.4G35130692j52894L82233J4420m35944L24555
4000.2G35263062
$$ plain form
3985.7 735340118 735263062 734691162 734783478 735844803 735785675 736173172 736768341 736245651 735812378 735130692
3995.4 735130692 734977798 735360031 735374451 734938507 735263062
4000.2 735263062
##END=$$ End of the data block
