##TITLE=$$ Begin of the data block
##JCAMP-DX=5.00 $$ ACD/SpecManager v 10.08
##SPECTROMETER/DATA SYSTEM=Varian
##DATE=20 Nov 2012 14:36:00
##DATA TYPE=INFRARED SPECTRUM
##DATA CLASS=XYDATA
##ORIGIN=
##OWNER=
##NPOINTS=3735
##FIRSTX=399.26403809
##LASTX=4000.35498047
##MAXX=4000.35498047
##MINX=399.26403809
##MAXY=81.51821136
##MINY=37.52261734
##XFACTOR=1.0000000000
##YFACTOR=0.000000100000000
##FIRSTY=65.43609619
##DELTAX=0.96440572
##XUNITS=1/CM
##YUNITS=TRANSMITTANCE
##XYDATA=(X++(Y..Y))
399.3F54360962p580261j5605278p184105n798569j273804p767563n008201k26326
407F03916855L63998J903534K613831N394783L808174M237633L148193k543106K629089
415.7F25472984j040497j1022682q132705L873367M391289L176231k130165l482933
423.4F11104889M971085J1095695M044342q377228r337005m730988k814484q77075
431.1F05079231P79267n11170k5711L401337N996017O377068K072410n180282n781174
439.8F12206993k451401n744285k980080O453438O917686K40708J72882N528831M541550
448.4F24886322K918930K041588K657089J144066l806725n483551m816398m947663
456.2F14593658l160667J535187L245735M301567L225021N17846L46908j751938k210769
$$ y = [654360962, 646780701, 631175423, 623991318, 618192749, 616918945, 609151382, 604143181, 603916855, 604280853, 606184387, 608798218, 614193001, 618001175, 622238808, 625387001, 622843895, 625472984, 624432487, 613409805, 605277100, 609150467, 613541756, 616717987, 614587822, 611104889, 616075974, 627171669, 631216011, 622838783, 613501778, 608770790, 605956306, 605079231, 605858498, 605347328, 605321617, 608722954, 614718971, 621096039, 623168449, 617988167, 612206993, 609755592, 604011307, 601031227, 607484665, 614402351, 614643059, 614815941, 620344772, 624886322, 627805252, 629846840, 632503929, 633647995, 629841270, 624357719, 619541321, 614593658, 611432991, 612968178, 616213913, 620515480, 623740501, 624258347, 624605255, 622853317, 620642548]
464.8F20642548l768502j728630j120186m950676j470336J111259J532021r49250K978096
473.5F12276344O479302j878166n434609k416763K79121J471367k834396m577141l523522
482.2E99841537j68266j097183n297852J054078O923980O024857O063690J323280k458038
490.9F12210083l34663k244378l987922m269638l734093O44722n66673n399895j28670
499.6E92188873P352295K558098p78542R00651o1188J480140l037490p832756l072472
508.2E89697609o89774l807678p027931P3624L419761J863060K789727M76989j114807
516.9E85680580k771873j290398j877632n497513n044556n539779l052521M68864O3286
525.6E61138458R7237K325325K262230L036041L167839L88374k691421k221031J202621
$$ y = [620642548, 616874046, 615145416, 614025230, 609074554, 607604218, 608715477, 610247498, 609298248, 612276344, 618755646, 616877480, 611442871, 609026108, 609305229, 610776596, 607942200, 603365059, 599841537, 599673271, 598576088, 593278236, 594332314, 601256294, 607281151, 613344841, 614668121, 612210083, 611875420, 609631042, 605643120, 601373482, 597639389, 598284111, 597717438, 592317543, 592188873, 599541168, 602099266, 601320724, 602221375, 602160187, 603640327, 600602837, 592770081, 589697609, 589007835, 585200157, 578172226, 578245850, 581665611, 583528671, 586318398, 586795387, 585680580, 582908707, 581618309, 579740677, 574243164, 569198608, 563658829, 560606308, 561075172, 561138458, 561235695, 563561020, 565823250, 568859291, 572027130, 572415504, 569724083, 567503052, 568705673]
534.3E68705673K27814k436218q59719J847458M015312N151787M895058M807777M372673
543E90727615K892189J055260k553978k911072k718887k760468k347335j406060K040062
551.6E82017326J502266K012940K413521N23338J268501r56688k401924l847046m762382
560.3E77769852l310929n058593l291092j932144l038521k025757J165466K201691
568E62479973j973953k106743j252823j865120l463936m818115k672310j590233p16286
576.7E42020454K86255K206612K876701N149231O233788N031509N469055L328400J773300
585.4E74375305K04010J76048p0304p05376M9934k21443R68743L034744L983841K172279
595E83967781K537575L620567N52864j747169l141251m602203m650383j283875K79694
$$ y = [568705673, 568933487, 566497269, 565637550, 567485008, 571500320, 576652107, 581547165, 586354942, 590727615, 593619804, 594675064, 592121086, 589210014, 586491127, 583730659, 581383324, 579977264, 582017326, 583519592, 585532532, 587946053, 588469391, 589737892, 588781204, 586379280, 582532234, 577769852, 574458923, 569400330, 566109238, 564177094, 561138573, 559112816, 560278282, 562479973, 560506020, 558399277, 557146454, 555281334, 551817398, 546999283, 544326973, 542736740, 542020454, 542306709, 544513321, 547390022, 552539253, 558773041, 563804550, 569273605, 572602005, 574375305, 574579315, 574755363, 574685059, 573979683, 574029617, 573808174, 574776917, 577811661, 581795502, 583967781, 586505356, 590125923, 590678787, 588931618, 585790367, 581188164, 576537781, 575253906, 575533600]
603.7E75533600m81491M40483J937141M696198L816070K559586R91592j84936l51563
612.4E88956680k579155k350998k799072k409363m45900K101059M097748L476677M587898
621.1E92635574M010163L931694K543907J217308J344986j221848j895446k178193
628.8F00388145k168655m88319K334404M204139L214455K752762K806358L284340K521439
637.5F18849068M97360j234245k660599k750397k045822k036476j464920J573486K734490
646.2F11461945K733383L954963L338471K795601J844635k78969k118797l467865l829613
654.8F16433754k449379j099815m10004R97887K750015L841171L083077L516616L659630
663.5F30322952J195145L79906o32058l876533j1977425R47342J490135J067353J686668
$$ y = [575533600, 575052109, 575492592, 577429733, 582125931, 585942001, 588501587, 589493179, 589308243, 588956680, 586377525, 584026527, 581227455, 578818092, 578372192, 580473251, 584570999, 588047676, 592635574, 596645737, 600577431, 603121338, 604338646, 605683632, 604461784, 602566338, 600388145, 598219490, 597731171, 600065575, 604269714, 607484169, 610236931, 613043289, 616327629, 618849068, 619346428, 618112183, 615451584, 612701187, 610655365, 608618889, 607153969, 608727455, 611461945, 614195328, 618150291, 621488762, 624284363, 626128998, 625850029, 623731232, 620263367, 616433754, 613984375, 612884560, 612474556, 613472443, 616222458, 620063629, 623146706, 626663322, 630322952, 631518097, 631898003, 631265945, 627389412, 615411987, 616359329, 617849464, 618916817, 620603485]
672.2F20603485J951065M060249M617920L400345K461434J548500K556k527008k914124
680.9F33204422k476997l013039j932678N63049J784325L087578M339065L214798L654404
689.6F42424927L668594J046295k730713n251655m311104l430634k501678j413689
697.3F27500343j324234r727J267662K532883L419685K212868P4997j485672l496666
705.9F30692139m024544k869873l425675l397178l98522K232170K114296L078690N668831
714.6F29670334N856552L510590K196426K933197K76871k646561k045135r25560k3652
723.3F38803062N35851K539139M344024N538712O390839N636749M463425J857528J4420
732F70123749o69861k151413k986755k499466p53098p4921k2811L377761N978241M950638
$$ y = [620603485, 622554550, 626614799, 631232719, 634633064, 637094498, 638642998, 638645554, 636118546, 633204422, 630727425, 627714386, 625781708, 626344757, 628129082, 631216660, 635555725, 638770523, 642424927, 646093521, 647139816, 644409103, 639157448, 634846344, 631415710, 628914032, 627500343, 626176109, 626166382, 627434044, 629966927, 633386612, 635599480, 635674477, 634188805, 630692139, 626667595, 623797722, 620372047, 616974869, 616576347, 618808517, 620922813, 624001503, 629670334, 635526886, 639037476, 641233902, 644167099, 644443970, 641797409, 639752274, 638826714, 638803062, 639338913, 641878052, 646222076, 651760788, 658151627, 663788376, 668251801, 670109329, 670123749, 669453888, 667302475, 664315720, 661816254, 661063156, 660988235, 660965424, 664343185, 670321426, 675272064]
741.6F75272064L508911J594849l66364k163620k644500l730927n928879n207901k573547
750.3F57760086n82199o15387M26407K259674J484146J252136p4844j591644j938782
759F58379593m156113n654297n497055l847885j909714q15467J562156L078461L925400
767.7F45065079M914551M847564L724518K339172J143265j99127j376877j025390L84140
776.4F59816895K075576L943863M294358M648513O109848O300202N312271M535065
784.1F97036591K903976j30768j930542k603836j709442r80606j150208k17056L033371
792.7F94251480O169205N881958N461502L500442J598435J557999n38178j559448k092285
801.4G14231110j824952j138534o95572J376953L035355L273163L625564M829331L719101
$$ y = [675272064, 678780975, 680375824, 680009460, 677845840, 675201340, 671470413, 665541534, 660333633, 657760086, 657177887, 656562500, 656988907, 659248581, 660732727, 661984863, 661910019, 660318375, 658379593, 654223480, 648569183, 643072128, 639224243, 637314529, 636499062, 638061218, 641139679, 645065079, 649979630, 654827194, 658551712, 660890884, 662034149, 661835022, 660458145, 659432755, 659816895, 661892471, 665836334, 670130692, 674779205, 680889053, 687189255, 692501526, 697036591, 699940567, 699809799, 697879257, 695275421, 693565979, 692585373, 691435165, 691218109, 694251480, 700420685, 706302643, 711764145, 715264587, 716863022, 718421021, 717882843, 716323395, 714231110, 712406158, 711267624, 710572052, 711949005, 714984360, 718257523, 721883087, 726712418, 730431519]
810.1G30431519J156616o03333j406250k053833l483200m253616l326187m75846J317902
818.8G17303772K709198K583847J613083L396759K863541M06951j270294k415085m098587
827.5G23093185m993515m155578l429260k129441j176224J57395J143341J545715J977997
836.1G12033615O67801j386719l429565l902664l995667m202194m692230m460068j755524
844.8F84876785m38156j74560J692428K607575J589126R02558P9193k130661l702393
853.5F85301895m628372m192581k862091k735062k952423j418381L03345J245270K784424
862.2F70846024L554763L807679L501815K466202K599030J645202J525727K468414
869.9F92414856K703018L749848M087143M463653N711212N523300L372651K852630
$$ y = [730431519, 731588135, 730984802, 729578552, 727524719, 724041519, 719787903, 716461716, 715985870, 717303772, 720012970, 722596817, 724209900, 727606659, 730470200, 730877151, 729606857, 727191772, 723093185, 718099670, 713944092, 710514832, 708385391, 707209167, 707366562, 708509903, 710055618, 712033615, 712701416, 711314697, 707885132, 703982468, 699986801, 695784607, 691092377, 686632309, 684876785, 684438629, 684264069, 685956497, 688564072, 690153198, 691055756, 691134949, 689004288, 685301895, 680673523, 676480942, 673618851, 670883789, 667931366, 666512985, 666816330, 668061600, 670846024, 674400787, 678208466, 681710281, 684176483, 686775513, 688420715, 689946442, 692414856, 695117874, 698867722, 702954865, 707418518, 713129730, 718653030, 722025681, 724878311]
877.6G24878311J817246l4256r31702l411789l951721l150864k799682k413941j699905
886.3G08301697j207581l68805Q34656l6850n60913j322174l009186l795166l564224
895F95271454l461456l930359l090821k095947r49402l86886j55945O46820K73590
903.7F82121048o06461k603683l576279l258590m203949n209275n663986m540863l298187
912.3F49159775l259583k741165k584839k243995k125893k764359k978897m077720
920F26383324l884850k844734l018646k836991j733741n28870k16026R48639J170158
928.7F13438263O75659J537171K391128J635857J32942R3079k29111Q850N39436K24991
938.4F20448265J014252K140198K656326K724876L582955L534431J900864l43857k143860
$$ y = [724878311, 726695557, 726661301, 725729599, 722317810, 718366089, 715215225, 712415543, 710001602, 708301697, 707094116, 706725311, 707559967, 707523117, 706962204, 705640030, 702630844, 698835678, 695271454, 691809998, 687879639, 684788818, 682692871, 681743469, 681356583, 681200638, 681847458, 682121048, 681514587, 678910904, 675334625, 672076035, 667872086, 662662811, 656998825, 652457962, 649159775, 645900192, 643159027, 640574188, 638330193, 636204300, 633439941, 630461044, 626383324, 622498474, 619653740, 616635094, 613798103, 612064362, 611535492, 611319466, 612268105, 613438263, 614113922, 615651093, 618042221, 619678078, 619811020, 619904099, 619674988, 619683838, 620223274, 620448265, 621462517, 623602715, 626259041, 628983917, 632566872, 636101303, 638002167, 637658310, 635514450]
947.1F35514450k083359k783737m463386n054894m375305m236984n155754m301415
954.8F03059616l910561m420738n207329n354805n360832o982841p677422q174133
962.5E55970955p693939p795182p813911p254639p249260o534958p321777o800728
970.2D97506561p027130p711868q140717q530197q684883r483986q239708q782844
977.9D30905228p229233o153832o099014n267258n680236m315873m287185j892319
985.6C89980278j877441k294236k322960k803230r31358k112923n21583j091156p99218
994.3C75226173O36254P50236J940117m13933L25432O76270J505165P82852m54826
1003C80973740M88968p66869M5776p49511O7176o05964m70391J094895o02150L34396
$$ y = [635514450, 633431091, 630647354, 626183968, 621129074, 616753769, 612516785, 607361031, 603059616, 599149055, 594728317, 589520988, 584166183, 578805351, 571822510, 564145088, 555970955, 548277016, 540481834, 532667923, 525413284, 518164024, 511629066, 504307289, 497506561, 490479431, 482767563, 474626846, 466096649, 457411766, 447927780, 439688072, 430905228, 423675995, 417522163, 411423149, 406155891, 400475655, 396159782, 391872597, 389980278, 388102837, 385808601, 383485641, 380682411, 379751053, 377638130, 377116547, 376025391, 375226173, 375862427, 376612663, 378552780, 378138847, 378464279, 379140549, 380645714, 381428566, 380973740, 381462708, 380695839, 380741615, 379992104, 380059280, 379453316, 378982925, 380077820, 379475670, 379810066]
1012.6C79810066k83890J81656r28116p25669Q00933M05426Q01697j104660M44794
1021.3C79402237J113281K093697K009430J840629K931214N82428K289009K389984
1029C94651909J893463J310844J262284J670913K06986J271248L20091J259270J129913
1037.7D04976921P68585J104775Q71315J829681k83813r8992o44264J26991k29o17446
1047.4D08033524J211090J88598J485939J320610K253876K378311K471504L271027
1055.1D22614479K285919L548775K606316L634147L059159L266906M057122L136100
1062.8D48208923M817696N234871O409492M536515L466568J598587r62715j455575
1070.5D71854362m342079n882835q290558o454277l918838l059922j768112j976776
$$ y = [379810066, 379526176, 379707832, 378779716, 378054047, 378854980, 379260406, 380062103, 378957443, 379402237, 380515518, 382609215, 384618645, 386459274, 389390488, 389972916, 392261925, 394651909, 396545372, 397856216, 399118500, 400789413, 400996399, 402267647, 402587738, 403847008, 404976921, 405745506, 406850281, 407721596, 409551277, 409267464, 409168472, 408524208, 408651199, 408650970, 408033524, 409244614, 409433212, 410919151, 412239761, 414493637, 416871948, 419343452, 422614479, 424900398, 428449173, 431055489, 434689636, 437748795, 441015701, 445072823, 448208923, 453026619, 458261490, 464670982, 469207497, 472674065, 474272652, 473309937, 471854362, 467512283, 461629448, 453338890, 446884613, 442965775, 439905853, 438137741, 436160965]
1078.2D36160965l17535j228447J447754J528129J200066K217712P46384J870956R91287
1086.9D44617271K737771J840515J659736K427826J976891M069214L569297M285737
1094.6D67184258K395935K467689K091179O15501J228562l74489P82661m57534q61206
1103.3D75072556p14112N90286K579880Q22220J524391J206551K209968J427803Q76656
1112D85596199K115974J214028J490478O85845J960258J625443J010132K088012K110825
1120.6D99897194J899223R75533J284294P26662J172256L06397K63099J648331J557121
1129.3E09730110J926880P21932K161827J860580J423492K466469J327286N11322r75914
1138E21153984q44536k586403l264541l333588n426712n138206m333916j273918j579094
$$ y = [436160965, 435843430, 434614983, 436062737, 437590866, 438790932, 441008644, 441755028, 443625984, 444617271, 447355042, 449195557, 450855293, 453283119, 455260010, 459329224, 462898521, 467184258, 469580193, 472047882, 474139061, 474754562, 475983124, 475608635, 476391296, 475933762, 475072556, 474358444, 474948730, 477528610, 478350830, 479875221, 481081772, 483291740, 484719543, 485596199, 487712173, 488926201, 490416679, 491102524, 493062782, 494688225, 495698357, 497786369, 499897194, 501796417, 502771950, 504056244, 504782906, 505955162, 506261559, 506524658, 508172989, 509730110, 511656990, 512378922, 514540749, 516401329, 517824821, 520291290, 521618576, 522129898, 521153984, 520309448, 517723045, 514458504, 511124916, 505698204, 500559998, 496226082, 494952164, 493373070]
1146.7D93373070k697602k682228k568702j040001j370964j035271k595253k159462
1154.4D77223587k079697j851043n3826k46429P51037p5645J821823K433739K149315
1163.1D80072861K778244J943817L407745L815460L828698K550544L320923M074135
1170.8E05792427L899307N452538N622711N984917O054001P417831O970482O084480
1178.5E53278694N513115M413147M930496M235573M070244M019356L951378L942375
1186.2E88354378M009475M513741M837151M861793L828278L496437K219734J092606
1193.9F17213593J36451r05189j98250J1749J98937k9908L13569J660842K066613K282066
1203.6F22750473K225151J953354O93359K65389M93927K8572l41187j18904J092148
$$ y = [493373070, 490675468, 487993240, 485424538, 484384537, 483013573, 481978302, 479383049, 477223587, 475143890, 473292847, 473239021, 472992592, 473743629, 473667984, 475489807, 477923546, 480072861, 482851105, 484794922, 488202667, 492018127, 495846825, 498397369, 501718292, 505792427, 509691734, 515144272, 520766983, 526751900, 532805901, 540223732, 547194214, 553278694, 558791809, 563204956, 568135452, 572371025, 576441269, 580460625, 584412003, 588354378, 592363853, 596877594, 601714745, 606576538, 610404816, 613901253, 616120987, 617213593, 617350044, 616444855, 616246605, 616258354, 616457291, 616427383, 616740952, 618401794, 620468407, 622750473, 624975624, 626928978, 627622337, 627887726, 628381653, 628410225, 628069038, 627950134, 629042282]
1212.3F29042282J434059K426110L422660L317337L526192K759247K041931J461792
1220F49431610J53122n99670p99485j145401j607895r83657O7901J47095M33960O13327
1229.6F45710907M16183P11670O15464r7580r97925k036820k265701j738586j609154
1238.3F38708458j547585j169548q6021Q81119J204300J650962J963768J228257R3231
1247F42926941k17896m85611q34274q10776p33909K1553O73141J212845K025681K163009
1256.6F45940704J908799J730957J130218M86755M06952m06723j814422j523972j263962
1265.3F46595306n47256Q19168J418762K165528K653732K685547J902542J292419J044541
1274F60030289j35804j082992k036896j632614j232529j147461n25512p8202R19266
$$ y = [629042282, 630476341, 632902451, 636325111, 639642448, 643168640, 645927887, 647969818, 649431610, 649584732, 648985062, 648185577, 647040176, 645432281, 644448624, 644516525, 644663620, 645097580, 645710907, 646127090, 646838760, 647454224, 647356644, 646358719, 644321899, 642056198, 640317612, 638708458, 637160873, 635991325, 635905304, 636786423, 637990723, 639641685, 641605453, 642833710, 642926941, 642709045, 642223434, 641389160, 640578384, 639844475, 639866028, 640539169, 641752014, 643777695, 645940704, 647849503, 649580460, 650710678, 651197433, 651604385, 651197662, 649383240, 647859268, 646595306, 646048050, 646867218, 648285980, 650451508, 653105240, 655790787, 657693329, 658985748, 660030289, 659894485, 658811493, 656774597, 655141983, 653909454, 652761993, 652236481, 652158279, 653077545]
1282.7F53077545J583252J881561J428070O17447k73132j191788j423950k172851k164078
1291.3F51362076k098007j581192m34723J21460P88803J344986J335830N11780r7580
1300F51253433j077347j962509j769790k166825k601089k568016j684342o41822J47666
1308.7F36929359P23191R69352J333123O04362k36740k34833j111183k067795k280159
1317.4F34628677k008667j814231j454697n35507L55682P26166P25860L64113k64396
1326F30723000r35860j795387k566224l378791m005623l836212k764206k111016j236801
1334.7F08092880n17006k66723O256N01671L25927L61901Q43467j16462j022377j570168
1344.4F06639366j528168r31472k15607L7880K72217J529693J718369J571731R98993
$$ y = [653077545, 654660797, 656542358, 657970428, 658587875, 658314743, 657122955, 655699005, 653526154, 651362076, 649264069, 647682877, 647248154, 647369614, 648158417, 649503403, 650839233, 651351013, 651253433, 650176086, 648213577, 646443787, 644276962, 641675873, 639107857, 637423515, 636781693, 636929359, 637652550, 638621902, 639955025, 640559387, 640322647, 640087814, 638976631, 636908836, 634628677, 632620010, 630805779, 629351082, 628815575, 629171257, 629897423, 630623283, 630987396, 630723000, 629787140, 627991753, 625425529, 622046738, 618041115, 614204903, 611440697, 609329681, 608092880, 607575874, 607309151, 607315407, 607817078, 608143005, 608504906, 609348373, 609231911, 608209534, 606639366, 605111198, 604179726, 603964119, 604001999, 604274216, 605803909, 607522278, 609094009, 610093002]
1353.1F10093002M56314l74260j507568j289177j727218k054291j551018j421432o97251
1361.7E99927101l28216N77583K065353K172852J086082Q60901n24292j631546q77304
1370.4F03328514j305389n56717j192513j336708J48201J561737K296295J546975K106666
1379.1F06597061J660957J497193N66482r40551q96683o42853K70882k55394K56614
1387.8F08113708K548256L261261L089714K505532K257995Q30346n05562n27840L02010
1396.4F21875420j042176j699218l367958j600647Q83445m88319m9820L26576l14407
1405.1F14522896Q50754J143417K46544j217232j168060j986809k386589k372246j852875
1413.8F05779800p97233p19261k51160L11775R56497o33010J532745K415314K73437
$$ y = [610093002, 610549316, 610175056, 608667488, 607378311, 605651093, 603596802, 602045784, 600624352, 599927101, 599598885, 600176468, 602241821, 604414673, 605500755, 606361656, 605837364, 604205818, 603328514, 602023125, 601466408, 600273895, 598937187, 599085388, 600647125, 602943420, 604490395, 606597061, 608258018, 609755211, 610321693, 609381142, 608484459, 607841606, 608112488, 607857094, 608113708, 610661964, 613923225, 617012939, 619518471, 621776466, 622606812, 622101250, 621573410, 621875420, 620833244, 619134026, 615766068, 614165421, 615048866, 614560547, 614510727, 614837303, 614522896, 615373650, 616517067, 616763611, 615546379, 614378319, 612391510, 610004921, 607632675, 605779800, 604982567, 604263306, 604012146, 604323921, 605280418, 604647408, 606180153, 608595467, 608868904]
1422.5F08868904p14569k483444m14696l02849j145553M11033j48315O83594J784401
1431.2F06538506K585563J832466J284714J854019K81220k770767j61591K103424l15552
1439.8F13232002p47604O04477O71997J945228R81980J568031J375199M92248l6392
1448.5F20087166K33536L29094j764374k070847k158317q41256j122589j648712j932525
1457.2F09111176j338273L898964J425324K845154J204452P12395J412849k893562
1464.9F16378479k12135N20935K080726J479340K448730L538056J544418L345490M116401
1473.6F35240440P855492L506775K212219L218918K507401J999588P05032J989822
1481.3F59235687J609192K973099K992248L082810L200455J200866M083023J904145
$$ y = [608868904, 608154335, 605670891, 605256195, 604953346, 603807793, 604218826, 604070511, 604754105, 606538506, 609124069, 610956535, 612241249, 614095268, 614376488, 611605721, 611444130, 613547554, 613232002, 612484398, 613088875, 613760872, 615706100, 616688080, 618256111, 619631310, 620123558, 620087166, 620320702, 620649796, 618885422, 616814575, 614656258, 613815002, 612692413, 611043701, 609111176, 607772903, 611671867, 613097191, 615942345, 617146797, 617859192, 619272041, 616378479, 616166344, 616687279, 618768005, 620247345, 622696075, 626234131, 627778549, 631124039, 635240440, 643095932, 646602707, 648814926, 652033844, 654541245, 656540833, 657245865, 659235687, 660844879, 663817978, 666810226, 669893036, 673093491, 674294357, 678377380, 680281525]
1489F80281525K41470J146164K868957K325058K69394Q53272p05033q45870K826614
1497.7F89261551K572784K788391L479538K966462R25674K028809J306839J185379
1505.4G06515427p271729p636413N419769J970978K998352K186126J874085J688080
1513.1G07744675L120269K064896l37143q21228k680893L907547R32999n618744l849640
1521.8G04462738K248306N136338J524582j09101J089096K925492J608352J651535
1529.5G20537338K341538n94101J15661l756408m850922K392273P59888J047439P22809
1538.2G18715515l328628o725007O996995K428817K83280L733902q81882j900711J024017
1546.9G20346298J49155m49524k835159k170411J993943J986389N76324k155914J321259
$$ y = [680281525, 680522995, 681669159, 684538116, 686863174, 687132568, 687985840, 687280807, 686434937, 689261551, 691834335, 694622726, 698102264, 701068726, 701994400, 704023209, 705330048, 706515427, 699243698, 691607285, 697027054, 698998032, 701996384, 704182510, 706056595, 707744675, 710864944, 712929840, 712592697, 711771469, 709090576, 712998123, 713931122, 708312378, 704462738, 706711044, 711847382, 713371964, 713262863, 714351959, 717277451, 718885803, 720537338, 722878876, 722284775, 722400436, 718644028, 713793106, 716185379, 716945267, 717992706, 718715515, 715386887, 708661880, 715658875, 718087692, 718370972, 722104874, 721222992, 719322281, 720346298, 720495453, 720045929, 717210770, 715040359, 717034302, 719020691, 719597015, 717441101, 718762360]
1555.6G18762360L859710J247711r906082l083954l862762L536758J542664J040726
1563.3G13137131R52606p27997Q70133J135788J225051l35540m769745K439270J711502
1572G15638199r61380j708908k70615j129532p873306K213745K360535J045913Q86155
1580.6G10200806O41479O91757M48227k56805j227951j308289j589660j728745j084442
1589.3G04786377j365814r66110j016465K4796J40533k10418N11093q8654k77176j315384
1599G00222778j816787k289887k273178j716232j864624p41959j152496q45795o53534
1607.6F86868286K46582n46188j116181Q4076k173690j751709k166443j457138k446366
1616.3F75541229q146972K467575O35605k86561r44137K69089j216126m106903J616287
$$ y = [718762360, 722622070, 723869781, 713963699, 710879745, 707016983, 710553741, 712096405, 713137131, 714089737, 713361740, 714231873, 715367661, 716592712, 716257172, 711487427, 713926697, 715638199, 714676819, 712967911, 712697296, 711567764, 703694458, 705908203, 708268738, 709314651, 710200806, 710842285, 711534042, 711982269, 711725464, 710497513, 709189224, 707599564, 705870819, 704786377, 703420563, 702454453, 701437988, 701462784, 701603317, 701392899, 701903992, 701815338, 701538162, 700222778, 698405991, 696116104, 693842926, 692126694, 690262070, 689520111, 688367615, 687521820, 686868286, 687114868, 686568680, 685452499, 685536575, 683362885, 681611176, 679444733, 677987595, 675541229, 667394257, 669861832, 670497437, 670210876, 669266739, 669535828, 668319702, 664212799, 665829086]
1625F65829086J12915m17099l348236k592315k3194r41467p27692j133423Q45566J20468
1634.6F57724609o001510P12661K437974J812362J168671J32522r36279K3346j117783
1643.3F55956573L34931P45773k910232k59095J456681M074707L191528L546677L727112
1652F69864655m123612j0255051O275559M689941K520676J866989J311188J199493
1659.7F73349838J402741J820450R67788J606598L866043K488785J798477J637421
1667.4F88938141J108551j851425R71451K754440O27518K735672L059768m30221J097412
1676.1F99011307M836120L602753K335663J255875l01362K700654L260345j607742
1683.8G15093613o818772M836655N094299K975846J266784J945572J993332K845535
$$ y = [665829086, 665942001, 665524902, 662176666, 659584351, 659561157, 658619690, 657891998, 656758575, 657604141, 657724609, 651723099, 652435760, 654873734, 656686096, 657854767, 657987289, 657051010, 657074356, 655956573, 656291504, 657037277, 654127045, 653867950, 655324631, 659399338, 662590866, 666137543, 669864655, 665741043, 655485992, 661761551, 666451492, 668972168, 670839157, 672150345, 673349838, 674752579, 676573029, 677540817, 679147415, 683013458, 685502243, 687300720, 688938141, 690046692, 688195267, 689166718, 691921158, 692548676, 695284348, 698344116, 697913895, 699011307, 703847427, 707450180, 709785843, 711041718, 710740356, 713441010, 716701355, 715093613, 708274841, 713111496, 718205795, 721181641, 722448425, 724393997, 726387329, 729232864]
1691.5G29232864K762986J229095K475128J282654q256912J522674L096619L457260
1699.3G36802368k311935l906708O707077M143753J253510L14788J547089l66287J390075
1707.9G45573730J860505j88294r28497L29742N20706l25851j437531J10703L475876
1716.6G48991089O43310n379257N046845L825607J253357n17349j014405j40762P53784
1725.3G53462219J21613M7912J185074R08737q32443P90329L431397K664642l748550
1734G58030930m605713M016571K762222k2278R34677j545105j624221L555145J434784
1742.7G62937012o80008J241226K841034J294708O6681O82755j32294K399750j517945
1751.3G69132919j443710L327560J526719J317977J066666j108932J616897K702408
$$ y = [729232864, 731995850, 733224945, 735700073, 736982727, 728725815, 730248489, 733345108, 736802368, 734490433, 730583725, 737290802, 741434555, 742688065, 743002853, 744549942, 744183655, 745573730, 747434235, 747245941, 746317444, 746647186, 747167892, 746842041, 745404510, 745515213, 748991089, 749634399, 744255142, 749301987, 753127594, 754380951, 753863602, 752849197, 752708435, 753462219, 753583832, 753631744, 754816818, 755725555, 754893112, 755683441, 759114838, 761779480, 758030930, 753425217, 757441788, 760204010, 760181732, 761116409, 759571304, 757947083, 761502228, 762937012, 762257004, 763498230, 766339264, 767633972, 767700653, 768383408, 768251114, 770650864, 769132919, 767689209, 771016769, 772543488, 773861465, 774928131, 773819199, 775436096, 778138504]
1759G78138504J982040J809617j985779l44162K162170J30386P0496M65775l86963
1767.7G82042084k013397J922531K700958q83103j825103P48367L761597J602630p91092
1776.4G87265472J442566l3416n86014j048203j011886J051407J399307Q15277n68695
1785.1G88725815J135559J773834P67975N96542M74396p97348k99225j943741j308899
1793.8G89124908K113495J99585n21393J564332J824569J64566n26428J992722K73819
1802.4G96210175j59073M55551l28980k38571r28192p18460K04239K18124p09076J061631
1812.1G95067368J854324J160660J340637O21109M23508r65500p02896J16806p24259
1820.8G98191757k67715o46057O47506M31748j917191J354828K726669J624833j337738
$$ y = [778138504, 780120544, 781930161, 779944382, 779600220, 781762390, 781892776, 781963272, 782429047, 782042084, 780028687, 781951218, 784652176, 783769073, 781943970, 782692337, 786453934, 788056564, 787265472, 788708038, 788674622, 788088608, 787040405, 786028519, 787079926, 788479233, 789294510, 788725815, 789861374, 791635208, 792403183, 792999725, 793474121, 792676773, 792377548, 790433807, 789124908, 791238403, 791437988, 790916595, 792480927, 794305496, 794470062, 793943634, 795936356, 796210175, 796051102, 796506653, 796177673, 795939102, 795010910, 794292450, 794496689, 794714813, 794005737, 795067368, 796921692, 798082352, 799422989, 800044098, 800467606, 799502106, 798799210, 798916016, 798191757, 797924042, 797277985, 797925491, 798357239, 796440048, 797794876, 800521545, 802146378, 800808640]
1829.4H00808640l004761J876220K098847n44281j015167m02909j92642o90842j33895
1838.1G98799210J497192Q15964P00302M06570J547089O30188n037842J510315J250534
1846.8H02119522j194839p45011M4403J8387k20260J097183J078033Q39462L94364
1855.5H03431244N03845P12280l16162k51770q38470j032410r78622k24381O8512Q7662
1865.1H01161728P91855K52533R16137m13894m21601J807709J198731k75574j184616
1873.8H03833008n63584q17108n60913k79999K68097Q00705O28891J532288Q58841
1882.5H05700226O15158K72522K4185l24173j622314k13547j176605k490616N39932
1891.2H01324768J239014Q42285P02972M36249R10111K044525P39746j01547l01133
$$ y = [800808640, 797803879, 799680099, 801778946, 801234665, 800219498, 799816589, 799623947, 798933105, 798799210, 800296402, 801112366, 801812668, 802219238, 803766327, 804396515, 799358673, 800868988, 802119522, 800924683, 800179672, 800224075, 800242462, 800022202, 801119385, 802197418, 803036880, 803431244, 803935089, 804647369, 804331207, 804079437, 803240967, 802208557, 801229935, 801005554, 801074066, 801161728, 801953583, 802206116, 803122253, 802708359, 802286758, 804094467, 805293198, 805017624, 803833008, 803269424, 802452316, 801891403, 801611404, 801879501, 802680206, 803309097, 804841385, 805700226, 806315384, 806587906, 806612091, 806287918, 804665604, 804452057, 803275452, 800784836, 801324768, 802563782, 803406067, 804109039, 804545288, 805455399, 807499924, 808239670, 808138123, 807836990]
1899.8H07836990q54187j226730j704407m96216k99453l281M92249N53054J116562
1908.5H05414581J136551R09271M75388P20825o32553j279449j110611p77893r7199
1917.2H04758911k638244l22037J847458J287689J200027K92816O54145R51614L96881
1925.9H08429260k37274p52182j524734j413422o90079m57687K21481M36325J076050
1934.6H05087738J267624J197281J114120L75214q5144r69162p38907k023697k514191
1943.2H02710876M29917K08587j18484O04706J428757J481475J365281Q33740R2087
1951.9H09036942k2965m00848q21457j424637j232376r65805k74430L72925N6458R57870
1961.6H05281677J456070J562042R31778P8125l814r26209j126327o74057p40357j007004
$$ y = [807836990, 806982803, 805756073, 804051666, 803555450, 803255997, 803252716, 803744965, 804298019, 805414581, 806551132, 807460403, 807935791, 808656616, 808024063, 806744614, 805634003, 804856110, 804758911, 802120667, 801798630, 803646088, 804933777, 806133804, 806426620, 807080765, 808032379, 808429260, 808191986, 807439804, 805915070, 804501648, 803811569, 803353882, 803575363, 804011688, 805087738, 806355362, 807552643, 808666763, 809041977, 808956833, 807987671, 807248764, 805225067, 802710876, 803140793, 803349380, 803230896, 803835602, 805264359, 806745834, 808111115, 808944855, 809036942, 809013977, 808613129, 807791672, 806367035, 805134659, 804168854, 803894424, 804267349, 804323807, 805281677, 806737747, 808299789, 809231567, 809309692, 809305878, 808379669, 807253342, 806579285, 805838928, 804831924]
1971.2H04831924m15344J56861K67257J097641J247940J092224J023713P72399p9956
1979.9H09994659p10220q82111j374969j334305j136780m77295L75824Q60749O35299
1988.6H05950851P61872K023849J346283l91769k13089k7008j114197j678543j058731
1997.2H05599518p80792o38199J78375P04575P10754J464157J374970P70568O53000
2005.9H10036926l98330r18198j448593j391602r00726j038437l20892n2185L04336
2014.6H03872299J165238J037902O26069R32693P83844j75247p86209j142502j234512
2023.3H05079575j445466j104354q93250l16467P83310R68857J447601J251602O90384
2032H06461792K77939k78931n71060j234283j401444j380005q70819m27017q6289M88739
$$ y = [804831924, 804416580, 804573441, 804840698, 805938339, 807186279, 808278503, 809302216, 810074615, 809994659, 809284439, 808402328, 807027359, 805693054, 804556274, 804078979, 804454803, 805315552, 805950851, 806712723, 808736572, 810082855, 809691086, 809477997, 809450989, 808336792, 806658249, 805599518, 804818726, 804180527, 804358902, 805063477, 805774231, 807238388, 808613358, 809383926, 810036926, 809638596, 808720398, 807271805, 805880203, 804979477, 803941040, 803620148, 803567963, 803872299, 805037537, 806075439, 806701508, 807634201, 808418045, 808242798, 807456589, 806314087, 805079575, 803634109, 802529755, 801636505, 801320038, 802103348, 803072205, 804519806, 805771408, 806461792, 806739731, 806460800, 805889740, 804655457, 803254013, 801874008, 801003189, 800576172, 800489883, 800978622]
2041.6H00978622Q58307J359864J103592R59854L88565l27759p28302j500778j322403
2050.3H01769562j034851p07932n07965L53088R34372N34821P68814Q87680J088562
2059H04086151O86112R2849p30133j232300r47341j541214r20182P935L04107O98395
2068.6H00504379J251068J412278N66406N38940K92435L8300k25983r87244j246872
2077.3H02143707j236725o74743j78604Q0490K80456P94144R48715Q80203J125184
2086H04162827N47714j7319m11224p44095j164246j127624q69751m44489M63867O47583
2095.6H01043243R92279J040040J130599R30405K31781J35727o65817q45566j040802
2104.3H02951889j285171q52509j65787K91062J77993J016770J097793Q42743O27594
$$ y = [800978622, 801836929, 803196793, 804300385, 805260239, 805648804, 805321045, 804592743, 803091965, 801769562, 800734711, 800026779, 799518814, 799871902, 800806274, 801341095, 802109909, 802997589, 804086151, 804772263, 804865112, 804134979, 802902679, 801955338, 800414124, 799493942, 799501877, 799805984, 800504379, 801755447, 803167725, 803734131, 804273071, 804565506, 804603806, 804377823, 803390579, 802143707, 800906982, 800232239, 800053635, 800134125, 800414581, 801208725, 802157440, 803037643, 804162827, 804710541, 804693222, 804281998, 803537903, 802373657, 801246033, 800376282, 799931793, 800395660, 801043243, 802035522, 803075562, 804206161, 805136566, 805368347, 805504074, 804838257, 803992691, 802951889, 801666718, 800814209, 800648422, 800939484, 801117477, 802134247, 803232040, 804074783, 804702377]
2113H04702377L96576L36685n48400n91813q48999p17239o48422o29807j08566n9204
2122.6H01283188R20868J013031J046295Q57391J87912L67585j75782o59866j239929
2131.3H03600693r38339n36728o10047j42593N4626O95038J112061J097336O73370
2140H05005417N19028L72467l31803n75638j132736j241531p88269k99607J64261L28904
2149.6H02020493L31878Q19473J305314P79495M76837o2866m70581m67987o01731q21838
2159.3H03308487j060867n35279k23617N29937Q09556P46841J134567R94416Q77456
2167.9H06581497p5455j12152k89459q48923n54123q60824l36685j46103K62680P86362
2177.6H04406815P56912J241684R60312M40139J06049K58179K1286n05600r69925j135254
$$ y = [804702377, 805098953, 805435638, 804887238, 804295425, 803446426, 802729187, 802080765, 801450958, 801342392, 801283188, 802204056, 803217087, 804263382, 805120773, 805308685, 805676270, 805500488, 804840622, 803600693, 802662354, 802125626, 801515579, 801372986, 801427612, 802122650, 803234711, 804332047, 805005417, 805524445, 805896912, 805565109, 804989471, 803856735, 802615204, 801826935, 801527328, 801691589, 802020493, 802352371, 803171844, 804477158, 805256653, 805733490, 805670624, 805200043, 804732056, 804130325, 803308487, 802247620, 801712341, 801488724, 802018661, 802828217, 803575058, 804709625, 805704041, 806581497, 806506042, 806393890, 806104431, 805255508, 804701385, 803840561, 803503876, 803357773, 803620453, 804406815, 805163727, 806405411, 807365723, 807805862, 807911911, 808170090, 808191376, 807685776, 806715851, 805580597]
2187.2H05580597m70963j39236O56891Q96911O86264N20096N44281J145706O96488
2195.9H10117035j50910r51843p55081n66711o16761k40936l10364K49482L44390N80902
2205.5H07699203J054307J099395J241074P41958k22244j185150p81250k93655m45175
2214.2H08908463o71387n32990K16599N30090J031418R95255P68585O99768N25360
2222.9H12471161K79007n06897p17850q51822q22754o01654j84402J69372M95072P66678
2232.5H10495911M82330R09195P68967N12542J98059l99551o08521j083831n73578
2241.2H10701523o24771n23987m8981K73133J003112P68204Q56247R43146M65164l63388
2250.9H13449402l44238m11759j184082o03485o07910l12653K17057N19714O86264
$$ y = [805580597, 805109634, 804970398, 805627289, 806524200, 807210464, 807730560, 808274841, 809420547, 810117035, 809966125, 809014282, 808259201, 807692490, 807075729, 806834793, 806524429, 806773911, 807118301, 807699203, 808753510, 809852905, 811093979, 811835937, 811613693, 810428543, 809647293, 809353638, 808908463, 808237076, 807704086, 807920685, 808450775, 809482193, 810477448, 811246033, 811945801, 812471161, 812750168, 812243271, 811525421, 810673599, 809850845, 809249191, 809064789, 809234161, 809729233, 810495911, 810978241, 811887436, 812656403, 813168945, 813367004, 812967453, 812358932, 811275101, 810701523, 810076752, 809552765, 809503784, 809776917, 810780029, 811548233, 812404480, 813347626, 813812790, 813449402, 813105164, 812693405, 811509323, 810905838, 810297928, 809985275, 810202332, 810722046, 811408310]
2259.5H11408310N34668J043777P37610P46308L19824o34079j077728j084519q19244
2268.2H11174927r78546j02845J67313N82504Q13599O25687J191177P38068N74874
2276.9H14786758M7455k83355n23987p05567n78689j168213m20914j31225J14364O90308
2286.5H11826935R79767J051025O52924O71463o9962m18625j082992j062165n55877
2295.2H11992493j054688n28488m43344N04379P72019N61828Q46405O04477N98374
2303.9H13853455m37241m69742j103897j387100n94254q32748l14331o36521L41645
2312.6H08419266R96093Q45109O52999q1558O53916l16925j255036j018906r80682
2321.3H07914276q66089p95135j17111j94931L18450P84073P63016j62201J23520K85263
$$ y = [811408310, 811942978, 812986755, 813724365, 814470673, 814790497, 814156418, 813078690, 811994171, 811174927, 810196381, 810093536, 810260849, 810843353, 811656952, 812282639, 813473816, 814211884, 814786758, 814834213, 814550858, 814026871, 813321304, 812742615, 811574402, 811153488, 811022263, 811136627, 811826935, 812806702, 813857727, 814510651, 815182114, 815112152, 814693527, 813610535, 812548370, 811992493, 810937805, 810409317, 809965973, 810470352, 811242371, 811804199, 812650604, 813255081, 813853455, 813416214, 812946472, 811842575, 810455475, 809861221, 809028473, 808714142, 808077621, 808419266, 809415359, 810260468, 810913467, 810831909, 811485825, 811168900, 809913864, 808894958, 807914276, 807048187, 806253052, 806135941, 805941010, 806259460, 807043533, 807806549, 807644348, 807767868, 808053131]
2330.9H08053131j394195r88312o66352R3537k14005r28116n64956r00040j52664M19769
2340.6H02757797J413117J509247O408j268539O42319J502456o28433J72348M77829
2349.2H06584549m67682j343765j153870J44653k05764o83670j230088l68881R70993
2357.9H02246475n0812p00836l29666k35443k91824J25122p75223n05829O89316J119919
2367.6H01291199J747741J379548L70636O30340P91168n44128j70059K66113q5526
2376.2H05677032k08740k5558O47964N14069J150207J174012L89328N31616M75693
2384.9H10325623J65481l22800l15933n41763o42166k75803k90832J61438L55301K17361
2394.6H08835907N3024K65274M26789J72958J01929k72446m30679o22711o98395n43595
$$ y = [808053131, 806658936, 805670624, 805004272, 805097809, 804883804, 803955688, 803390732, 802490692, 802338028, 802757797, 804170914, 805680161, 805686569, 804418030, 805060349, 806562805, 805934372, 806106720, 806584549, 806116867, 804773102, 803619232, 803763885, 803558121, 802874451, 801644363, 801275482, 802246475, 802195663, 801494827, 801165161, 800929718, 800637894, 800763016, 799987793, 799481964, 800171280, 801291199, 803038940, 804418488, 804789124, 805419464, 806210632, 805666504, 805496445, 805762558, 805677032, 805468292, 805442734, 806090698, 806604767, 807754974, 808928986, 809318314, 809849930, 810325623, 810491104, 810168304, 809852371, 809310608, 808668442, 808392639, 808101807, 808263245, 808618546, 808835907, 808888931, 809154205, 809580994, 809753952, 809855881, 809583435, 809152756, 808530045, 807831650, 807288055]
2404.2H07288055l25012P858K54441K43072o6681M20533L69949r5978j07727k40402
2413.8H07748108n29633p52868j22452k21481l75977k53296j50223K79770N2948J63956
2423.5H05838852r155J70593K2354n40848j79825m01382m31976n31464k17743p8583
2433.1H03640823k46963K14157L7689J19095j14288j63880j42212k70843o4469m54559
2442.8H02554550l92914m56543m29382l25546j94702Q2168p6675n0049k48566J07422
2452.4H00569763J3504m17480r3994q8959k43378n32303l46298j00708R4986l0289
2462.1G98824844n98220k03400N73654L34778m69895j60141k01721m26407o2179l77579
2471.7G97233734m65622o20193l88108J12229r5368k29721j4953K25525L12881L69415
$$ y = [807288055, 806963043, 806970901, 807225342, 807468414, 807401733, 807822266, 808192215, 808096237, 807988510, 807748108, 807218475, 806465607, 806343155, 806121674, 805745697, 805492401, 805342178, 805621948, 805674896, 805838852, 805829697, 806000290, 806022644, 805481796, 805301971, 804900589, 804468613, 803937149, 803719406, 803640823, 803393860, 803608017, 803645706, 803764801, 803650513, 803486633, 803344421, 803073578, 803009109, 802554550, 802161636, 801705093, 801275711, 800950165, 800755463, 800837631, 800760956, 800710907, 800462341, 800569763, 800583267, 800165787, 800071793, 799982834, 799739456, 799207153, 798860855, 798760147, 798855133, 798824844, 798226624, 798023224, 798596878, 798931656, 798461761, 798301620, 798099899, 797673492, 797611313, 797233734, 796768112, 796147919, 795759811, 795872040, 795776672, 795546951, 795531998, 795757523, 796070404, 796439819]
2481.3G96439819L739k27738k83661k17208m61731q97065l38745l27987m19465K42539
2491G93512497N93643K36054k31324k68783m2267L42178k98462n87692k40250o24237
2500.6G92391357p61489k28196M01764J39694K24915L73306O485K56958K90680l14255
2510.3G92781219o73904j45721k23923m06876j67999j21536j05591n08423j84021J46484
2519.9G90389709J58234J1139L5172K23083o9809J07956o75583j026611m58145j72348
2529.6G88522797j01319n42068O8741K15149o257R8877L01209L10898l30735j32751
2539.2G88404541o21567q58307n17425l99475j40076m91867j81580n1193J40457M26026
2548.9G85709534J95465L5782j64795q2627o23169q85315q66851q36335l17764n4169
$$ y = [796439819, 796443558, 796215820, 795932159, 795714951, 795253220, 794356155, 794017410, 793689423, 793269958, 793512497, 794106140, 794342194, 794110870, 793842087, 793799820, 794141998, 793843536, 793255844, 793015594, 792391357, 791629868, 791401672, 791803436, 791943130, 792168045, 792541351, 792547836, 792804794, 793095474, 792781219, 792107315, 791961594, 791737671, 791330795, 791162796, 791041260, 790935669, 790427246, 790243225, 790389709, 790547943, 790559082, 790594254, 790817337, 790747528, 790855484, 790179901, 789153290, 788695145, 788522797, 788421478, 787879410, 787948151, 788163300, 788157043, 788255920, 788557129, 788868027, 788537292, 788404541, 787782974, 786924667, 786407242, 786007767, 785867691, 785375824, 785194244, 785143051, 785283508, 785709534, 785904999, 785940781, 785775986, 785693359, 785070190, 784184875, 783318024, 782481689, 782163925, 782109756]
2558.5G82109756J45798K02484L70179M31137L27377K7924k81754o88858q38394n53742
2568.1G81251907r98077o54221l09829k02942L78189K44980L71246N62210N03006j58691
2577.8G80987778m72412k72675p88345r82132r78012q06198j72806M82635J01547J11008
2587.4G77210388O90613J0452J31226L19748k21253l74298n97152q14820n91659k47574
2597.1G75515671m36630k67792k5101K38953O28280M57840J55106J15280J00708m99802
2606.7G75982513p76977p62482o57272r33228r67102J28861L44848L79715L95813K01416
2616.4G73336105k38342k73590L62854l77426q66013j257858j255035o96030l10059
2625G68424606K44217j56784P6447K24228K36511l891n19486j06887l52631n97305
$$ y = [782109756, 782255554, 782458038, 782828217, 783259354, 783586731, 783614655, 783332901, 782644043, 781805649, 781251907, 780253830, 779599609, 779289780, 779086838, 779465027, 779710007, 780081253, 780643463, 781146469, 780987778, 780515366, 780242691, 779454346, 778472214, 777494202, 776688004, 776515198, 776997833, 777099380, 777210388, 777901001, 777911453, 778042679, 778362427, 778141174, 777766876, 777169724, 776354904, 775763245, 775515671, 775079041, 774811249, 774786148, 775025101, 775653381, 776111221, 776266327, 776381607, 776482315, 775982513, 775205536, 774443054, 773785782, 772852554, 771885452, 772014313, 772359161, 772738876, 773134689, 773336105, 773097763, 772824173, 773187027, 772809601, 771943588, 770685730, 769430695, 768734665, 768424606, 768668823, 768512039, 768588486, 768812714, 769049225, 769045334, 768525848, 768418961, 768066330, 767469025]
2634.7G67469025j382752j169205m26788p57370k32010J02387M91180M84772K09656
2643.4G64788895l69263o66275j72043q21991j004333p83234p20139q71887n41229
2652G58838501j3733n7754M63638L05K33917N87006l83301q61740r55353o85272q48770
2662.6G56317444q00553r60693p52106J05057M69818O29120j83029M6158M76456j30539
2672.3G55217133m07258r50393j481705j203689l62015l80554l26539j52J78528L20587
2681.9G50603943J30081M45709K52228j44501o06460r71604q49914o31027m65088j037064
2691.6G46726303n84183j92031k45743M09698N02014N46265R7656n17502o36825q70819
2701.2G45234833j117172o43158k28653o93818p64999m15726L84446O49032K02713
$$ y = [767469025, 766086273, 764917068, 764490280, 763732910, 763500900, 763603287, 764094467, 764579239, 764788895, 764419632, 763753357, 763581314, 762759323, 761754990, 760971756, 760251617, 759379730, 758838501, 758824768, 758767014, 759230652, 759230957, 759464874, 760051880, 759668579, 758806839, 757851486, 757166214, 756317444, 755516891, 754556198, 753804092, 753909149, 754378967, 755008087, 754825058, 754871216, 755347672, 755217133, 754809875, 753859482, 752377777, 751174088, 750812073, 750431519, 750104980, 750104828, 750283356, 750603943, 750734024, 751179733, 751431961, 751287460, 750681000, 749709396, 748859482, 748228455, 747763367, 746726303, 746142120, 745950089, 745704346, 746114044, 746616058, 747162323, 747259979, 746742477, 746105652, 745234833, 744117661, 743474503, 743245850, 742552032, 741787033, 741371307, 741755753, 742404785, 742607498]
2709.9G42607498r2773k90299o6681l48968q58917j051941p85141q95844r90143j09939
2719.5G37116852J62277K51312r2010k84424N55115P08008j68763o90841o27213j157074
2729.2G35773239q40835n21164r03702l75519j8311L16620O62384L17994j74790P2174
2738.8G34308090k9373q18787j052169r63517k35519m883k80380l3188o714j50757
2748.5G30732803K69699L17841o25839l71475M0283j74179n53131r35898o26145p23190
2758.1G27350769k05841N9357K5100K00119q7051N24521M94385q2169m30679m60663
2767.8G27387848l92609o67114q73413r61990l7842J68609K62757K46048l07465K68173
2777.4G25093002j82647n24598k11944k73819l25852o34460q74252j093750l53089
$$ y = [742607498, 742514725, 742224426, 742157745, 741808777, 740949860, 739897919, 739112778, 738216934, 737226791, 737116852, 737279129, 737530441, 737438431, 737154007, 737709122, 738417130, 738248367, 737557526, 736930313, 735773239, 734932404, 734411240, 733507538, 733132019, 733113708, 733430328, 734092712, 734410706, 734235916, 734308090, 734278717, 733459930, 732407761, 731444244, 731208725, 731203842, 730923462, 730890274, 730883560, 730732803, 731002502, 731320343, 730694504, 730323029, 730363312, 730189133, 729636002, 728700104, 728073959, 727350769, 727144928, 727204285, 727229385, 727429504, 727342453, 727866974, 728361359, 728279190, 727848511, 727387848, 726995239, 726328125, 725454712, 724492722, 724454880, 724623489, 724886246, 725132294, 724824829, 725093002, 724910355, 724385757, 724173813, 723899994, 723574142, 722939682, 722065430, 720971680, 720618591]
2786.1G20618591N94559M23050m62952l31497J48773m16717o38581p31277n02930q48465
2795.7G17852554j171570m70047m65011o41251p15027m12750P4997J70136m99649p31583
2805.4G12990799k08359o64902n09109l89481q63495j107711j206742q60901p12738
2814G06467361j15051o2485m36935m62189p45086n87693n47943q49991j146926j180039
2823.7G00333023r83276o63300o30493q37326o71310n89295m58450o47354r32694r87854
2833.3F92931671q84323q53348j034240r32999j331787j355210j159591j209641j084900
2842F83085632j139297r70841j284484j306611j259918j462936j464081j820297j730652
2850.7F70646515j308670o96335j029587j446533r05685m89655m25644q26263l07694
$$ y = [720618591, 721213150, 721636200, 721173248, 720841751, 720990524, 720573807, 719935226, 719203949, 718701019, 717852554, 716680984, 716210937, 715745926, 715104675, 714389648, 713976898, 714051895, 714222031, 713722382, 712990799, 712782440, 712117538, 711608429, 711218948, 710355453, 709247742, 708041000, 707180099, 706467361, 706352310, 706289825, 705852890, 705390701, 704645615, 704057922, 703509979, 702659988, 701513062, 700333023, 699349747, 698686447, 698055954, 697218628, 696547318, 695958023, 695499573, 694852219, 693919525, 692931671, 692047348, 691194000, 690159760, 689226761, 687894974, 686539764, 685380173, 684170532, 683085632, 681946335, 680975494, 679691010, 678384399, 677124481, 675661545, 674197464, 672377167, 670646515, 669337845, 668641510, 667611923, 666165390, 665259705, 664770050, 664344406, 663518143, 663210449]
2859.4F63210449q19778j607666q39310q41904j002502j323166j296539j346894j860427
2868.1F52272263j458283j077270j021500j695557k066879j426163j435623k174682
2875.8F39916306k193032j558990j737023j929092j650810j499405j340447p32765
2883.5F27274742l76053j111984j147003o08101o43120o56204o20804o36902n02052
2892.2F20972519l93791l14179Q7700k36168o77643k56538k07825k94723j55564j38473
2901.8F18385315j96610k61917p63511j202278p97310m14505l73040p59658j130753
2910.5F12485733r73206p22885o23970j219749j626282j476707j734696j497841j489753
2919.2F01120644j672211q89893j437797j905098p05071l05633m95072m78706l07121
$$ y = [663210449, 662390671, 660783005, 659943695, 659101791, 658099289, 656776123, 655479584, 654132690, 652272263, 650813980, 649736710, 648715210, 647019653, 644952774, 643526611, 642090988, 639916306, 637723274, 636164284, 634427261, 632498169, 630847359, 629347954, 628007507, 627274742, 626898689, 625786705, 624639702, 624031601, 623388481, 622732277, 622111473, 621474571, 620972519, 620578728, 620264549, 620352249, 620116081, 619438438, 619181900, 618974075, 618679352, 618523788, 618385315, 618188705, 617926788, 617163277, 615960999, 615163689, 614749184, 614376144, 613616486, 612485733, 611512527, 610789642, 610165672, 608945923, 607319641, 605842934, 604108238, 602610397, 601120644, 599448433, 598558540, 597120743, 595215645, 594510574, 594204941, 593709869, 593231163, 592924042]
2927.8E92924042l70407m40140k03705J88904O31485M56352O06995R81064J196136
2936.5E95970726J384392J560173J786194J622429K063827K206421K109375J796226
2944.2F10499763J329232K048950J961174J722984J529236J512146K345352K386971
2952F25335808J986847J437607J688652J793251J742324K194367J936264J843491J743431
2960.6F41702042J617355J433182J561279J802368J662903J695709J285401R49020
2968.3F53709259J332626J856232J279526R00116J209488J053314P47070J025696K119522
2977F65232849J316223L96500R71603J434326J243897L6621P95670J423873R11484
2985.7F73763046J077271M83932M52576J026001R82208M70581P40204P68738J46942
$$ y = [592924042, 592553635, 592113495, 591909790, 592098694, 592730179, 593186531, 593793526, 594774590, 595970726, 597355118, 598915291, 600701485, 602323914, 604387741, 606594162, 608703537, 610499763, 611828995, 613877945, 615839119, 617562103, 619091339, 620603485, 622948837, 625335808, 627322655, 628760262, 630448914, 632242165, 633984489, 636178856, 638115120, 639958611, 641702042, 643319397, 644752579, 646313858, 648116226, 649779129, 651474838, 652760239, 653709259, 655041885, 656898117, 658177643, 659077759, 660287247, 661340561, 662087631, 663113327, 665232849, 666549072, 666945572, 667917175, 669351501, 670595398, 670632019, 671427689, 672851562, 673763046, 674840317, 675324249, 675776825, 676802826, 677785034, 678255615, 678995819, 679764557, 679911499]
2994.4F79911499J84402J84937K83890J6174K09351M65698K22092L16314R6054k37960
3004F81652451n53360k43149J61972L83301o943m43497j42822m65088m31824m84848
3013.7F79426193n24368o32935o32095K4490l07693m29993n04913p75604q91877n71136
3023.3F74180069l99246j038056j020050r43222l15704l54080m81186j88523j044769
3032F68395233p22961r62296j285476p21207p37457p63321q88672n05905n95551q40454
3041.6F60371933o78177p67822j098633j071930n55267q99582j253281r63440n41839
3050.3F52541962j007386j139679m66232j034393j175842o25153m51355q87604j278915
3059F44475403r60922p98722j024933j109695n79224q44345j012077q11577j173515
$$ y = [679911499, 680095901, 680280838, 680564728, 680580902, 680790253, 681255951, 681478043, 681794357, 681890411, 681652451, 681099091, 680855942, 681017914, 681401215, 681394272, 680950775, 680807953, 680342865, 679911041, 679426193, 678901825, 678268890, 677636795, 677661285, 677353592, 676923599, 676418686, 675643082, 674751205, 674180069, 673780823, 672742767, 671722717, 670779495, 670463791, 670109711, 669628525, 669440002, 668395233, 667672272, 666709976, 665424500, 664703293, 663965836, 663202515, 662313843, 661807938, 661212387, 660371933, 659693756, 658925934, 657827301, 656755371, 656200104, 655300522, 654047241, 653083801, 652541962, 651534576, 650394897, 649928665, 648894272, 647718430, 647093277, 646641922, 645754318, 644475403, 643514481, 642715759, 641690826, 640581131, 640001907, 639157562, 638145485, 637333908, 636160393]
3067.7F36160393q64907o99653r96704j196938p72514q42591j022949q45566j078224
3076.4F27840347q22105j354447j201515n44510q00819p26280q31490q59871j025047
3085F19674263o97174p65114j077728q85697j239357j279563j080361k97546o43120
3093.7F11708603j354675j018601j269188r08661m52613o21567j379242j202965o70586
3102.4F02830505j162185j086502j036301p17773o98624p58400n62325q71429r25369
3111.1E95011597j066399j003952p40700l89709j220741k101326j199265o19125n32456
3119.8E86137924n33981o37932j156616r47991n24520p91207r37347j517067j190148
3128.4E77901115r72251j115647r80263j029396q42056q04291p3852k23923p69196
$$ y = [636160393, 635295486, 634595833, 633599129, 632402191, 631629677, 630787086, 629764137, 628918571, 627840347, 627018242, 625663795, 624462280, 623917770, 623116951, 622390671, 621559181, 620699310, 619674263, 618977089, 618211975, 617134247, 616248550, 615009193, 613729630, 612649269, 612351723, 611708603, 610353928, 609335327, 608066139, 607157478, 606704865, 606083298, 604704056, 603501091, 602830505, 601668320, 600581818, 599545517, 598827744, 598129120, 597370720, 596808395, 595936966, 595011597, 593945198, 592941246, 592200546, 591810837, 590590096, 588488770, 587289505, 586670380, 586137924, 585603943, 584966011, 583809395, 582861404, 582336884, 581545677, 580608330, 579091263, 577901115, 576928864, 575813217, 574832954, 573803558, 572961502, 572157211, 572083359, 571859436, 571090240]
3137.1E71090240q04252j240959j208229j242485j194268j151619p78122q01200j051751
3145.8E61617355m63409l40080p20101j037407n64003p96432j115837p15790r79843
3154.5E54884453j113739j474991j428490p19871J46713k02942r16901o31561j261368
3163.1E47281303j140594p06139p15942o84929j098328j079902o38771l98064j141357
3171.8E39677277q04100o4888n21355j215363j089630k98729j122589r12666m41284
3180.5E33206673j038132q06847n41153n03540j394310r09919q5068n87044p65190
3189.2E26575470p79533l36800m75998q00209j045647j083908j026382q20503l23563
3197.9E19882927q68683n68085q3389k90680n23681o25077p44400r39445n14336j052284
$$ y = [571090240, 570285988, 569045029, 567836800, 566594315, 565400047, 564248428, 563470306, 562669106, 561617355, 561153946, 560813866, 560093765, 559056358, 558492355, 557695923, 556580086, 555864296, 554884453, 553770714, 552295723, 550867233, 550147362, 550294075, 550091133, 549174232, 548542671, 547281303, 546140709, 545434570, 544718628, 544033699, 542935371, 541855469, 541216698, 540818634, 539677277, 538873177, 538808289, 538286934, 537071571, 535981941, 535683212, 534560623, 533647957, 533206673, 532168541, 531361694, 530820541, 530317001, 528922691, 528012772, 527927704, 527340660, 526575470, 525795937, 525459137, 524983139, 524182930, 523137283, 522053375, 521026993, 520206490, 519882927, 519014244, 518446159, 518362770, 518072090, 517548409, 516923332, 516178932, 515239487, 514725151, 513672867]
3207.5E13672867q41637o22864r63554k08397n01137n57098o47507o06880j12114n33523
3217.2E08078156q10471q60939p06291o40602m25377n78041r95522r19609m76532J72195
3226.8E01836967j90620q43925p06940j45874m26903n36346o19240j230660l93905
3235.5D96742554m26560q75435n86013o58265k60200j89934m92782o5690L40081r24797
3245.1D92602959r93271r1019o51550q44574o36673j54572o09817p94449l22304k98614
3254.8D87206116J21727o52123o41098J45073m41818r16863n89065k93045m11949j72501
3264.4D83354454p4005l47595q09174j15204L32146m53110j56441n31501j023522q50906
3274D79325142m32091r155j93482l63082r51767m92859l71132n95360N00984O37131
$$ y = [513672867, 512831230, 512208366, 511244812, 511036415, 510535278, 509978180, 509330673, 508723793, 508611679, 508078156, 507267685, 506406746, 505700455, 505059853, 504634476, 504056435, 503060913, 502141304, 501664772, 501836967, 501646347, 500802422, 500095482, 499949608, 499522705, 498986359, 498367119, 497136459, 496742554, 496315994, 495440559, 494854546, 494196281, 493936081, 493746147, 493253365, 493187675, 493527756, 492602959, 491609688, 491518669, 490867119, 490022545, 489385872, 489231300, 488621483, 487827034, 487504730, 487206116, 487327843, 486675720, 486034622, 486179695, 485737877, 484821014, 484231949, 483938904, 483526955, 483354454, 483280449, 482932854, 482123680, 482008476, 482340622, 481887512, 481731071, 481199570, 480176048, 479325142, 478893051, 478883896, 478690414, 478327332, 477375565, 476882706, 476511574, 475916214, 476417198, 477054329]
3283.7D77054329j93367r15299l84063j26229q49304p31773l47710m2877j39465o13785
3293.3D72710457n19867J57738q6556n60760l80288m06265l99551n63965l79753k4643
3303D69546547l17574p44400l56140k08244o07300k61612k59094j09711k05040n89065
3312.6D65888367q93517j137085j98974m0780l46031q28666o93932K93655L3341k61421
3322.3D61814957l24974j6442m55703q48313p14569j145554o03904o08979m53338l02162
3331.9D56341019l17803R1744m55628l74374n50232n88646q8844m12178q42514q00667
3341.6D52001877j55144l17955q75244o16379K19879j10283r00802l76015k81525o40945
3351.2D47947464r72939p08084m01535o25610m38843l23067l20320p13348n54352n1689
$$ y = [477054329, 476860962, 475945663, 475561600, 475435371, 474586067, 473854294, 473506584, 473463707, 473324242, 472710457, 472190590, 472348328, 472261772, 471701012, 471320724, 470914459, 470514908, 469950943, 469571190, 469546547, 469228973, 468484573, 468128433, 467920189, 467312889, 467051277, 466792183, 466682472, 466477432, 465888367, 464994850, 463857765, 463658791, 463618011, 463271980, 462443314, 461749382, 462043037, 462076378, 461814957, 461489983, 461473541, 461017838, 460169525, 459454956, 458309402, 457705498, 457096519, 456643181, 456341019, 456023216, 456114960, 455659332, 455284958, 454734726, 454146080, 454057236, 453645058, 452802544, 452001877, 451846733, 451528778, 450653534, 450037155, 450257034, 450146751, 449245949, 448869934, 448588409, 447947464, 446974525, 446266441, 445864906, 445239296, 444800453, 444477386, 444157066, 443443718, 442889366, 442837677]
3360.8D42837677l61557m99611M2648j28364j189728n68657r2277r34639j337319r72366
3370.5D36795807k21863l96461l72696k50550j54380J53732l63884l07808j68877p21092
3380.1D33991928p40738m22783o34727n25665j89820m34074k11525j1978j7090J8997
3389.8D30822525Q3389p7133q68225q15926k17514j08108l62702p90329n21659K18467
3399.4D27362785L70217m42505m29039P63817L47633q28094l53814L8948m90150o33316
3409.1D25706482m23737n45959j22910N11895J06201j61743m74320l29132M25682M36287
3418.7D25128746J60828n69191m95224J29890N8975k81334Q088O57234l0442m69970
3428.3D24297600j52436L87116R1782l42980M21715M0855p0724J03569o790O4583J78031
$$ y = [442837677, 442476120, 441976509, 442019157, 441890793, 440701065, 440132408, 440040131, 439105492, 437768173, 436795807, 436573944, 436177483, 435804787, 435554237, 435399857, 435553589, 435189705, 434881897, 434713020, 433991928, 433251190, 432828407, 432193680, 431668015, 431478195, 431044121, 430832596, 430820618, 430803528, 430822525, 430905914, 430828781, 429960556, 429144630, 428927116, 428819008, 428456306, 427665977, 427144318, 427362785, 427733002, 427290497, 426861458, 427625275, 427972908, 427144814, 426791000, 426829948, 426339798, 425706482, 425282745, 424736786, 424613876, 425125771, 425231972, 425070229, 424595909, 424266777, 424692459, 425128746, 425289574, 424720383, 424225159, 424355049, 424414024, 424132690, 424140778, 424798012, 424767570, 424297600, 424145164, 424532280, 424624062, 424281082, 424702797, 424743652, 424672928, 424776497, 424769707, 424834290, 425012321]
3439D25012321k6359m20113Q89016N90209j0414J08223K6932Q54302q21801j67770
3448.6D26034546J034431L05405N22881K06222M04701K04926n989M47655Q63723Q03604
3458.2D30822105M13399N09186m25453j93520Q05931M59175P897M38804P74880K90527
3467.9D33902931N65262J86462N27153P35589J86538J181259M52004r30634j07002
3476.6D36699562P65343M94766M32243K06108L19138P62672M92859J636048O96602
3485.2D42505341m00010O85387L23830L25012N24979L51867J40953O88515P76634M45633
3494.9D46368141P61948l69148K11944J269608R32769Q08411N45578J49155j30844
3503.6D50547562O09893O13938J57013N47561J515007O29387j99585J336441P35245
$$ y = [425012321, 424985962, 424565849, 425454865, 426045074, 426034660, 426142883, 426169815, 427024117, 426202316, 426034546, 427068977, 427374382, 427897263, 428103485, 428508186, 428713112, 428707123, 429154778, 430018501, 430822105, 431235504, 431744690, 431319237, 431125717, 431931648, 432390823, 432398720, 432837524, 433612404, 433902931, 434468193, 434654655, 435181808, 435917397, 436103935, 437285194, 437737198, 436806564, 436699562, 437464905, 437959671, 438391914, 438598022, 438917160, 439679832, 440172691, 441808739, 442505341, 442105331, 442790718, 443114548, 443439560, 443964539, 444316406, 444457359, 445145874, 445922508, 446368141, 447130089, 446760941, 446972885, 448242493, 449175262, 449983673, 450529251, 450678406, 450547562, 451157455, 451771393, 451928406, 452475967, 453990974, 454620361, 454420776, 455757217, 456492462]
3512.2D56492462K66190J59416K70004R55391R79920J098823L50571L73497L41034
3520.9D61287308N50956N66216j27373R52339R02176Q62007Q48198K96936M8066Q21113
3530.6D67007942J097717P56913J393280P20291Q40607l70064p36504J563835J404419
3539.2D73678436J069069K64588R61876R18426Q38356O88973o67153J328888l43361
3547.9D78738098J085663K194443J406173J403313j574058J111602J237412J343307
3555.6D86945953J853257l79143J591606J229553K95258L86963J651573J218834N40924
3564.3D95334778L979606j09405r56421P23953m15191K980499J445656J195869J867600
3573E06046944J848793J091156R94873J401214M88739K391625Q83255o6033K237969
$$ y = [456492462, 456758652, 456918068, 457188072, 458143463, 459123383, 460222206, 460572777, 460946274, 461287308, 461838264, 462404480, 462277107, 463229446, 464131622, 464993629, 465841827, 466138763, 466186829, 467007942, 468105659, 468862572, 470255852, 470976143, 471816750, 471446686, 470710182, 472274017, 473678436, 474747505, 475012093, 475973969, 476892395, 477730751, 478419724, 477752571, 479081459, 478738098, 479823761, 482018204, 483424377, 484827690, 483253632, 484365234, 485602646, 486945953, 488799210, 488420067, 490011673, 491241226, 491536484, 491923447, 493575020, 494793854, 495334778, 499314384, 499204979, 498248558, 498972511, 498557320, 501537819, 502983475, 504179344, 506046944, 507895737, 508986893, 509981766, 511382980, 511871719, 514263344, 515146599, 515080566, 517318535]
3581.7E17318535K542267J259422K87170L537903R75189k408790J273384R8343L667068
3590.4E28550491L964119K946396J36833N8709L365631j351776J966857L343583L39355
3599E43320198K602844P11251Q39157K509918K062530K142754L309860K248268k084121
3607.7E57662659L002853j298447l23371Q227233L54615k637596L732414m35295M796447
3616.4E73081512M224816j122055J126938j447983J513748L977280K540931J962433
3624.1E85857620J972618J747551J996460N313988k905617r824753O330414N594101
3631.8E96082382N126991K09771j686592L357429L232842K211799K86217J003075J958122
3640.5F11782036J778793N71251J94550K721710M118690N356751k804108l430748N071526
$$ y = [517318535, 519860802, 521120224, 521407394, 524945297, 525920486, 523511696, 524785080, 524883423, 528550491, 532514610, 535461006, 535597839, 535656548, 539022179, 537670403, 539637260, 542980843, 543320198, 545923042, 546634293, 547473450, 549983368, 552045898, 554188652, 557498512, 559746780, 557662659, 560665512, 559367065, 559043694, 567270927, 567625542, 564987946, 568720360, 568285065, 573081512, 577306328, 576184273, 577311211, 575863228, 577376976, 581354256, 583895187, 585857620, 587830238, 589577789, 591574249, 596888237, 593982620, 584157867, 590488281, 596082382, 601209373, 601419144, 599732552, 603089981, 606322823, 608534622, 608820839, 609823914, 611782036, 613560829, 614132080, 614326630, 617048340, 621167030, 626523781, 623719673, 620288925, 625360451]
3649.2F25360451l333245l937378J804925P514839M768943L387146L319245r556885
3656.9F29328041L286438O276016J535149J373596J68915J696014N88913J454850J871871
3665.6F47579803K54670L996582J294555k359771P54242m627381L843231Q666230P736816
3674.3F67138977n778732k0167618P646408J0036087M697800l001175L27301L082046
3682F63981094J557160J795196O94199P9269L962250N458527j0555420k300720Q543243
3690.6F73214798o755219J252747O461792O45905J642837K11563n5313K095337J051407
3699.3F79765854K783508J788864p146606j300812N768433J466522L97339J273575
3707F84796677K823028L509522q515702L563614L494187j3956528O141129N652084
$$ y = [625360451, 622027206, 618089828, 619894753, 627409592, 632178535, 635565681, 638884926, 629328041, 632614479, 638890495, 640425644, 641799240, 641968155, 643664169, 644253082, 645707932, 647579803, 647834473, 651831055, 653125610, 650765839, 651520081, 646892700, 650735931, 659402161, 667138977, 661360245, 641192627, 648839035, 658875122, 663572922, 660571747, 660899048, 663981094, 665538254, 667333450, 668027649, 668106918, 672069168, 677527695, 666972275, 664671555, 673214798, 666459579, 667712326, 674174118, 674820023, 676462860, 676674423, 676619110, 678714447, 679765854, 682549362, 684338226, 677191620, 675890808, 681659241, 683125763, 683523102, 684796677, 687619705, 691129227, 682613525, 686177139, 689671326, 675714798, 681855927, 687508011]
3714.8F87508011J156311J208267K565613J029968m543152J077729O025924m928894
3722.5F91099777m896011O192932J444321o12793k347107K93350M328079J577072N282135
3731.2G02361755m025268p606278R478531j10702j0777359J977157M521485N42450
3738.9F96361771J966629L538971l110047L289719J0624389j6218109j3079300J2741700
3746.6F96115723P146377O900177o098327j1688843J1952209n325393n215378O222687
3754.3G00009232N001449K998352n417557L453598M849854r378357M30450N801468
3762G07748489J404572N40161K934647n026245l589097N341187M733124k043991r436112
3770.7G02606735L636856M274521O69785J147995n5771N48096J43356L111801p78885
$$ y = [687508011, 688664322, 689872589, 692438202, 693468170, 688925018, 690002747, 696028671, 691099777, 686203766, 692396698, 693841019, 693228226, 690881119, 691174469, 695502548, 697079620, 702361755, 698336487, 690730209, 700208740, 700098038, 689320679, 691297836, 695819321, 696361771, 698328400, 701867371, 698757324, 702047043, 712671432, 696453323, 683374023, 696115723, 703262100, 710162277, 704063950, 692375107, 704327316, 699001923, 693786545, 700009232, 705010681, 708009033, 702591476, 706045074, 710894928, 701516571, 701947021, 707748489, 709153061, 709693222, 712627869, 707601624, 704012527, 709353714, 714086838, 712042847, 702606735, 706243591, 710518112, 711187897, 712335892, 712280121, 712828217, 712971573, 716083374, 715304489]
3779.4G15304489q444290L926163K983093P14722K198410l024140j100311J394119
3787.1G13952255J649933J536026q29773n16815m97665R1171M67834K293244L975830
3795.8G22122040m843064n035247K923660M824142N426484q433381r109191N613708
3803.5G13489151L734360N150146M683151j3298721l799362O473923L195038J357116
3811.2G20984802P03964l0822J149063M828338m434661j3392487P430496O280823M249344
3819.9G27768860o13785j8213196M333802O336517K502594K900543L15628m705582
3827.6G20625381M76075K444687L115005R39407q942947M234161P382889p822418m50363
3836.3G22001877Q107986r553604m076309P492981o410294K170792Q181686l405914
$$ y = [715304489, 706860199, 710786362, 713769455, 714484177, 716682587, 713658447, 712558136, 713952255, 715602188, 717138214, 716308441, 715791626, 715293961, 715385132, 715852966, 718146210, 722122040, 717278976, 712243729, 715167389, 719991531, 725418015, 716984634, 707875443, 713489151, 717223511, 722373657, 727056808, 713758087, 709958725, 716432648, 719627686, 720984802, 721688766, 721657944, 722807007, 727635345, 723200684, 709808197, 717238693, 723519516, 727768860, 727155075, 708941879, 713275681, 719612198, 722114792, 725015335, 725330963, 720625381, 721101456, 723546143, 726661148, 727600555, 718657608, 722891769, 730274658, 722452240, 722001877, 730109863, 720556259, 716479950, 723972931, 717562637, 719733429, 727915115, 724509201]
3844G24509201k637482L372651J112365L34244K393112n63202J223069L411026r179535
3852.7G23975449N07736j4847260N056534J1851120j004333q06809K704239K389603
3860.4G29826279K216034n983124J44043O057663o427613m481277N350494O601105
3868.1G33303604N698547j1007690q403168N856324O865081J267395j1644897K837372
3875.8G24772568N153579O38657K197647K996445p141113n546875P552642J596985
3883.5G32220535J816178M200058j4132920K432175M827423L91007L221359k754135
3891.2G32221680q692398M242477M962463j490707J741486J588211K546615R33609
3898.9G38053436j0769195N813522K88391p020263N411071k409973o83441P86667J497650
$$ y = [724509201, 721871719, 725244370, 726356735, 726690979, 729084091, 728520889, 729743958, 733154984, 723975449, 724483185, 709635925, 714692459, 726543579, 725539246, 724732437, 727436676, 729826279, 732042313, 726059189, 726203232, 732260895, 725833282, 721352005, 726702499, 733303604, 739002151, 727994461, 719591293, 725447617, 732312698, 733580093, 721935196, 724772568, 729926147, 730564804, 732762451, 735758896, 728617783, 723070908, 730623550, 732220535, 734036713, 738236771, 724103851, 726536026, 731363449, 731754456, 734975815, 732221680, 723529282, 727771759, 732734222, 731243515, 732985001, 734573212, 737119827, 738053436, 727284241, 733097763, 733386154, 726365891, 731776962, 729366989, 728683548, 729470215, 730967865]
3907.6G30967865K977371J76544K43683o55441L64838N44204j117019J362152K657013
3916.3G37521210m104691l606415M880448l66822l703842L249741J738586J42365k561493
3925G33189087k511978K445526K316894J205292k101593q82263K437744k114029p50046
3933.7G33234634J875763Q4610N37949P38678n99060j121369l46374K217026J691055
3942.3G38312912m218597j805726J032792J990890J740570k620239J053543R23462
3950.1G36409607j793976K292404N8060j136322M53033M06418K21100p77435l54538
3958.7G35778351k77405J048813L05328j366653R09118J026612k04086n89829J4572
3967.4G36644821N87616o27746l42179J225739J16729n19485R33151O35224j18409
$$ y = [730967865, 733945236, 734121780, 734365463, 733710022, 734074860, 734619064, 733502045, 734864197, 737521210, 733416519, 729810104, 734690552, 734323730, 730619888, 733869629, 735608215, 735750580, 733189087, 730677109, 733122635, 735439529, 736644821, 734543228, 733660965, 736098709, 733984680, 733234634, 735110397, 735195007, 735732956, 736471634, 735872574, 734751205, 734404831, 736621857, 738312912, 734094315, 732288589, 733321381, 735312271, 737052841, 734432602, 735486145, 736409607, 734615631, 736908035, 736966095, 735829773, 736282806, 736689224, 736910324, 736132889, 735778351, 735500946, 736549759, 736855087, 735488434, 736397552, 737424164, 737220078, 736630249, 736644821, 737232437, 736604691, 736262512, 737488251, 737604980, 737085495, 738018646, 738653870, 738535461]
3976.1G38535461r0255J37024p6371o6146k60849r10187k36664N05218R52378n81589
3985.7G37908020j355438K21176Q67462J097946k94342J3123P79953n13840l40424
3994.4G38383636n24368n12924L81012O31485p5073k62223
4000.2G38021545
$$ y = [738535461, 738445206, 738582230, 738505859, 738439713, 738178864, 737268677, 737032013, 737537231, 738489609, 737908020, 736552582, 736773758, 737641220, 738739166, 738444824, 738457947, 739237900, 738724060, 738383636, 737859268, 737346344, 737727356, 738358841, 738283768, 738021545]
##END=$$ End of the data block
