##TITLE=$$ Begin of the data block
##JCAMP-DX=5.00 $$ ACD/SpecManager v 10.08
##SPECTROMETER/DATA SYSTEM=Varian
##DATE=20 Nov 2012 14:35:56
##DATA TYPE=INFRARED SPECTRUM
##DATA CLASS=XYDATA
##ORIGIN=
##OWNER=
##NPOINTS=3735
##FIRSTX=399.26403809
##LASTX=4000.35498047
##MAXX=4000.35498047
##MINX=399.26403809
##MAXY=81.62934875
##MINY=37.55320358
##XFACTOR=1.0000000000
##YFACTOR=0.000000100000000
##FIRSTY=64.25461578
##DELTAX=0.96440572
##XUNITS=1/CM
##YUNITS=TRANSMITTANCE
##XYDATA=(X++(Y..Y))
399.3 642546158 633183441 628697929 633551254 629442749 620020103 615998268 612814903 615181808
407 615181808 624688072 626518936 621264954 620864868 623885880 626761131 626248856 623413887 624782143
415.7 624782143 626928177 630105133 641046143 638667908 625485077 624387970 626261063 622761650
423.4 622761650 627564278 635082664 630471649 626941605 624962044 619065208 614241829 615018158 617518959
432.1 617518959 612824097 606538277 607705269 612940712 615074272 615157852 618910828 622525291 620199280
440.7 620199280 616771164 614159355 612105026 614063339 615494041 621147995 629111671 631076050
448.4 631076050 632245827 630922012 632763138 635143433 635025139 634542923 629496536 627832832 631731796
457.1 631731796 636275520 633800964 630092964 629302292 629545937 631802788 633745956 634964867 632515259
465.8 632515259 624526138 618900185 615942001 612934837 610009079 606721001 603571701 606486740
473.5 606486740 612131386 615247269 620218582 620670471 615141907 613341446 611825485 608768845 605539780
482.2 605539780 602869034 601745720 600601387 599758301 603482590 610809174 617475967 618969955 616162796
490.9 616162796 613078728 610648155 610801506 608221207 603159561 599605865 594435349 593685455 595356789
499.6 595356789 598731346 602612534 599669609 600548668 605447388 606663780 601707916 593497047 589438362
508.2 589438362 588940964 586851463 581696815 581893158 583004951 582970848 586049156 588397942 588025436
516.9 588025436 583886642 581034927 576098633 570687943 569449310 567131004 565006676 565672493 567084045
525.6 567084045 567845535 571141396 574199867 573552055 571662216 571655235 572069206 571768570 572065201 568862190
535.2 568862190 564856148 564687500 565662003 568579483 574039421 581201248 587640610 591085167 592598000
543.9 592598000 595472755 595577087 592314339 590182190 588049126 585858841 583432426 582682838 584377861
552.6 584377861 586685715 588713760 589809608 590690765 589741592 587383041 582663536 576747780 574148788
561.3 574148788 570426483 565949860 564079590 562823486 561452065 562688217 564616508 564584427 563053398
570 563053398 559381638 557186890 553731384 550247917 548309937 544421730 543122292 542996674 546071434
578.6 546071434 550014534 553817329 559812508 565108185 570816193 573623810 575803757 577544212
586.4 577544212 576934090 575175629 573848038 573935204 573367157 575611420 580625076 584527702 585513420
595 585513420 587730255 591521492 590733032 589210129 587070312 583488846 580616188 577144852 574491234
603.7 574491234 573743134 576185493 580588951 584061508 586645927 589850121 590921402 591084938 590983543
612.4 590983543 587758179 584893150 582200890 579903069 579736366 581953201 585180359 588556671 595128593
621.1 595128593 600229797 603198357 604754601 605193024 606086388 605138855 603806953 601867218 599878387
629.8 599878387 600188370 602853050 606448975 609460449 612338142 615101280 619249115 621971207 620733414
638.4 620733414 618861275 617065811 614043846 611221313 609735260 608616142 609246674 611481247 614714966
647.1 614714966 619005737 622287483 625221214 626753349 626025276 624470749 623062363 620604210 617210045
655.8 617210045 615208359 613849220 613734894 616420631 621026039 625177345 628919296 632674370 633587952
664.5 633587952 633109398 632769089 630264626 616945801 616422882 618135529 619120293 621471863 624092941
673.2 624092941 628525352 633861465 637112923 639141617 640155182 639922256 637698593 634701157 631283531
681.8 631283531 628081284 627062111 626048050 626778107 631137657 636219597 640517883 644366302 647356491
690.5 647356491 647804565 644971695 641171265 638104324 634537544 630425415 627657928 626878090 627350960
699.2 627350960 628569031 631041145 634059753 636019363 635683670 634532661 632170868 627769814 624240112
707.9 624240112 621173477 618334465 617400208 618754082 621830711 625607147 630938034 636450996 640098495
716.6 640098495 643016357 645523148 645793152 644049454 641777496 640118942 639979935 641137238 643809433
725.2 643809433 648462067 654515381 660473022 665491867 669513702 672266464 673115005 671428375 668972321
733.9 668972321 666326141 663593597 662149582 662375641 664476013 667448196 670954819 674821854 678227997
742.6 678227997 681227188 682216721 679996567 676142349 671407700 665977478 661102142 658288879 657137756
751.3 657137756 656916809 658011017 659691925 661347961 663220901 663823547 662225571 658844147 654615173
760 654615173 650494003 645339432 640826416 638944740 638082771 639242325 642033081 645789413 650527191
768.6 650527191 655377350 659619141 662105484 663253784 662954712 661929779 661738281 662063599 663425369
777.3 663425369 666281204 671157303 676952362 682041779 687558289 693663864 698465118 700067673
785 700067673 699849625 699009018 696748123 694678040 692191620 690728226 692901840 697646027 701754761
793.7 701754761 705434723 711568604 716274490 719037857 720565567 719154739 717389984 715531387
801.4 715531387 713993835 711648788 709997711 711568985 714606247 718776474 723663483 728614044
809.1 728614044 731965866 732992096 731981354 730507050 728757095 724904861 720574493 717380600
816.9 717380600 717139206 719065247 720667343 722392349 725726166 729734497 731669540 732038040 730942078
825.5 730942078 727990112 723397064 718705521 714543915 710596008 708263931 707642365 708685837 709954529
834.2 709954529 711513290 713282166 713135071 711387634 708378830 705017395 700722580 696323624 692615509
842.9 692615509 688638763 685862274 685493317 687529373 689701767 690510941 691253510 691692047 691260529
851.6 691260529 689522781 686181717 681766891 677120514 673302612 670415115 667885437 666906128 667211609
860.3 667211609 668933182 671926270 675209503 679374161 682891922 685953827 688813705 690118103
868 690118103 691383362 692833328 695800247 699849243 703826828 708426208 713528595 719709778 723581085
876.7 723581085 725674057 727485199 727390823 725750961 722360306 718741531 715283508 712875900 711266327
885.3 711266327 709904633 708923111 708433609 708857574 708511353 707921753 706178055 702952118 699482727
894 699482727 695203018 690663681 687126236 685132065 683034668 681745529 681721039 681636200 681970978
902.7 681970978 681631317 680629654 678831635 675102234 670712814 667331238 663508987 658105621 653258209
911.4 653258209 649555969 646353531 643845139 641166000 638358231 635984421 633457489 631036377
919.1 631036377 627819519 623949890 620782967 617750854 614589691 612191505 611721458 611795006 611770821
927.8 611770821 612795105 614507523 616567612 618794975 620045319 620343285 619941444 619339790 619804230
936.4 619804230 619867172 619816628 621637840 624160690 626430893 629477654 633422012 636280594 638189468
945.1 638189468 638333321 636099358 634116478 631445389 626657257 621303062 616350708 611972504 607709961
953.8 607709961 603486328 598939056 594541779 589546738 583938942 578524170 571822510 564071655
961.5 564071655 555701904 547756195 540322189 532885208 525322380 518007011 511151962 504248352
969.2 504248352 498221169 490585823 482179489 473617706 464792976 456537209 447920380 440041580
976.9 440041580 431168976 423694038 416942368 410764198 405965118 400673485 396866531 393216133
984.7 393216133 391023941 387995567 385372391 383227272 380587616 380042648 378044281 377325745 376193962
993.3 376193962 375532036 376365509 377220078 378675003 378318748 379535561 379953728 380609856 381725807
1002 381725807 381810455 382075005 381069107 380783653 379739113 379899864 380124245 380456619 380515022 379112473
1011.7 379112473 379868011 379681320 379729958 379199409 379489250 379821625 379021072 380066948 379970665 380912094
1021.3 380912094 381713715 383713455 385529785 387214737 390453262 391239090 392969856 394400291 396756935
1030 396756935 398216476 398426971 399701920 400234528 402267532 403198700 404922447 406204224 406908836
1038.7 406908836 407879601 407956467 408707161 408146362 409030647 408891144 408586540 408542328 408476677 410170479
1048.3 410170479 410524025 411985703 412956276 415092621 417128792 419704590 423730164 425571709 428475800
1057 428475800 431173706 435374146 438592949 441345329 444615974 447549744 453628235 459241829 465266037
1065.7 465266037 469314156 472348289 474939651 474437943 472093849 466493034 460956993 454258041
1073.4 454258041 447936707 443595314 440469704 438710251 436293335 436210518 436303558 438321762 439537888
1082.1 439537888 439680748 441261787 441990471 444028778 445023079 446695976 448387108 451031532 454127731
1090.7 454127731 456287270 460139580 463335838 467213745 469681129 472388077 475356560 476378632
1098.5 476378632 476567535 475528831 475492821 475034904 475740776 475747452 475181503 476464882 478277473 480996666
1108.1 480996666 482169342 484392395 486057701 487441330 489135208 489257011 490307350 491304550 493289871
1116.8 493289871 494833717 496710320 498599815 500347328 502463646 502990723 504889336 505448112 505386543
1125.5 505386543 505974159 506809311 508374367 508990250 510677872 512343636 514656296 516873894 519025650
1134.1 519025650 521501350 522472610 522905273 522165680 520770988 517876129 514328117 510593948 506607018
1142.8 506607018 502476654 498503227 497131042 493392525 489408646 487212791 485621796 484714966
1150.5 484714966 482231483 481250038 479253235 477004433 475199203 474025688 474059143 473190765 474018288
1159.2 474018288 475105438 476900978 478309593 480831108 483978996 486065445 489636917 492228012
1166.9 492228012 495482750 498866615 502753868 506637001 510175323 515220222 520184746 526493454
1174.6 526493454 533540344 541145020 547695236 553573341 558981514 563652992 568953133 572823944
1182.4 572823944 577005920 581133995 584887085 588996887 592935371 597443542 601682358 606247368
1190.1 606247368 610755844 614441872 616524582 617101288 616883354 616296005 616309471 616140671 616366730
1198.8 616366730 616839561 617041016 618111572 620173378 622765961 624950294 627019539 628490219 629235992
1207.4 629235992 629268799 628609314 628188248 628173141 629417763 631163254 633164177 636123199 639411049
1216.1 639411049 642500153 645025635 647363739 649158783 649536362 648999252 648322830 647202759 645569305
1224.8 645569305 644310150 643943558 644527283 645395279 646110611 647027664 648133011 648802338 648108521
1233.5 648108521 646589584 644792023 642558212 640356216 638217583 636707573 636100159 636354141 636993637
1242.2 636993637 638144951 640124588 641620941 642710648 643623810 643455124 642594757 641756973 640930939
1250.8 640930939 640232773 640251617 640594635 641386795 643417435 645969315 648280792 650332031 651791077
1259.5 651791077 652474747 652223206 651083603 649153595 647679367 647024384 646836700 647508011 648939285
1268.2 648939285 650870667 653519592 656140289 657943268 659452133 660297775 659837036 658643570 656746674
1276.9 656746674 654997330 653572159 652832870 652698212 652789001 653776779 655203552 656654739 657985382
1285.5 657985382 659120941 658963623 657181320 655377579 653370056 651320572 649461136 648066864
1293.3 648066864 647443161 647681198 648450470 649631119 651185608 651927261 651858749 650585709 648441696
1301.9 648441696 646685715 644604187 641963959 639631386 638332939 637500572 637190742 637469406 638439713
1310.6 638439713 640131683 640935669 641230545 641338501 640087662 637874680 635267982 632897644 630754089
1319.3 630754089 629490242 629364510 629444008 629937897 630999184 631739655 631325150 630086899 628539772
1328 628539772 625918808 622041359 618135452 614697952 611832314 609640694 608683052 608157196 607963829
1336.7 607963829 608309898 608852005 608892326 609145813 610165939 609900284 608676682 606963692 605315247
1345.3 605315247 604415092 604035454 604218063 604869041 606475220 608103905 609481049 610568771 611094322
1354 611094322 610506554 609181061 607961311 605883827 603984451 602668152 601004791 600067253 599703255
1362.7 599703255 600911484 603295784 605186234 605866432 606579475 606297379 604733391 603768730 602199745
1371.4 602199745 601102219 599886436 599362106 599931908 601043510 602963791 604731789 607160721 608648148
1380.1 608648148 609730377 610249405 609693375 609124298 608521194 608745232 608690605 609378853 611618919
1388.7 611618919 614232521 616867867 619425201 622077103 623095360 622634811 621864510 622044792 621174431
1397.4 621174431 619056473 615757027 614584999 614962234 614377975 614803696 615355148 614908447 615587311
1406.1 615587311 616771469 617313309 616281090 614687920 612133904 609354858 607229271 606098442
1413.8 606098442 605497513 604583015 604284210 604809151 605672989 604609261 606747093 609420166 609740105
1422.5 609740105 608909225 606144753 605798302 605457954 604287491 604588814 603963394 604566956 606919060
1431.2 606919060 609806404 611531715 612987747 615174408 615557327 612914734 612197342 613726578 613232765
1439.8 613232765 612710266 613545952 614020157 615476952 616568298 618589363 620083122 620564499 619829674
1448.5 619829674 620016441 620814781 619084358 617057228 614950867 614374313 613699341 612320518 610065384
1457.2 610065384 606989784 611332436 613207397 616081123 617451668 618165054 619613724 616938934
1464.9 616938934 616956062 617181587 618896561 620470200 622933350 626332283 627505760 630515099 634681931
1473.6 634681931 642897568 647253876 650194321 652798233 655140076 657471466 658081970 659534149
1481.3 659534149 660796661 663900604 667260132 670518799 674189072 675797653 679078217 680621948
1489 680621948 681223450 682088776 684597855 686907578 687421494 688651123 687983246 686541519 688949432
1497.7 688949432 691538162 695054016 698455963 701108627 702173920 704776840 706271286 706648712
1505.4 706648712 699099197 692077255 697253189 698829727 701803970 704455185 706506805 708320007
1513.1 708320007 711111069 712702255 712862091 712559891 709403915 713592453 715553436 711584244 706321793
1521.8 706321793 706342087 711312714 713459015 714500275 715500946 717484512 719060898 721101608 723358841
1530.5 723358841 722324829 721671219 717899551 713968048 716384659 717227020 718557281 720104523 719577789
1539.2 719577789 710860825 716783600 719563446 718337173 721883163 722025757 719897995 720484619 720737457
1547.9 720737457 720366287 717418365 716104355 718254700 719462891 719698029 718051758 719414902 723463669
1556.5 723463669 724795456 709122467 698716278 704968033 711664734 713463745 713887634 714546280
1564.2 714546280 713544312 714170914 715563812 716809387 715846786 710803757 713921661 715796509 714895020
1572.9 714895020 713460464 713403397 712669754 705395203 707403793 709659805 710622406 711216278 711699142
1581.6 711699142 712475739 712468491 711875992 710537872 709183044 708092346 706498337 705106125 703658905
1590.3 703658905 703049850 702492523 702573776 702607651 701942520 702220306 702178650 701584854 700279770 699008942
1599.9 699008942 697038727 694758148 692938843 690797729 689888535 688781967 688117828 687694244 687977982
1608.6 687977982 687400055 685978622 685804138 683753891 682169037 680155640 679034576 676980972 667565384
1617.3 667565384 669498901 670302353 670513458 670006714 670130615 668640671 664763336 666531830 667022552
1626 667022552 666864319 662922897 660062943 660378418 659291382 658303909 657174225 658231964 659110794
1634.6 659110794 653658295 653655624 655838547 657209244 658467255 658873215 657751770 657695236 656814499
1643.3 656814499 657131882 658002548 655043716 654034729 656189957 660820999 663986053 667499847 672311478
1652 672311478 673902283 659349060 663867187 667804871 669775925 671179810 672601700 674195862
1659.7 674195862 675599670 677274017 678061371 679833298 683875046 686776047 689129791 691090393
1667.4 691090393 692798386 690273590 690191574 692782135 693081131 695810318 699280014 699485626 699891205
1676.1 699891205 704840164 708592224 710459137 711807404 711975555 714240036 716808243 716165161 711650848
1684.8 711650848 714615555 719207458 721942444 723237076 725652924 728025665 730687714 732955933
1692.5 732955933 733856354 736413422 738070602 730171204 731574326 734479675 737665558 734591599
1700.2 734591599 731253586 738142319 742180786 743689957 744004593 744601135 744165802 746222687 748398132
1708.9 748398132 748488998 747477341 747441711 747904510 747876282 746575546 746431503 749990768 750645370 745030746
1718.5 745030746 750177536 753828812 755075226 754935074 753893890 753302689 753896637 753904190 753961334
1727.2 753961334 755318375 756465454 755878754 756465073 759881973 762614517 758493881 753965683 758128738
1735.9 758128738 761227112 761372147 761887054 759979172 758850250 762389374 763450699 763071747 764443741
1744.6 764443741 766933365 768310699 768542709 768978729 768524551 770826797 769250031 767769928 771046371
1753.3 771046371 772700958 774274216 775411072 774437332 776112213 778778458 780853195 782956619
1761 782956619 781246719 780126648 781844864 782245712 782417297 782743530 782623215 781057739 783153076
1769.7 783153076 785833206 784693985 783075790 784005356 787861481 789291000 788032990 789318924
1777.4 789318924 789257278 788946152 787834549 786336365 787545013 789192047 790002670 789341583 790386353
1786 790386353 792196884 793136520 793613968 794161530 793684006 792569275 790056000 789661560 791870804
1794.7 791870804 791768951 791750870 793593597 794835968 794693832 794443893 796277008 796180420 796429062
1803.4 796429062 797356720 796847687 796480942 795698624 795212173 795546265 795513153 794432297 795501633
1812.1 795501633 797528000 798738785 799986572 800546570 801128769 800313416 799435806 799144135 798337936
1820.8 798337936 798538895 798167572 798627014 798703003 797148590 798767548 801218948 803169327 801957016
1829.4 801957016 798461456 800255432 802018356 801634521 800996475 800492477 799932022 798782349 798528900
1838.1 798528900 800338287 801815872 803031235 803348312 804043045 803741608 799371567 801247482 802444534
1846.8 802444534 801489944 800987320 801005478 800833664 800591812 801658630 802446213 803527451 804596786
1855.5 804596786 805150146 805566330 805288086 804973831 803650970 802535477 801941376 801744080 801632919
1864.2 801632919 801600418 802312393 802538147 803419800 803101959 802848969 804464417 805609131 805833282
1872.8 805833282 804807129 803908463 802937241 802299652 802073822 802414474 803329163 804055634 805203629
1881.5 805203629 805797806 806813202 807426071 807268219 807086029 805850525 805202866 803430557 801230087
1890.2 801230087 802043839 803452454 804515152 805386047 805755692 806334152 808107376 808527451 808445282
1898.9 808445282 808114624 806988373 806077042 804632111 804050369 803817749 803849869 804331589 804973907
1907.6 804973907 806120453 807051544 807785950 808226700 809080505 808523712 807027283 805794067 805007706
1916.2 805007706 805018005 802710571 802645187 804722519 806181259 807211838 807219009 807925415 808741379 808901367
1925.9 808901367 808553391 807866516 806626892 805219803 804414520 803901215 804017029 804297562 805293808
1934.6 805293808 806682816 808032303 809208450 809344482 809200058 808450317 807752762 805400467 802503815
1943.2 802503815 803245697 803475876 803423233 804585342 806148300 807461395 808306732 809051819 809775772
1951.9 809775772 810060120 809558105 808428955 806900864 805820618 805136185 804859390 804927673 805270767
1960.6 805270767 806523743 807743530 808981705 809949951 810425568 810241394 808933868 808048782 807234421
1969.3 807234421 805992126 804897385 804600220 804881363 805203247 806284332 807945709 809428787 810248642
1978 810248642 811019669 811196136 810070953 808545380 807397003 806651382 805570679 804950714 805261917
1986.6 805261917 806066284 806901016 807773972 809398346 810368729 810072479 809918365 809816360 808932037
1995.3 808932037 807520142 806374054 805472031 804888458 805146942 805918808 806513214 807596893 808946762
2004 808946762 810043335 810875854 810657043 809717331 808263855 806867065 805677490 804663086 804315033
2012.7 804315033 804413147 805057602 805951309 806927795 807746353 808543243 808938446 808705368 808181839 806912689
2022.3 806912689 805872040 804575958 803451004 802903671 802634583 803374023 803992615 804968796 806266403
2031 806266403 807277222 807743149 807375412 807063751 805933838 804125824 802488174 801712952 801634598
2039.7 801634598 801598129 801919632 802722473 803931351 804724503 805574188 806004105 805643921 805143967 803890686
2049.3 803890686 802623825 801388321 800553513 800390472 800717316 801309891 802001724 803126221 804010925
2058 804010925 804986725 805488663 805470352 805040665 803721542 802505112 801238022 800633926 800550613 800814285
2067.6 800814285 801594467 802303391 803361664 804203339 804866714 805419235 805605774 805200195 804269333
2076.3 804269333 803093567 801687317 800752869 800366516 800712051 801426697 802327957 803358612 804374466
2085 804374466 805415344 805464935 805115128 804706879 804217377 803488312 802380676 801522980 800873871 801087875
2094.6 801087875 801771088 802591629 803732986 804824982 805681839 806109924 806330109 805807800 804848175
2103.3 804848175 803861313 802918701 802217789 801862106 801780319 801975250 803190384 804358292 805164337
2112 805164337 805810623 806152878 806362305 805801239 805102158 804253387 803493042 802706451 802119064 802264252
2121.6 802264252 802563324 803550720 804274826 804948425 805918655 806478729 806931915 806560745 805607300 804544220
2131.3 804544220 803662949 803004150 802617874 802388992 802404709 802962799 803539047 804663467 805557175 806067047
2140.9 806067047 806535416 806297760 805774307 804669266 803575516 802976532 802630844 802528610 802670898
2149.6 802670898 803084869 803831635 804918594 805744095 806525192 806872253 806645355 805892410 804839859
2158.3 804839859 804225082 803449020 802969131 802850952 803166046 803804626 804413147 805416031 806466064
2167 806466064 807382507 807501450 807266464 806645050 805886688 805556259 804887772 804607162 804347229 804604568
2176.6 804604568 805518265 806544952 807833633 808230057 808456268 808903656 809163437 808848343 808165665
2185.3 808165665 807299347 806142807 805899582 806142349 806634445 807263489 807965698 808838120 809342499
2194 809342499 810056152 810785599 810795822 810043945 809459915 808679504 807636719 807288513 807343445 807934799
2203.6 807934799 808436890 809092636 810212250 811279526 812175827 812418442 812146072 811448441 810971451
2212.3 810971451 810506058 809788971 808958511 808445740 809123306 809887466 810550461 811522598 812612152
2221 812612152 813293839 813528900 813693466 813020172 812200928 811618042 810866547 810203705 810031967 810109406
2230.6 810109406 810487289 811512909 812184372 812959366 813907471 814393616 814603958 814188919 813257751
2239.3 813257751 812233353 811594162 810889511 810307999 810411530 811133041 811952820 812559128 813550644
2248 813550644 814404373 814851379 814695663 814226761 813703537 812836990 812112732 811415863 811131363 811108017
2257.6 811108017 811619949 812087326 812418900 813778000 814572067 814856033 815024414 814718475 813921204
2266.3 813921204 812973938 812489471 811785278 811416397 811446533 811989822 812733917 813387527 814234543 814757538
2275.9 814757538 815476227 815791397 815443878 814627304 813994827 813459549 812360001 811826859 811689606
2284.6 811689606 812262726 813003616 813932800 815038376 815630264 816293488 816079407 815698166 814710693
2293.3 814710693 813121490 812189026 811632843 811576233 811119843 811298676 812003098 813066254 813775482
2302 813775482 813810806 814508362 814305649 814067688 813185730 811445999 810479736 809972229 810133438 809453659
2311.6 809453659 809503479 810258484 810842896 811600647 811774673 812336502 812186661 811202927 809792328 808557587
2321.3 808557587 808149643 807287292 806244278 806037216 807279510 807889481 808273163 808505325 808185959
2329.9 808185959 808864975 808835068 807468338 806309128 806456833 805883789 804955750 804865570 804103622 803956985
2339.6 803956985 804274902 804714737 805827408 806816254 806519928 806453476 806510696 806172867 806571960 806503143
2349.2 806503143 805886459 805011978 804472351 804355164 803871841 803736649 803634033 803377151 802837143 803622742
2358.9 803622742 803906326 802958221 802167892 801045151 801443710 801122665 800972366 801114731 801429901
2367.6 801429901 803056107 803802719 804718170 806349640 807357635 805975113 805365219 806776505 806575394
2376.2 806575394 805924683 806255798 806841812 807293625 808277130 809678345 810586853 811123810 811644669
2384.9 811644669 812048340 811881638 811477966 810644226 809696579 809098206 808845062 809277878 809580307 809850388
2394.6 809850388 810180740 810493011 810877609 811067810 810975571 810342560 809871216 809485550 809206161 808774490
2404.2 808774490 807966843 807825775 808294067 808883133 808949814 808990097 808972473 808724747 808959427 809021149
2413.8 809021149 808655701 807986984 807577820 807272568 806663284 806189346 806254730 806926193 807382736 807538910
2423.5 807538910 807346039 807160950 806868286 806463165 806564941 806334839 805819702 805064850 804483032 804228516
2433.1 804228516 804262238 804683838 804539108 804533997 804517593 804523468 804752121 804333725 803871918 803551025 803180313
2443.7 803180313 802473145 801945801 801944885 801849213 801691284 801563950 801635284 801778564 801830978 801627731 801391754
2454.3 801391754 801266174 801166534 800967865 800331039 799996948 800136261 800142365 799799881 799463043 799370575
2464 799370575 799677658 800010452 799640427 799523163 799248276 798648148 798506012 798374863 798123093 797255478
2473.6 797255478 796527481 796564789 796895905 797186127 797071991 796961899 797111969 797406464 797414246 797090683
2483.3 797090683 796697083 796497192 796161194 795623169 795369110 794944916 794610901 794567947 795032349 795409241
2492.9 795409241 795380020 795492325 795182495 795265961 795083389 794528885 794332962 793560867 793283691 793480988
2502.6 793480988 793204269 792863693 792997742 793190765 793208923 793466415 793790207 793912201 793448257 793190536
2512.2 793190536 792774734 792218781 792286530 792087250 791957779 791605988 791245422 791368713 791589966 791850128
2521.9 791850128 791967010 792005081 791552963 791312485 790918579 790192261 790049515 789774475 789549332 789442139
2531.5 789442139 789442978 789543228 789579849 789724884 789893570 790039749 789990234 789830704 788973007 787924576
2541.1 787924576 787369995 787029953 786804504 786348114 786353912 786694717 786844025 786920624 787091675 787259674
2550.8 787259674 786891785 786642227 786520996 785782623 784644394 783900452 783570557 783375778 783484573
2559.5 783484573 783513260 783619766 784163818 784864731 785194702 784978333 784226074 783440704 782881393 782004013
2569.1 782004013 781372375 780837860 780520325 780727921 780952682 781455917 781755905 781784515 781639023 781511841
2578.7 781511841 781417084 780842590 780066452 779116898 778383713 778093185 778271179 778459702 778629684 779340134
2588.4 779340134 779670334 779717484 779980774 779871292 779135971 778419571 777780228 777013779 776580200 776311951
2598 776311951 776301346 776325073 776405640 776702881 776913147 777104492 777080002 776943817 776554565 776144714 775724030
2608.6 775724030 774989471 774272766 773787308 773617935 773622894 774016418 774603348 775165253 775008240 774517212
2618.3 774517212 774396744 773774261 773316650 772430954 771248093 770522385 769846039 769756241 769715958 770020447
2627.9 770020447 770406876 770466309 770106354 769609604 769745789 769274063 768384247 767213821 766264725 765797272
2637.6 765797272 765266037 765324402 765169983 765034714 765356827 766079178 766426315 765844803 765135651 763969803
2647.2 763969803 763077011 762459412 761589890 760657349 760212708 760198288 759790421 760046158 760422134 760620117
2656.9 760620117 761123428 760952072 760141373 759300919 758504639 757399063 756739349 756121674 755220261
2665.5 755220261 755081177 755383377 755790634 756031189 756149368 756099472 755897980 755567780 755082626 754523392
2675.2 754523392 753590851 753017044 752524567 751788406 751431274 751436081 751842270 752298584 752434540 752529373
2684.8 752529373 752629242 751927261 750898743 750003433 749197311 748824310 748140564 747497482 747501526 747984238
2694.5 747984238 748188095 748105927 748554916 748569183 747920685 747114487 746495514 745842896 744920959 744498978
2704.1 744498978 744239807 743521957 742789993 742982559 743574905 743730240 743439102 743113480 743354797 743168488
2713.8 743168488 742089157 740812531 739982681 739375076 738715820 738491287 738560028 738785400 738810959 738946228
2723.4 738946228 739304199 739524002 739456863 738790588 737933273 736750488 735935287 735570450 735145416 735212326
2733 735212326 735154877 734979401 735115433 735522842 735923767 736042175 735688629 734759827 733937378 733430939
2742.7 733430939 733169937 732936707 732791672 732724991 732413864 732115707 732322464 732808304 732571487 732254486
2752.3 732254486 732119370 731658096 731181259 730507889 729419937 728356705 728289108 728539276 728708038
2761 728708038 729098892 729303513 729652786 729981766 729917145 729454269 729116211 728610229 727870560 727101669
2770.7 727101669 726313400 726265869 725794525 725680389 726092453 725841675 726109619 726215820 726306076 726339264
2780.3 726339264 725899048 725346985 724052582 722975922 722699814 722564774 722370605 722585068 722753296
2789 722753296 722397003 722023468 721633682 721198654 720681610 720325165 719662704 718984680 718425598 717378845
2798.6 717378845 716435547 715453415 715159073 715526733 715633774 715485077 715048599 714573212 713814774 713263092
2808.3 713263092 712723923 711794815 710748367 709574814 708734894 708247833 708023071 707438812 706999817
2816.9 706999817 707104874 706531982 705568390 704658051 703660355 702699966 701899033 701070786 700323181 699748306
2826.6 699748306 699078674 698342514 697508316 696783981 696006317 695164948 694207382 693194809 692337952
2835.3 692337952 691100616 689764709 688699112 687845001 686731262 685501328 684371948 683058624
2843 683058624 681911163 680730438 679873810 678669586 677087555 675850220 673855438 672044296 670865784
2851.7 670865784 669808044 668830261 667535324 666438751 666128998 666227798 665938568 665562210 664470825
2860.3 664470825 662902679 661959076 661002731 659613724 657604141 656086578 655128479 653997726 652811279
2869 652811279 651264496 649797058 648279037 646925278 645278473 642758331 640525208 638760033 637333641
2877.7 637333641 635820045 633912582 632065506 630535011 629436607 628798981 628224602 627394028 626819153
2886.4 626819153 626014977 624866829 624026451 623306732 622754593 622054863 621148300 620821609 621364632
2895.1 621364632 621720581 621073189 620274963 620002213 619765053 619397392 619293709 619058495 618465157 617625885
2904.7 617625885 617155914 616958313 615872269 614991226 614643669 613983803 613359184 612616234 611782379
2913.4 611782379 610690384 609099731 607300987 605321236 603525772 601768341 600078850 599349403
2921.1 599349403 598390045 596921005 596209068 595383263 594690475 594209633 593713455 593822708 593722839 593557663
2930.7 593557663 593620720 593994217 594522324 595020180 596116409 597227135 598275528 600084991 602514801
2939.4 602514801 604436035 605801125 607359467 609317284 611530952 613470116 615408897 617041893
2947.1 617041893 618383369 619941597 621744080 623923912 626057816 628392868 630457191 632103958
2954.8 632103958 633900261 635548477 637206345 638935547 640696487 642438126 644396210 646268539
2962.6 646268539 647741928 649235687 650786285 652435532 654127655 655754700 657036591 658157806
2970.3 658157806 659508743 661086807 662228546 663005905 663954620 664524078 665971375 668079147 669188385
2979 669188385 669869080 670715942 671762924 672526779 673461838 674510498 675322189 676203537 676695480 677231522
2988.6 677231522 678295441 679293442 679789276 680528946 681059189 681036148 681616592 682310867 682562103 682362061
2998.2 682362061 682347412 682830505 683267899 683330536 683075333 683125839 683243484 683286438 683214035 683221970 682929382
3008.8 682929382 682479401 682760620 682228088 681420975 681189117 680630875 680157547 679943237 679753571 679212646
3018.5 679212646 678663025 678296204 677906113 677122116 676039963 675337982 674603119 673827515 673058548
3027.2 673058548 672343292 671723175 671491547 671370697 670199738 669169540 668614578 667774658 667025299
3035.9 667025299 666446075 665735550 664922256 664286346 663452682 662307816 661423187 661083908 660281372
3044.5 660281372 658920135 657846222 656888046 656068878 655211792 654445114 653424683 652261353 651578827
3053.2 651578827 651107712 650593872 649459229 648566132 647847748 646930008 646260757 645264053 644132233
3061.9 644132233 642826004 641751633 640700302 639813957 639409790 638386650 637410851 636563263 635653229
3070.6 635653229 634954338 634102135 632926865 631932983 631148720 629880524 628914032 628011208 627049637
3079.2 627049637 626131058 625118065 624705276 624034309 623163147 622276993 621502838 620822258 619557114
3087.9 619557114 618151627 616827698 615871468 614932251 614059410 613022842 611861115 611337357 610565529
3096.6 610565529 609944153 609403343 608165932 606632614 605424271 604590530 603907890 603587189 602395935
3105.3 602395935 600730629 599758263 599046555 598566093 597948952 596988411 595848427 594821777 593896370
3114 593896370 593172722 592298279 591195030 590428925 589160271 588098450 587823753 587221680 585862694
3122.6 585862694 584387131 583834763 583426476 582387276 580995712 579762039 578931847 577822227 576724739
3131.3 576724739 576117783 574752274 573296242 573173332 572914772 572244720 571409683 570315323 569376907
3140 569376907 568248940 567271194 566289139 565728226 565431099 564341621 563324394 562705574 561968460
3148.7 561968460 560823441 559987946 559554596 558743668 557542877 556371040 555419083 554105644 553298454
3157.4 553298454 552857666 552009773 551324196 550467491 549673653 548902092 548038559 547507133 547172394 546292152
3167 546292152 544800377 543654671 542747612 542123260 541541214 540672455 540116806 539750328 539098320 538395844
3176.6 538395844 537838516 536977615 536035500 534888153 533604279 532609978 531912804 531380730 530443916
3185.3 530443916 529735374 529202118 528749161 528444862 527794533 527118988 526033058 525007248 524361801
3194 524361801 523833084 523232269 522293968 521443672 520616226 520256958 520191002 519838066 519100113 518295059
3203.6 518295059 517714195 516966019 516200180 515249176 514334145 513422318 512679939 512059326 511533890 511543083
3213.3 511543083 510640297 509966927 509754295 508817520 508314438 507686920 506890221 506519470 506159096 505154305
3222.9 505154305 504155731 503802414 503536377 503198586 502370605 501964149 501497459 500819855 501230927 501074867
3232.6 501074867 499693985 498454361 498157539 497956924 497122192 496392326 495982437 495619888 495157967
3241.3 495157967 494717140 494682961 494886627 493998947 492875290 492314835 491745529 491413765 490489464 489768791
3250.9 489768791 489470520 489228897 489256096 488584213 488032990 487653008 487196198 487176399 487129974 486348343
3260.5 486348343 485280228 484696350 484114151 484132843 484280510 483932152 483824615 483687325 483316078 482817116
3270.2 482817116 482392578 481925163 481706886 481133423 480372887 480273552 479649773 478907394 478222694 477707367
3279.8 477707367 477621956 477431221 477565994 477460403 477227745 477204628 477147903 476870193 475869141 474695358
3289.5 474695358 474124107 474359665 474270973 473676071 473608131 473617325 473491707 473075752 472446938 472087746
3299.1 472087746 471596642 471249275 470951691 470129890 469460602 469173088 469094315 468800392 468467064 468544731
3308.8 468544731 468194008 467867279 467666283 467038269 466019936 465033951 464774895 464301147 463653488
3317.4 463653488 463226471 462956009 463052979 462649879 462313499 462301483 461615105 460760193 460499916 460356293
3327.1 460356293 459738388 458895187 458658447 458590698 457585258 456996193 456820030 456399765 456371231 455697899
3336.7 455697899 454887505 454817886 454409065 453478813 453181381 453033257 452219734 451637421 451228600 450784683
3346.4 450784683 450155144 449904747 449800072 449217186 449004517 448338699 447458000 446609192 445623665 444939880
3356 444939880 444168167 443859062 443758354 443637733 443253708 442669487 442191734 441773567 441706390 441227684
3365.7 441227684 440831223 440308228 439507790 438918228 437990723 437501755 437264748 437152901 437220230 437063103
3375.3 437063103 436871262 436469383 435416107 434089432 433769913 433745575 433456993 432844696 432289314
3384 432289314 432325897 431538277 431117058 431497955 431343575 430757141 430066833 430011597 430052414 429753418
3393.6 429753418 429501991 429820747 430482635 429860649 428650475 428398705 428334961 427848129 427708740 427629433
3403.3 427629433 426991806 426303596 426199532 426808243 426967888 426632233 426154785 425585518 425800781 425643349
3412.9 425643349 425191307 425455284 425233459 425195808 425560951 425450859 425049133 424195938 423793907 424229317
3422.6 424229317 424827843 424989662 424984665 425267296 425033722 424580841 424686699 425138931 424890366 424506493
3432.2 424506493 424834518 424738235 424774132 425217323 425775146 425783310 425016708 424719772 425225754 426375198
3441.8 426375198 426446800 426314354 426783485 427162781 427717094 426357155 425914192 427219887 427912254
3450.5 427912254 428327103 428621483 429374352 429813309 429626884 429630241 430093117 430611191 430833740 430897484
3460.2 430897484 430765343 431695862 432528839 432594109 432779961 433006248 433636818 434044304 434594879 434884834
3469.8 434884834 435367432 436195412 436064415 436599083 437372398 437279129 437599716 438303299 438702774 439435234
3479.5 439435234 440359955 440527382 440428391 440541191 441267319 441968956 442695465 443368988 443098831 443315620
3489.1 443315620 444244995 444813499 445008469 445616837 446300583 446687584 446935921 447093353 448041420 449066086
3498.7 449066086 449790497 450322723 450948944 451439285 451385384 451474876 451572647 452427559 453347282 454375458
3508.4 454375458 454621544 454191170 455572891 456218834 456775856 457547188 458043175 459165573 459933701
3517.1 459933701 460721893 460796547 461043282 461959915 462995834 463337173 462414703 463515282 465126457
3525.7 465126457 465877838 466726837 467045593 466755791 467318535 467939339 468612289 470210724 470912094
3534.4 470912094 472124710 472118225 471784668 473804398 474519157 475325432 476111946 477206459 478564682
3543.1 478564682 479393387 479590263 478488808 479731140 479794083 480632629 482189980 483283234 485116196
3551.8 485116196 484294128 485802879 486771698 487744179 489771500 489022980 490636253 492582016 492858696
3560.5 492858696 492972412 494733887 496073456 496710396 501106834 500951233 499323692 499502068 499444580
3569.1 499444580 503001175 504349251 505506859 506965485 508168488 508901672 510451660 512857552
3576.9 512857552 512680092 514654007 516446037 517065620 518920021 521034966 522672424 523065681 526912117
3585.5 526912117 527888527 525033875 526597557 526216087 529249496 532848167 536477699 537500381 537860146
3594.2 537860146 541025429 539072151 541250000 544513741 544887314 547319183 547568817 548556671 550823898
3602.9 550823898 552688866 555062752 559167480 561887512 559610634 562798767 561255608 560946274
3610.6 560946274 569446373 570088158 566948395 570020523 569951668 574901505 578825874 577836761 579571724
3619.3 579571724 578130150 578840981 582454338 585511551 587869835 589738655 591488457 593565598
3627 593565598 599616928 597766304 585347366 590625763 597013474 603051529 603581429 602329025 605534554
3635.7 605534554 608398018 610134468 609799347 611072693 613320808 615569038 616600113 616737480 619092560
3644.4 619092560 622414169 627920609 625509148 621845207 628663254 625931282 620489502 621962280
3652.1 621962280 629603195 634223022 637156868 640265961 631485329 635286179 641556244 642748718
3659.8 642748718 643801727 644154282 645954056 646405640 647866974 649513321 649974976 654718475 656706009
3668.5 656706009 654780426 654235840 647732315 651839371 661596069 670633774 664960632 645337143
3676.2 645337143 651653214 660190659 664535065 661735840 662474136 665388947 666819077 668638000
3683.9 668638000 669379807 670266113 674561691 680148849 669683151 666832733 675543213 669276810
3691.6 669276810 670226974 676218414 677351608 679096298 678979111 679031601 680743942 681340714 683764725
3700.3 683764725 686139603 679791870 678109665 683643951 684642868 685428238 686929245 689099197 692375870
3709 692375870 684868851 689690475 693724213 678636093 684132843 690075760 691132355 691526413 693369522
3717.7 693369522 693727036 689576187 691289749 697440186 692521515 688345184 695268021 696612854
3725.4 696612854 696132965 693224106 692682419 697131348 698773193 703577271 699129028 693037949 703975754
3734 703975754 705061188 693350143 693786163 696893921 697393036 700653229 704504013 701622238 705243607
3742.7 705243607 715909500 700355835 685980377 698264160 704472198 710929947 705769119 694350662
3750.4 694350662 706662750 699334946 693187790 700475464 706319580 709572754 704343643 708622971
3758.2 708622971 714179764 704398422 703322296 708795013 711017075 711867523 715194702 710767746
3765.9 710767746 706715012 711587448 716490860 715455475 705680695 708456268 712528992 713093719
3773.6 713093719 713965530 714073334 715595245 715789185 717100143 714446259 707414398 712570724 715826111
3782.3 715826111 717444077 719633636 715760651 714853058 716291733 717761002 718998566 718326492 718324661
3790.9 718324661 718180466 718655167 718459778 719396820 722435074 718329239 714657593 717355423 722252350
3799.6 722252350 727556305 718088913 709445953 714627838 718334656 723850708 728519363 716118317
3807.3 716118317 713238754 719401321 721764984 722572098 723472443 723977203 724725189 728363495 722524414
3816 722524414 710329132 719412689 725646286 729748535 729564972 709756393 714487305 721429367
3823.7 721429367 724716263 727589264 726565857 721675110 722726822 726024857 729473038 729967651
3831.4 729967651 720415192 724160614 732213364 725176086 724493866 732510529 722018127 718549347
3839.2 718549347 727712708 721904602 722417221 729947052 727139664 724286270 727582321 728557053 728557358
3847.8 728557358 730659103 729571304 731730042 737729416 729459076 727287827 710849304 716173859
3855.6 716173859 728659744 728267212 727155685 729768982 732280121 734187393 727528000 727377701
3863.3 727377701 733604202 727736053 723480072 729085617 735851212 741203461 729500351 720775757
3871 720775757 726829453 734002914 735559235 724579697 727280655 731779327 731913223 734456329 738514481
3879.7 738514481 732163620 726523209 733836594 734844437 735840607 739466019 725691299 728533020
3887.4 728533020 733778992 734651489 737890930 735082703 726348953 729259415 733470840 732950745 735113678
3896.1 735113678 736426392 738779068 739936752 729543915 735156555 736213608 729098129 733341064
3903.8 733341064 730037766 729294586 731425476 733991547 736940536 736090775 736016083 736463928 736727524
3912.5 736727524 736378174 735315933 737100677 739685135 734924774 731574860 737028351 737079239 733483047
3921.1 733483047 736381607 738102798 738765106 736067963 732722244 735070801 737521133 738400955 736317062
3929.8 736317062 735535355 737486191 734969788 734162521 736629715 737545166 738085098 738105240 737229614
3938.5 737229614 736897583 737067947 739306641 740539169 735623169 734502487 735907440 737346573 738610382
3947.2 738610382 736036911 737335129 738241653 736553040 738627396 738593521 738021545 738424988 738185806
3955.8 738185806 738132477 737615356 737496185 737188950 738183746 738758545 737913666 738787613 739408417 739151001
3965.5 739151001 738976746 739258804 739409943 738409882 737983551 738662949 738494034 738039093 738975449
3974.2 738975449 740100937 740170288 739546356 739290314 739322433 739880600 740977402 740983276 739802933 739227753
3983.8 739227753 739668655 739442673 739565125 740010681 739725800 739819794 739736099 740902176 742039413 741128616
3993.5 741128616 740455246 739694901 739004745 739505310 740031967 740183945 740714569
4000.2 740714569
##END=$$ End of the data block
