##TITLE=$$ Begin of the data block
##JCAMP-DX=5.00 $$ ACD/SpecManager v 10.08
##SPECTROMETER/DATA SYSTEM=Varian
##DATE=20 Nov 2012 14:35:50
##DATA TYPE=INFRARED SPECTRUM
##DATA CLASS=XYDATA
##ORIGIN=
##OWNER=
##NPOINTS=3735
##FIRSTX=399.26403809
##LASTX=4000.35498047
##MAXX=4000.35498047
##MINX=399.26403809
##MAXY=81.75121307
##MINY=37.60908127
##XFACTOR=1.0000000000
##YFACTOR=0.000000100000000
##FIRSTY=65.65102386
##DELTAX=0.96440572
##XUNITS=1/CM
##YUNITS=TRANSMITTANCE
##XYDATA=(X++(Y..Y))
399.3F56510239J744842j2134399o976166j1978226j0822944m19503k632446o027679
407F07263718J4381o01578M219208O383095K909431M229813P200127L546295k824440
415.7F32340050m305573o364326j6575241j868897J9466324O887207J111603l975334
423.4F26715813o618615L831177N113526k656174m554367p390556n246468k625084
431.1F06569252j878357k823143m15268M507446P609253O920166j795883l118400k031060
439.8F13544006L53661K753601m522591n273399N016136N287132o29463K278633M312706
448.4F23120422N849457L311424N2414K741013l885231n583840n456237p466889l50494
457.1F12332039K316131L185692O564484N664368j707573m400215P08770P805176J638718
$$ plain form
399.3 656510239 658255081 646120682 639144516 627166290 616343346 615923843 613291397 607263718
407 607263718 607278099 606676521 610895729 617278824 620188255 624418068 631618195 635164490 632340050
415.7 632340050 628034477 621670151 605094910 603226013 622692337 629579544 630691147 626715813
423.4 626715813 620097198 623928375 629041901 626385727 621831360 614440804 609194336 606569252
431.1 606569252 604690895 601867752 601452484 605959930 613569183 620489349 618693466 615575066 613544006
439.8 613544006 613897667 616651268 612128677 606855278 611871414 617158546 616529083 618807716 623120422
448.4 623120422 628969879 632281303 632333717 635074730 631189499 625605659 620149422 612682533 612332039
457.1 612332039 614648170 617833862 624398346 630062714 628355141 623954926 624663696 632468872 634107590
465.8F34107590q595505m109154o986275q118400K715683J686211k178994J998291
473.5F10519447M926644K463493k199058j298180p79114k101517k026672m673271n508804
482.2E99322968j96915p44057l315391k437287N255127J1293106L906517j347656j541023
490.9F10195389k924271l122406j749077k914276l018188R46464j013260j238746J072006
499.6E96233635J974754K050743J295624J190911L80477J57395k832909m874763o121064
508.2E89454803m501342j265908l737335J684876L240928m5509j59416m78478L87307
516.9E84579926k414361k565155n733032l656196r09272l764839j779899r48029j86500
525.6E62622643N09109L172531K854233K351685L153915o88477j416092j223640j887207
$$ plain form
465.8 634107590 625512085 621402931 614416656 606298256 609013939 610700150 608521156 610519447
473.5 610519447 615446091 617909584 615710526 614412346 613633232 611531715 609505043 604831772 599322968
482.2 599322968 599126053 598381996 595066605 592629318 597884445 609177551 613084068 611736412 610195389
490.9 610195389 607271118 604148712 602399635 599485359 596467171 597413635 596400375 595161629 596233635
499.6 596233635 598208389 600259132 601554756 602745667 603126144 603283539 600450630 595575867 589454803
508.2 589454803 584953461 583687553 579950218 581635094 584876022 584830513 584671097 584192619 584579926
516.9 584579926 582165565 579600410 573867378 570211182 569301910 565537071 563757172 562809143 562622643
525.6 562622643 563131752 566304283 569158516 571510201 574664116 573975639 572559547 571335907 569448700
534.3E69448700l124085j015243K477798J257782K481423M138412O724816N703010
542E88092613L062783K889709J563530q30231m775467m289894j796417M8065J664124
550.7E85628815P8315N4055R05838J590881J140900N55763L8261l040084n374184l638497
560.3E77940063k458038n157318k908668j163826j443978j15967J16463q33740l163872
569E60811119o08673j640396k929497j396866m361381l771897j533889K38113n9319
577.7E44747314J886178L880615M587745N001946M040375N998001L695488O27212L37181
586.4E74802055L56522j061287k384682J34659O03981L614540N571671L319511K678032
595E87635002J998367J505928J22071o73828l099594m997635l361855k937965j405907
$$ plain form
534.3 569448700 566324615 565309372 567787170 569044952 571526375 575664787 582389603 588092613
542 588092613 591155396 594045105 595608635 594778404 590002937 585713043 583916626 583964691 585628815
550.7 585628815 585707130 585761185 586667023 588257904 589398804 589954567 589992828 586952744 581578560 577940063
560.3 577940063 575482025 570324707 567416039 566252213 564808235 564692268 564808731 563974991 560811119
569 560811119 560202446 558562050 555632553 554235687 549874306 546102409 544568520 544806633 544747314
577.7 544747314 546633492 550514107 555101852 560103798 564144173 570142174 573837662 574464874 574802055
586.4 574802055 575158577 574097290 571712608 571847267 572451248 576065788 581637459 584956970 587635002
595 587635002 589633369 591139297 591261368 590587540 587487946 582490311 579128456 576190491 574784584
603.7E74784584L34358K225495K838134K394524L286400L203964J447868k12173j491890
612.4E88811264k720528j788978q89816j758385l04909K063065K209930L315315N469628
621.1E94406586N137939M287796K322884J551018O80618j730118k504578k967987k224159
629.8E98959999M54826L454590M096680K652740K178650L278160M432335K237320p94029
638.4F20951271k377014k385559j573487k275352k832260j557732J117325K835159
646.2F11902351L932495M170571K376442K266464K481346Q08830j993103l417739k862511
654.8F19665146j671791j385193j562729N48363L135948L989677K951584L251801M180794
663.5F33103600J067733p54623l64723l701401j7552834L288765M756928R71794J375389
$$ plain form
603.7 574784584 575118942 577344437 580182571 582577095 585863495 589067459 590515327 590303154 588811264
612.4 588811264 586090736 584301758 583411942 581653557 581348648 583411713 585621643 588936958 594406586
621.1 594406586 599544525 603832321 606155205 607706223 608386841 606656723 604152145 601184158 598959999
629.8 598959999 599414825 602869415 606966095 609618835 611797485 615075645 619507980 621745300 620951271
638.4 620951271 618574257 616188698 614615211 612339859 609507599 607949867 609067192 611902351
646.2 611902351 615834846 620005417 622381859 624648323 627129669 627938499 625945396 622527657 619665146
654.8 619665146 617993355 616608162 615045433 615593796 618729744 622719421 625671005 628922806 633103600
663.5 633103600 634171333 633416710 633051987 629350586 611797752 615086517 619843445 620815239 622190628
672.2F22190628K929649L425217M216194M451142L062896K62223o55976r25293k619171
680.9F36337509l767662l722496j747208R38263K186089K847671L994103L637314L500137
689.6F44203720L057175j57166k357864l137283l556061l434525m043655l141670r12171
698.2F26520500J414910K676239K210807K374001K520256k40402k928925k953300k835884
706.9F28758202l325310l772087k607193J37024J099205K220230M261398N166016N173187
715.6F37110672L447952L130417K731323o66732j400681j213684j210861l71704J66168
724.3F41722870K037735M033966N722122O458511N755158M053497K251740J326980
732F73362579n16510k301559k518463j715088j545029j191711M46396L020019M898377
$$ plain form
672.2 622190628 625120277 628545494 632761688 637212830 640275726 640537949 639881973 638956680 636337509
680.9 636337509 632569847 628847351 627100143 628038406 630224495 633072166 637066269 640703583 644203720
689.6 644203720 647260895 647103729 644745865 641608582 638052521 634617996 630574341 627432671 626520500
698.2 626520500 627935410 630611649 632822456 635196457 637716713 637476311 634547386 631594086 628758202
706.9 628758202 625432892 621660805 619053612 619190636 620289841 622510071 626771469 631937485 637110672
715.6 637110672 640558624 643689041 646420364 645753632 644352951 643139267 641928406 641556702 641722870
724.3 641722870 643760605 647794571 653516693 659975204 665730362 669783859 672035599 673362579
732 673362579 672846069 670544510 668026047 666310959 664765930 663574219 664020615 667040634 671939011
740.7F71939011M372787M266739L089371q36487l514404l017350l431167n855713n329285
749.3F61683502k584457j249542o49414J125106K585450J488037P33490M53567j134567
758F62451172l278809m893951n136795m958954l765106j635819p28035O33202K727432
766.7F41414337M678574N591278M888458L938217L058396J083679n58243j305237j219330
775.4F61570129K91443J901169L084030M272003N185395O127548P035828N577468L460541
784.1F98505554K690964K41852k908020l461457q12072j95008m72793M82483K316513
792.7F96388016N206451N349274N540161L719177J423874K226257N46113j147690k884980
801.4G16366653k717971j359101j323471R76639L146896M203034M500198L992157L847580
$$ plain form
740.7 671939011 676311798 680578537 683667908 682831421 679317017 676299667 672868500 667012787 661683502
749.3 661683502 659099045 657849503 657200089 658325195 660910645 662398682 663132172 663585739 662451172
758 662451172 659172363 654278412 649141617 644182663 640417557 638781738 638053703 638686905 641414337
766.7 641414337 646092911 651684189 656572647 660510864 663569260 664652939 664094696 662789459 661570129
775.4 661570129 661861572 663762741 666846771 671118774 676304169 682431717 689467545 695045013 698505554
784.1 698505554 701196518 701438370 698530350 695068893 694256821 694061813 693589020 694071503 696388016
792.7 696388016 701594467 706943741 712483902 716203079 717626953 719853210 720399323 719251633 716366653
801.4 716366653 713648682 712289581 710966110 711942749 715089645 719292679 723792877 727785034 731632614
810.1G31632614K493210r04160k388534k295075l335037l607101k721863o94733Q41446
818.8G19020767K053604K286301K387161M344330L169937j39694j847458k705307m985351
827.5G23584290n861283l963318k741623j955490j200332Q42437J788941P18002J082153
836.1G12293777J040040r68094l577118m619446m335938l534240l918839m252167k233047
844.8F85894928k26440R02786J812744J673202R14231O97326l19290k226944l680648
853.5F85441895m909516m157257k974548k970505k690659r88540P98263J478119K522202
862.2F71549454M191208M905014L274688J942521K510223J585236J185455J850357
869.9F92994156K438888L535386N021209N952912M884109M024429L085099K595596
$$ plain form
810.1 731632614 734125824 733221664 730833130 728538055 725203018 721595917 718874054 718179321 719020767
818.8 719020767 721074371 723360672 725747833 730092163 733262100 733122406 731274948 728569641 723584290
827.5 723584290 717723007 713759689 711018066 709062576 707862244 708704681 710493622 711211624 712293777
836.1 712293777 713333817 712365723 708788605 704169159 699833221 696298981 692380142 688127975 685894928
844.8 685894928 685668488 686571274 688384018 690057220 690971451 691668777 691349487 689122543 685441895
853.5 685441895 680532379 676375122 673400574 670430069 667739410 666750870 667549133 669027252 671549454
862.2 671549454 675740662 680645676 683920364 685862885 688373108 689958344 691143799 692994156
869.9 692994156 695433044 698968430 703989639 709942551 714826660 718851089 721936188 724531784
877.6G24531784J047592j29471K31476k313232l755417m187317m055176k432480j021652
886.3G07916107j11465K73819K52838n25513p19833j794129k797012l294754m259262
895F94940796l801651l549500l258895k536774o94657P95899l98941J95618P64999
903.7F82456894j557617k825241l144989l820725m224472m871673n344010m615097
911.4F52053070l374405l098068k468186k238311k821274k098656k122688l033753
919.1F30797729l714828l971558l874054l472099k348556j141320n13153m20875P42035
927.8F12083321J093254J209335K092247J668167M73595M21448N02815p95098o3362
936.4F18685722P47223P07054J943322K049942K478408L062935K992211K668762J795006
$$ plain form
877.6 724531784 725579376 725449905 725681381 723368149 719612732 715425415 711370239 708937759 707916107
886.3 707916107 707804642 708078461 708331299 707805786 707085953 705291824 702494812 699200058 694940796
895 694940796 691139145 687589645 684330750 681793976 681099319 681895218 681496277 681691895 682456894
903.7 682456894 680899277 678074036 674929047 671108322 666883850 662012177 656668167 652053070
911.4 652053070 648678665 645580597 643112411 640874100 638052826 635954170 633831482 630797729
919.1 630797729 627082901 623111343 619237289 615765190 613416634 612275314 611762161 611341286 612083321
927.8 612083321 613176575 614385910 616478157 618146324 618619919 619041367 619544182 618749084 618685722
936.4 618685722 619432945 620139999 622083321 624133263 626611671 629674606 632666817 635335579 637130585
945.1F37130585O51436j028405k721214l857803m620629m994430m251290m344444m908562
953.8F07055244l891410m667168m837875m808045o156692o487580o184807o246986
961.5E63774681q190689q065681p600899p641754p405205p455444o023064o639710
969.2E04752235p407188q186531p575188p217064q087082q623733r658280q036079
976.9D39961090q433151p958565o982880n747261m616584n640374l921508l855706
984.7C92805061k882309k593917j816597k012024k856827r63555k183113p14683m70238
993.3C76311798k20985Q6708J76887J446572K83737J759949N31349Q19397N08766n20516
1003C81183662N00374q48312M69055l24821m65546r48830m54979P11823n341J158791
$$ plain form
945.1 637130585 637782021 636753616 634032402 630174599 625553970 620559540 616308250 611963806 607055244
953.8 607055244 603163834 598496666 593658791 588850746 582694054 576206474 570021667 563774681
961.5 563774681 555583992 547518311 539917412 532275658 524870453 517415009 511391945 504752235
969.2 504752235 497345047 489158516 481583328 474366264 466279182 457655449 447997169 439961090
976.9 439961090 431527939 423569374 416586494 410839233 406222649 400582275 396660767 392805061
984.7 392805061 389922752 387328835 385512238 383500214 380643387 379679832 377496719 376782036 376311798
993.3 376311798 376090813 376177521 376354408 377800980 378084717 379844666 380376015 381195412 381704178 381183662
1003 381183662 381684036 380835724 381304779 380979958 380514412 379565582 379110603 379822426 379817085 380975876
1012.6C80975876p96662l05976j33477J36643r8000q14590O82411n26962J254883J511459
1022.3C81885605K177315J600532J167679K715301J290436K365876J080970J925469
1030C96209183J625061L55072J361961P52373K032356Q71163J394882Q75969R14001
1038.7D06392021J491966N32608J057053k75192N54237j289406m05655N75600n55572
1047.4D08077660J318321O36444J574097Q74328K200318K404708K061387L992233L446655
1056D26586151L432388J676255L261032K948074K740746L783035L297348N642357N484199
1064.7D58851585N773087M336471K923661J666717P1488j883621n178566m895440o631469
1073.4D55033913o122513m864884l483810j470871k261353l23486n70144J020736R36508
$$ plain form
1012.6 380975876 380179214 379873238 379739761 379876404 379778404 378963814 379646225 379119263 380374146 381885605
1022.3 381885605 384062920 385663452 386831131 389546432 390836868 393202744 394283714 396209183
1030 396209183 397834244 398189316 399551277 400303650 402336006 403207169 404602051 405478020 406392021
1038.7 406392021 407883987 408416595 409473648 409198456 409752693 408463287 408057632 408633232 408077660
1047.4 408077660 409395981 410032425 411606522 412480850 414681168 417085876 419147263 423139496 426586151
1056 426586151 430018539 431694794 434955826 437903900 440644646 444427681 447725029 453367386 458851585
1064.7 458851585 464624672 468961143 471884804 473551521 473623009 471739388 466560822 461665382 455033913
1073.4 455033913 448911400 444046516 440562706 439091835 436830482 436506996 435936852 436957588 437894096
1082.1D37894096J514855J962433J14441J911010J515847K844886J454926J866112
1089.8D51078606K676468J682510L951187L585014M223557K728653K905502J769791
1097.5D74601288L03764J511345o84433l32336p36657j15432O5384R29908J743241
1106.2D77286072O15577K637291J380845J948356J968460J519356J227036J68151K453156
1114.9D91204300J429291J083564R48868J651612K373428J459045J657143J036606
1122.6E02843857J633034R3269p1488J219445J400947Q43735L79181J913452J787567
1131.2E12042999K734299K216225K365913K314835L72314L59955q69675r35325k702675
1139.9E17898865m002342m194565n185852l695526j839676q50449m184494l459053
$$ plain form
1082.1 437894096 439408951 441371384 441485825 443396835 444912682 447757568 449212494 451078606
1089.8 451078606 453755074 455437584 459388771 462973785 467197342 469925995 472831497 474601288
1097.5 474601288 474905052 476416397 475731964 475399628 474662971 474547539 474612923 475542831 477286072
1106.2 477286072 477901649 480538940 481919785 483868141 485836601 487355957 488582993 488751144 491204300
1114.9 491204300 492633591 493717155 494666023 496317635 498691063 500150108 501807251 502843857
1122.6 502843857 504476891 504570160 504498672 505718117 507119064 507962799 508341980 510255432 512042999
1131.2 512042999 514777298 516993523 519359436 521674271 522046585 522406540 521536865 520601540 517898865
1139.9 517898865 513896523 509701958 504516106 500820580 498980904 498130455 493945961 490486908
1147.6D90486908j864052k795868j498375j821060j271286k845611k432747j640358
1155.4D74317551j083947K28386o33545P72744J148834K590828K141609K008743K385292
1164D83876495J659775L492050L337632L444862K933769L832703L863106L727645N709916
1172.7E15877953N430412O083794O819458P232551O110611O086960N152321M045295
1180.4E62839355N399704M540596M688378L817024L397865M078980L720322M495353
1188.1E96977577M662132M496651L906250L845673K547760N98297Q621k81868P1793
1196.8F16832886p8354J64451M6044k68860Q95576K321129K700005J757088J838302
1205.5F26208267J508904N68504o2523l10364L03803P12318J044503J097793K401505
$$ plain form
1147.6 490486908 488622856 485826988 484328613 482507553 481236267 478390656 475957909 474317551
1155.4 474317551 473233604 473461990 472828445 473601189 474750023 477340851 479482460 481491203 483876495
1164 483876495 485536270 489028320 492365952 495810814 498744583 502577286 506440392 510168037 515877953
1172.7 515877953 521308365 527392159 534211617 541444168 547554779 553641739 558794060 562839355
1180.4 562839355 568239059 572779655 577468033 581285057 584682922 588761902 592482224 596977577
1188.1 596977577 601639709 606136360 610042610 613888283 616436043 617034340 617042961 616761093 616832886
1196.8 616832886 616754532 616918983 616965027 616696167 617591743 619912872 622612877 624369965 626208267
1205.5 626208267 627717171 628285675 628223152 627912788 628216591 628928909 629973412 631071205 633472710
1214.2F33472710L336258K987213L264503K659531J864319J554870O17905l18222q97522
1222.9F48541565j747971j934890p21360P3243K70690Q44803J249085J044464M67834
1231.5F48087463j4572m31137j249389j913300j799469j860657k086639j719475j015511
1240.2F35997314L14255R06983J080322J664009J525612R76410Q48312N15137o53839
1248.9F43174515j146927r18198q89892p8659P64160J023407J718139K301941K056809
1257.6F48005295K104034J426621K18429n4626o70166j661377j480713p65381j72882
1266.3F46949234K98538J329575K187576K452850K641221K091980J509628Q72726n39016
1274.9F59794312j275101j819687j712799j421967j079712l16238J96762R14154J697159
$$ plain form
1214.2 633472710 636808968 639796181 643060684 645720215 647584534 649139404 649757309 649439087 648541565
1222.9 648541565 646793594 644858704 644137344 644210587 644481277 645326080 646575165 647619629 648087463
1231.5 648087463 648072891 647641754 646392365 644479065 642679596 640818939 638732300 637012825 635997314
1240.2 635997314 636311569 637218552 638298874 639962883 641488495 642464905 643313217 643828354 643174515
1248.9 643174515 642027588 641109390 640219498 640140839 640904999 641928406 643646545 645948486 648005295
1257.6 648005295 650109329 651535950 651754379 651699753 651029587 649368210 647887497 647122116 646949234
1266.3 646949234 647247772 648577347 650764923 653217773 655858994 657950974 659460602 660333328 659794312
1274.9 659794312 658519211 656699524 654986725 653564758 652485046 652168808 652365570 653279724 654976883
1283.6F54976883J781006J182403Q81424P8202j415863j854172j961365k146835k171250
1292.3F49350433j308441l22952N12543P54852P58667J332397P26548j53962j134033
1301F50516052j896820j734237k274781k645416k119217j432838j075440l5553R73168
1309.7F38274918J323700J701812O62613n11474o97632j331482j970520k588349k414589
1318.3F32448997j836929j315346m31671L32604R97696R91554M66919o0768q99163
1327F30693893j978950k932091l385811l692398l723259l040008k313538r12857m30489
1335.7F08284492J20965M31747J02158K78205M52538L22342p52411j229172j462822
1344.4F06548042j240997n22270l14789J67198N85899J411858J607285J586265J101647
$$ plain form
1283.6 654976883 656757889 657940292 658821716 658899918 657484055 655629883 653668518 651521683 649350433
1292.3 649350433 648041992 647719040 648231583 648986435 649745102 651077499 651804047 651650085 650516052
1301 650516052 648619232 646884995 644610214 641964798 639845581 638412743 637337303 637301750 638274918
1309.7 638274918 639598618 641300430 641963043 641451569 640753937 639422455 637451935 634863586 632448997
1318.3 632448997 630612068 629296722 628865051 629197655 630195351 631186905 631653824 631593056 630693893
1327 630693893 628714943 625782852 622397041 618704643 614981384 611941376 609627838 608714981 608284492
1335.7 608284492 608405457 608837204 608939362 609217567 609670105 609992447 609240036 608010864 606548042
1344.4 606548042 605307045 604784775 604469986 604637184 605223083 606634941 608242226 609828491 610930138
1353.1F10930138J76773o81420r04007p73277j950798k106018j554642j900596j250573
1361.7E99985580m57420J376915K412376K123299Q90083M54560n18875j439705r78813
1370.4F03848000j742554q98819j073074r85985K93541J438789K577896J995087J993255
1379.1F07446136J285668J388740P35436q66051r94835p11479K78244l04336O55021
1387.8F08912544K452011K575379K939682K804184K545967J195869L4409j398125m48723
1396.4F21613197o65283j696167k989311j715775J89553k42882L02124L93791j63307
1405.1F15025940J042061J161499L2654j558762j613808k028274k323342j954994j332016
1413.8F06450958p91893p07969k51389K00081P86819o54068J892815K606964K51770
$$ plain form
1353.1 610930138 611106911 610425491 609521484 608748207 606797409 604691391 603136749 601236153 599985580
1361.7 599985580 599528160 600905075 603317451 605440750 606330833 606785393 606266518 604826813 603848000
1370.4 603848000 602105446 601206627 600133553 599147568 599441109 600879898 603457794 605452881 607446136
1379.1 607446136 608731804 610120544 610855980 609989929 608995094 608283615 608561859 608257523 608912544
1387.8 608912544 611364555 613939934 616879616 619683800 622229767 623425636 623460045 622061920 621613197
1396.4 621613197 620947914 619251747 616262436 614546661 614736214 614493332 614795456 615189247 615025940
1405.1 615025940 616068001 617229500 617262154 615703392 614089584 612061310 609737968 607782974 606450958
1413.8 606450958 605659065 604951096 604699707 604899788 605686607 605032539 606925354 609532318 609784088
1422.5F09784088j065712k666244l72925r8190q26340K67944q59375L16620K519417
1431.2F06999283L093796K061920J092911J429710J60561k711335j47628J703453m59748
1439.8F13222923m44946P44400P38487J510735R42268K246781J517219K66609k90374
1448.5F20454102J87683L40995j377296j616554k392807j067314j510659j366882j205750
1457.2F10445518l426780L761711K158470L418846J176491M84123J776657k655143
1464.9F17139893l34015L94325K014313J860122K841607L488159J386146M051781L528900
1473.6F36371231P162323L274689J698074L770981L057938K088546M44184J681213
1481.3F59549179J706467K986297K982026L386993L664627J213760L346558K037048
$$ plain form
1422.5 609784088 608718376 606052132 605679207 605581017 604754677 605022621 604163246 604479866 606999283
1431.2 606999283 610093079 612154999 613247910 614677620 614838181 612126846 611979218 613682671 613222923
1439.8 613222923 612777977 613522377 614260864 615771599 616713867 618960648 620477867 620744476 620454102
1448.5 620454102 620641785 620982780 619605484 617988930 615596123 614528809 613018150 611651268 610445518
1457.2 610445518 607018738 610780449 612938919 616357765 617534256 618018379 619795036 617139893
1464.9 617139893 616805878 617200203 619214516 621074638 623916245 627404404 628790550 632842331 636371231
1473.6 636371231 643533554 646808243 648506317 652277298 655335236 657423782 657867966 659549179
1481.3 659549179 661255646 664241943 667223969 670610962 674275589 675489349 678835907 680872955
1489F80872955J014328J01471K595597K681961L11737J066131m36706j028672K772370
1497.7F89951172K496796K958145L078231K448578J319428K520447J204300m31824
1505.4G05545273j0768509n921097P225494L350297L118438J845322K057190K149353
1513.1G08601761L128281K062683J33133p92313l589096M062881J645890l989182m567490
1521.8G06696548j59454M929199K495423O83593N13077K189865J181336K048034K668000
1530.5G23245621o31867p4310l083267m330445J745682R58634J568679Q19397l173904
1539.2G17044220p552490P425689L942795l66821K927093j177215k734909J186600
1546.9G20694962M51583n52139k736511j884461K165223J911087K23693j660690J699219
$$ plain form
1489 680872955 681887283 681988754 684584351 687266312 687578049 688644180 688207474 687178802 689951172
1497.7 689951172 692447968 695406113 698484344 700932922 702252350 704772797 705977097 705545273
1505.4 705545273 694776764 688855667 696081161 699431458 702549896 704395218 706452408 708601761
1513.1 708601761 711730042 713792725 713925858 713133545 709544449 713607330 715253220 711264038 706696548
1521.8 706696548 706537094 711466293 713961716 714645309 715158386 717348251 718529587 720577621 723245621
1530.5 723245621 722613754 722539444 719456177 715125732 716871414 717830048 719398727 720218124 717044220
1539.2 717044220 709491730 716917419 720860214 720493393 723420486 722243271 719508362 720694962
1546.9 720694962 721146545 720594406 717857895 715973434 718138657 720049744 720273437 718612747 720311966
1555.6G20311966L736038P16400j4384842n929107K752914M823074J412659Q43277
1563.3G14282379Q03909j258544R55429J643447J272431r35669n208893L014069J904068
1572G16472626r65119j387252q9188j442642q095780K362061K509002J137467P79724
1580.6G11280899M80194R92050L31192q57696j090546r76105j257095j672134j489945
1589.3G05740814j591797r53445n62363K44217j38550j59225O84738k88925n04303
1598G02471161j522751j933670j962891k044677j524125k011566j100692q25730p04345
1606.7F88840714o68030K51388q41903j273728J60752j941147j869507k129746j012191
1615.4F79516602j899491q867874J631088O84738N0507n68542M09545j447219m203339
$$ plain form
1555.6 720311966 724048004 724764404 710379562 704450455 707203369 712026443 713439102 714282379
1563.3 714282379 715086288 713827744 714783173 716426620 717699051 716763382 711554489 714568558 716472626
1572 716472626 715507507 714120255 714031067 712588425 704492645 706854706 709363708 710501175 711280899
1580.6 711280899 711761093 712753143 713084335 712226639 711136093 710159988 708902893 707230759 705740814
1589.3 705740814 704149017 703195572 702633209 702877426 702738876 702579651 703264389 702975464 702471161
1598 702471161 700948410 699014740 697051849 695007172 693483047 691471481 690370789 689545059 688840714
1606.7 688840714 688172684 688424072 687582169 686308441 686469193 684528046 682658539 680528793 679516602
1615.4 679516602 677617111 668749237 670380325 671065063 671115570 670547028 670956573 669509354 665306015
1624F65306015J799469M26559m64172l758087k727509K04087q41523r93042j168212
1632.7F57783585J068115R40628m749603j91727K024460J123428J170654O33316r11026
1641.4F58891830l30276r94721M99878R49097k391434j554870J742859M728164L184357
1650.1F64724884L607178L400192n159073j0425033P338638N210495K565689K007599
1657.8F73270569J509323J267929J215744J411285M54255J792984M131622K701797
1665.5F87755508K167664J707077R36203j999893O39496K265625Q39691L067245L118134
1674.2G00496750k0676J083908M875794L527755J959763J268539m4631K792511L374862
1682.9G19314575j876983p656556N254517N049973K924346J585770K334976K178650
$$ plain form
1624 665306015 667105484 667532043 667067871 663309784 660582275 660786362 659944839 658951797 657783585
1632.7 657783585 658851700 659792328 655042725 654850998 656875458 657998886 659169540 659802856 658891830
1641.4 658891830 658561554 657566833 658066711 659015808 656624374 655069504 656812363 661540527 664724884
1650.1 664724884 668332062 671732254 666573181 656148148 663486786 668697281 671262970 673270569
1657.8 673270569 674779892 676047821 677263565 678674850 679129105 680922089 685053711 687755508
1665.5 687755508 689923172 691630249 692566452 690566559 691206055 693471680 694311371 697378616 700496750
1674.2 700496750 700476074 701559982 706435776 709963531 711923294 713191833 713147202 715939713 719314575
1682.9 719314575 717437592 709781036 715035553 720085526 723009872 724595642 726930618 729109268
1690.6G29109268K257080K154923J069107K249832J015091p224884K196197K944260
1698.3G35770874K309036o324005r72900Q052139M300766J649475M64020J140900p16095
1707G45674210J442642K198715k00043j375580J57090O09512j25275j216735L61328
1715.6G47525864L262634r25140n575715O554642L782349R68780k06985j078339m86679
1724.3G53821411Q00705J25809r16J153031J029129n82657J016235L600998K913361
1733G63877106k939301o698685L404847L526077M09927P13120j313935j463470L376465
1741.7G62892151J236267p44858J419602K865905J466370K87552J53427j128921K074890
1750.4G70522385r31015p71943L223725J517410J401520J073151q42057J563645K632370
$$ plain form
1690.6 729109268 731366348 733521271 734590378 736840210 737855301 730630417 732826614 735770874
1698.3 735770874 738079910 731755905 730783005 738835144 743135910 744785385 745249405 746390305 745674210
1707 745674210 747116852 749315567 749115524 747739944 747897034 748506546 748381271 747164536 747525864
1715.6 747525864 750788498 749863358 744287643 750842285 754624634 755593414 755386429 754308090 753821411
1724.3 753821411 754622116 754747925 754747009 755900040 756929169 756346512 757362747 760963745 763877106
1733 763877106 760937805 754239120 757643967 761170044 761579971 762293091 760979156 759515686 762892151
1741.7 762892151 764128418 763383560 764803162 767669067 769135437 769422989 769576416 768447495 770522385
1750.4 770522385 769591370 768819427 772043152 773560562 774962082 776035233 775193176 776756821 779389191
1759G79389191K232361J657333k148438l11966J783600J41144P2556L70788j0834j569595
1768.7G81606140K235794K637329j625671j853638R28574L862762J754990p63397J324691
1777.4G90107574l14941n78613q58994j073227Q53730J307067J023026m33044J018676
1786G91051254K005768J073074M79050L26462j284409j460800j638183k442J895065
1794.7G92444839m19311l2272J854477J285858q927k37961J956635L10211J98822M63333
1804.4G97815704p61490j50222l19977k51236J98517k43683j262589Q80433K042465
1813G97947922J499405J499481N03006Q7585j019516n24902J67541n46875j98974p81632
1822.7G98633041N44892J17187k228317J645279L138504J839676j565094l393173J689987
$$ plain form
1759 779389191 781621552 783278885 781130447 780818481 782602081 782743225 782815781 783186569 783175735 781606140
1768.7 781606140 783841934 786479263 784853592 782999954 783928528 787791290 789546280 788782883 790107574
1777.4 790107574 789792633 789214020 788355026 787281799 788135529 789442596 790465622 790032578 791051254
1786 791051254 793057022 794130096 794609146 794935608 793651199 792190399 790552216 790549774 792444839
1794.7 792444839 792025528 791993256 793847733 795133591 795124664 794886703 796843338 797153549 797352371 797815704
1804.4 797815704 797054214 796903992 796584015 796332779 796531296 796287613 795025024 795905457 797947922
1813 797947922 799447327 800946808 801449814 801537399 800517883 799992981 800160522 799613647 799414673 798633041
1822.7 798633041 799177933 799295120 797066803 798712082 801850586 803690262 802125168 798731995 800421982
1831.4H00421982J966400m72946o20651k54136o19659p96661J34887J701737J198807
1840.1H02659760R42688K73590Q91571J06735m568024J381531J136246r43909n85327
1848.7H01294861Q8653P8888j32980Q45947Q58765J295471P70187L85895P49512j53732
1858.4H06081467m54941j307144j217957q12912l69873j30310K80914Q45032J37940
1867.1H03052216R52911l71475n41077J748734J444625P2556j076431o31028p34939
1875.7H03916092n09338n57328m6539Q00552P99485J529464R97086R10187K03704k75344
1885.4H07768021j88370j303558o05164j564179k183380O05088J339187J014633Q78144
1894.1H05760422N61218P13501J480713J28021j3885Q4686n84717j081161j599961
$$ plain form
1831.4 800421982 802388382 801915436 801294785 801040649 800420990 799624329 799759216 801460953 802659760
1840.1 802659760 803602448 803876038 804767609 804874344 800306320 801687851 802824097 801880188 801294861
1848.7 801294861 801383514 801462402 801329422 802175369 803034134 804329605 805099792 805485687 806235199 806081467
1858.4 806081467 805626526 804319382 803101425 802288513 801918640 801788330 802069244 802914276 803052216
1867.1 803052216 804005127 803633652 803092575 804841309 806285934 806358490 805282059 804651031 803916092
1875.7 803916092 803406754 802849426 802802887 803603439 804402924 805932388 806929474 807839661 808043365 807768021
1885.4 807768021 807579651 806276093 805670929 804106750 801923370 802528458 803867645 804882278 805760422
1894.1 805760422 806321640 807035141 808515854 808643875 808629990 808714676 808129959 807048798 805448837
1902.7H05448837o21414q24432P7057Q31375O17752J231231J072083O83594L58200
1911.4H08874283Q89053n81283j446000j286621j015396j31073k233276J50680J931916
1920.1H05152283J346359J176681J37406N97000O43692M86603M5395j004639j620026
1928.8H06960754j228942o24695n64652Q1024M26712J328583J398239R96018J027756
1937.5H09800797M16717J30005p98187r39942k508392k788010O55442M00848Q5068
1946.1H04454346P38449J492309J522446J127548O88553J44959J52053k09808p38678
1954.8H09372177j336441j384964r43146j52740P1030P705J145096J317673J334305
1963.5H09430695J033935L43628k8915j238785j298752m85001p70721j204376k74353
$$ plain form
1902.7 805448837 804827423 804002991 804080048 804911423 805529175 806760406 807832489 808516083 808874283
1911.4 808874283 809763336 809182053 807736053 806449432 805434036 805302963 803069687 803220367 805152283
1920.1 805152283 806498642 807675323 807812729 808409729 809053421 809540024 809585419 808580780 806960754
1928.8 806960754 805731812 805107117 804542465 804623489 805050201 806378784 807777023 808773041 809800797
1937.5 809800797 810217514 810347519 809549332 808609390 806100998 803312988 803968430 804369278 804454346
1946.1 804454346 805192795 806685104 808207550 809335098 810023651 810168610 810320663 810110855 809372177
1954.8 809372177 808035736 806650772 805707626 805554886 805625916 805633621 806778717 808096390 809430695
1963.5 809430695 810464630 810808258 810779343 809540558 808241806 807756805 806986084 805781708 805507355
1972.2H05507355M25644O03790J048355J041565J231384J103745O60705m16641p82089
1980.8H10423813q67462j346741r61609j102753o06155L2730O05927J118164J118393
1989.5H08414307J858825J081086j41221l92608n83039r34371j450043j103058q25729
1998.2H05924149m86374L22799P87430Q75702J309128J416244N22766L41645M1351
2006.9H11054840r21326j527252j405868j038208p20749l58505j50681N93643J131897
2015.6H06657791R05228J044082J258851M01077n06516q84323j106796j220627j773376
2024.2H04775391q42743j61438p0877O19278O10122J044541J084900J092529O43921
2032.9H08795624n22843q75702j273345j308747j285858r36279o70548k16598L61557
$$ plain form
1972.2 805507355 805932999 806536789 807585144 808626709 809858093 810961838 811622543 811205902 810423813
1980.8 810423813 809556351 808209610 807248001 806145248 805539093 805571823 806177750 807295914 808414307
1989.5 808414307 810273132 811354218 811212997 810820389 810237350 809302979 807852936 806749878 805924149
1998.2 805924149 805437775 805760574 806548004 807423706 808732834 810149078 810671844 811013489 811054840
2006.9 811054840 810133514 808606262 807200394 806162186 805441437 805082932 804932251 805525894 806657791
2015.6 806657791 807563019 808607101 809865952 810267029 809760513 808876190 807769394 806548767 804775391
2024.2 804775391 803932648 803771210 803700333 804319611 804929733 805974274 807059174 808151703 808795624
2032.9 808795624 808272781 807397079 806123734 804814987 803529129 802592850 801922302 801705704 802067261
2041.6H02067261Q62808J692963J140442O64749K22931j74180m99191j390152j351394
2050.3H03236237j114884m90417n45655N7373Q30002P20063J274719J040268J252670
2059H06260376O71692n62058q77304r24759p52563j426163j086120l57438L33100Q38699
2068.6H02117462R84345J466827P78656M67987M16718R3383m49447r99832j140671
2077.3H03735428j085587m74167k92816O562P5531N88989J483230J287308J082535
2086H06407013K99606n94711o61850m10767r67712j256866p93763k75650L76053L79410
2095.6H02500763R74655J180039R99603R21249L87802J74027o73065q07419r66339
2104.3H04691315j035843m88053l17535K8687K69546R47723R73206Q60443N32761M37164
$$ plain form
2041.6 802067261 802930069 804623032 805763474 806428223 806651154 806476974 805977783 804587631 803236237
2050.3 803236237 802121353 801630936 801085281 801142654 801972656 802692719 803967438 805007706 806260376
2059 806260376 806932068 806370010 805492706 804567947 803815384 802389221 801303101 800945663 801278763 802117462
2068.6 802117462 803101807 804568634 805347290 805815277 806231995 806325378 805875931 804876099 803735428
2077.3 803735428 802649841 802175674 801882858 801889420 801964951 802553940 804037170 805324478 806407013
2086 806407013 806706619 806111908 805450058 805039291 804071579 802814713 802020950 801745300 802121353 802500763
2095.6 802500763 803475418 804655457 805655060 806576309 806964111 807138138 806465073 805657654 804691315
2104.3 804691315 803655472 803167419 802849884 802878571 803148117 804095840 805069046 805929489 806462250 806899414
2113.9H06899414N29556q74633q86155o67801q36944p35703k17361K86636J25122P97425
2123.6H04419556N79681Q17413R38874K56729L31421j16883o62613j314086o58493
2132.3H04591599o07377r91211j0910M55475Q43582O91605J073761J036530L49197
2140.9H07432251K12021l49808p85522j219178p27768n80368o29654J06965K25982
2149.6H03684921L42026P96204J238479J006851N03693j88827l39508l31193j026687
2158.3H05685959r91364o25610k05765l4714M16489N96466O26145J195526J077499
2167H07740631P97577m6768k25296l28140o90842p46308j125411p2403J32598J57166
2176.6H05592804O97098P51114J263580P60040M46167M32053J60370l08304o68869
$$ plain form
2113.9 806899414 807428970 806554337 805668182 805000381 804163437 803427734 803210373 803497009 803622131 804419556
2123.6 804419556 804999237 805816650 806755524 807012253 807343674 807226791 806564178 805250092 804591599
2132.3 804591599 803984222 802993011 802982101 803437576 804281158 804972763 806046524 807083054 807432251
2140.9 807432251 807644272 807294464 806508942 805289764 804561996 803981628 803351974 803458939 803684921
2149.6 803684921 804026947 804823151 806061630 807068481 807572174 807383347 807043839 806712646 805685959
2158.3 805685959 804694595 804068985 803863220 803828506 804244995 804841461 805467606 806663132 807740631
2167 807740631 808538208 808491440 808266144 807938004 807247162 806500854 805375443 805303040 805435638 805592804
2176.6 805592804 806289902 807041016 808304596 809064636 809510803 809942856 810103226 809794922 809126053
2185.3H09126053p60498q21305k76870j95771L33176P08084P63397R86176N91736O96564
2194.9H11150742M18853q9111l14407m11148p19757r24912m12216j49918K75879M92859
2204.6H09316864N48630Q27713J123123J222534P02515j57624q34045q22525q18939
2213.3H11108246l74985m52347o32019K64588O94580R59396Q11691J114884J064071
2221.9H14558105J76774m2801o74820q05512n59311p27234q59603k40021L22342M72488
2231.6H11620407R31397P11135P77054P18613N21164L97110m39530r49707j090011
2240.3H13197632o53153n10788m79660j59149L54996R21326R15985R07898R15069P23725
2249.9H16133881k08970n14678q15278j328659p72934o70776l4256L91922M84085L91159
$$ plain form
2185.3 809126053 808365555 807544250 807267380 807071609 807404785 808112869 808876266 809862442 810454178 811150742
2194.9 811150742 811569595 811480484 811166077 810754929 810035172 809110260 808698044 808548126 808824005 809316864
2204.6 809316864 809865494 810693207 811816330 813038864 813741379 813583755 812749710 811927185 811108246
2213.3 811108246 810733261 810280914 809648895 809913483 810608063 811567459 812379150 813494034 814558105
2221.9 814558105 814734879 814692078 814017258 813211746 812652435 811925201 811065598 810825577 811147919 811620407
2231.6 811620407 812551804 813262939 814039993 814758606 815279770 815676880 815237350 814287643 813197632
2240.3 813197632 812544479 812033691 811554031 811394882 811749878 812671204 813587189 814495087 815410156 816133881
2249.9 816133881 815924911 815410233 814594955 813266296 812493362 811822586 811788330 812180252 812664337 813055496
2259.5H13055496P26242J534500N68619K22778K2812m14657p31507j004104o93588
2268.2H13286591q41828k85721J39618P76367Q58155O28738R42078O04019P56378N3330
2277.9H16917725n74341p88956o84891o26449r25522j89743r4681M40598L69796P31507
2287.5H14575043J379776P26547Q30765j87683o58112j222305j444702o37436q59452
2296.2H12502441j36871L6850L06778M87442R25598P77283J20315O86341k86255n25589
2305.8H14894333j048889j268845m60739q24051o45828q58917K97012N87311R35669
2314.5H11607056J322021K68250P24716n39856j681976j411210j156311n57327n22690
2323.2H08052673o93435n35202N26962r1477J40458N33218R60541R78164j220169j062469
$$ plain form
2259.5 813055496 813781738 815316238 815884857 816107635 816130447 815715790 814984283 813980179 813286591
2268.2 813286591 812444763 812159042 812298660 813075027 813933182 814561920 815503998 816108017 816864395 816917725
2277.9 816917725 816343384 815554428 814869537 814243088 813317566 813127823 813033142 813473740 813843536 814575043
2287.5 814575043 815954819 816681366 817512131 817324448 816666336 815444031 813999329 813361893 812502441
2296.2 812502441 812365570 812402420 812709198 813196640 814122238 814899521 815019836 815706177 815419922 814894333
2305.8 814894333 813845444 812576599 812115860 811291809 810645981 809787064 810084076 810671387 811607056
2314.5 811607056 812929077 813197327 813922043 813382187 811700211 810289001 809132690 808575363 808052673
2323.2 808052673 807359238 806824036 807350998 807259521 807399979 807933197 808893738 809871902 808651733 807589264
2332.8H07589264m52576j22833j048813j088562l38058j005707K63748L16086J52283
2341.5H04264832Q24432J197739j22223K29950J359176m87747J62811P44553k66419
2350.2H07907104j495895j228561R4146k55584j38398j032791j133194Q0948K3880
2358.9H02821655k30179n87234K51083J30768j165771j913071M79126K606354J418915
2367.6H03811646K34603L45765J048660R20868K39181k20413P75681M85153j84708
2376.2H07456436L71781k09351l7918Q41675J432037J127853O19202Q28552O12793
2384.9H13043060O3629o21109m83779m67072p29370l61099k88926j18026K27051N83419
2394.6H10847778L77579L44162M68216J7242j76925m57993n45425o68869l87573m6921
$$ plain form
2332.8 807589264 807136688 807013855 805965042 804876480 804538422 803532715 803796463 804112549 804264832
2341.5 804264832 805089264 806287003 806164780 806394730 807753906 807266159 807428970 808173523 807907104
2350.2 807907104 806411209 805182648 805276794 805021210 804882812 803850021 802716827 802797775 802821655
2358.9 802821655 802591476 802004242 802255325 802386093 801220322 799307251 799786377 802392731 803811646
2367.6 803811646 804046249 804392014 805440674 806361542 806600723 806380310 807155991 807641144 807456436
2376.2 807456436 807828217 807618866 807580948 808422623 809854660 810982513 811601715 812430267 813043060
2384.9 813043060 813106689 812485580 812001801 811534729 810805359 810444260 810155334 810037308 810264359 810847778
2394.6 810847778 811225357 811569519 812037735 812054977 811878052 811420059 810874634 810205765 809818192 809771271
2404.2H09771271m41056j80511N03845M76914k12174k6474N76248J66932n16511l71856
2413.8H09746628l62015n26810P2403l46985o37512l36075j22528K34375J06430K21329
2423.5H08049240j41601j7548J06201l40652l33405m57535j41601k27204k42385l97034
2433.1H05856476k16904J38703m22364J83563K25754k67334l87039k34756O790m68216
2442.8H04414673l12729m75159m40063k18811j40000K3270l37753J55487L61328N2338
2452.4H03082581r3079k57034l25165j18637l8300o66504l91235J17416p0419n40771
2462.1H00698853n45578O942K35062L23868J28555P4921m10080m32129k28424o15998
2471.7G99235992j77841m91562n91430L5400J3580j05590j62964O10L7079K16064L22647
$$ plain form
2404.2 809771271 809330215 809149704 809653549 810130463 809918289 809891815 810468063 810634995 810118484 809746628
2413.8 809746628 809384613 808857803 808930206 808583221 807945709 807609634 807487106 807721481 807827911 808049240
2423.5 808049240 807907639 807890091 807996292 807655640 807322235 806864700 806723099 806495895 806253510 805856476
2433.1 805856476 805639572 805778275 805355911 805539474 805765228 805497894 805110855 804876099 804882889 804414673
2442.8 804414673 804101944 803626785 803186722 802967911 802827911 802851181 802513428 802668915 803030243 803082581
2452.4 803082581 802989502 802732468 802407303 802288666 802250366 801583862 801192627 801310043 801239624 800698853
2462.1 800698853 800153275 800160217 800395279 800719147 800847702 800922623 800512543 800080414 799851990 799235992
2471.7 799235992 799058151 798566589 797975159 798010559 798024139 797918549 797755585 797756195 797793274 798009338 798331985
2482.3G98331985j6784m87595l69568k75650m63409k79083m47846n9509J72882J82190
2492G96287613K15378l27378j09176K84271L60947k97165o80695o53381p87430j06277
2501.6G94186707J59072j49307k96936K60315L31650J44272L03955k85111j94626M807
2511.2G94464798K3499k92893n50079j55030l30276m30222l85971O5155L19367M30450
2520.9G93158798K17896j65558N2566l74832q9874j73340n27801n39170o10733J14517
2530.5G91062469n71212n24903K28424J13831N22614M10308O3858k48336l44468o39419
2540.2G90073166q45032o64062m27399L3722k15302j67541M0054J15738L97263K61764
2549.8G88602371K76032L0517n72967q47931r05914p73774m42733l73459j88751l0289
$$ plain form
2482.3 798331985 798315201 797827606 797458038 797182388 796718979 796439896 795992050 795932541 796105423 796287613
2492 796287613 796502991 796175613 796066437 796350708 796711655 796414490 795733795 795080414 794292984 794186707
2501.6 794186707 794345779 794196472 793899536 794159851 794491501 794635773 794939728 794654617 794459991 794464798
2511.2 794464798 794488297 794195404 793645325 793490295 793160019 792729797 792343826 792408981 792728348 793158798
2520.9 793158798 793376694 793211136 793263702 792888870 792798996 792625656 792097855 791558685 790947952 791062469
2530.5 791062469 790491257 789966354 790194778 790308609 790831223 791241531 791305389 791057053 790712585 790073166
2540.2 790073166 789228134 788564072 788136673 788170395 787955093 787787552 787827606 787943344 788340607 788602371
2549.8 788602371 788878403 788908920 788335953 787488022 786582108 785808334 785365601 784992142 784803391 784773102
2559.5G84773102P4844M82178M24805K21328K3651J47629l59573j113129p29294o44073
2569.1G83301468m34799m76837l93525J05591J78757N29098O47965L73382l75824m76074
2578.7G82979202m58526p16477o79092r67713n07049k34146J05285K11182M8141O17066
2588.4G80397873L35312J79138R6817k79007l33557k53906q13370j001282n5923l35160
2598G77936935l71399j41448L3035P33871L57132K58789M48914k80533j181488q27255
2607.7G76966553l74222m88968n50613n51606K31400J51367m3411L79791M38538J1673
2617.3G76170502m39835j67847p31048p42111o27289j254730r15909l57743K27967
2626G71161957K65579L357l0899J30768j97602m04968P706l83911o90918j103134q68378
$$ plain form
2559.5 784773102 784847946 785330124 785754929 785976257 785999908 786147537 785787964 784674835 783945541 783301468
2569.1 783301468 782866669 782389832 781996307 782101898 782280655 782809753 783457718 783831100 783455276 782979202
2578.7 782979202 782520676 781804199 781125107 780157394 779650345 779416199 779521484 779732666 779780807 780397873
2588.4 780397873 780733185 780912323 781009140 780730133 780396576 780142670 779329300 778328018 778272095 777936935
2598 777936935 777565536 777424088 777457123 778190994 778548126 778806915 779255829 778975296 777793808 776966553
2607.7 776966553 776592331 776103363 775552750 775001144 775232544 775383911 775340500 775720291 776158829 776170502
2617.3 776170502 775730667 775562820 774831772 774089661 773462372 772207642 771291733 770933990 771161957
2626 771161957 771427536 771430893 771399994 771530762 771333160 770928192 770935898 770551987 769861069 768757935 767889557
2636.6G67889557p06711r09729q6594Q0796L65982L61633P1182K01264L0365n93643
2646.3G66704102j182023p93380r30176q10471l53546l93524o26831m31290L33634
2654.9G61516495j35956K65655N78843k47193n58014p27310n91278j143341q24661
2663.6G58133240m59671p11975r7733Q0109J75094K34299L30048J34506o1340j81580
2673.3G57574997o08673j046143j604767p27768Q3771k13089m36249l6163O90384L51639
2682.9G54027939m9286o790K45437j18866j101913j447525r00574k71225p50427p46689
2692.5G48880081l02582j12686L47672O96029O90232J7395m73252p13882p83844r79233
2702.2G47265930q83331k75040n38940o84052j68915K82898L14560L21656J24893j87454
$$ plain form
2636.6 767889557 767182846 766273117 766186523 766267319 766633301 766994934 767066116 767267380 767297745 766704102
2646.3 766704102 765522079 764728699 763798523 762988052 762634506 762240982 761614151 761182861 761516495
2654.9 761516495 761380539 761646194 762225037 761977844 761419830 760692520 760101242 758957901 758133240
2663.6 758133240 757673569 756961594 756863861 756943970 757119064 757353363 757683411 757817917 757756577 757574997
2673.3 757574997 756966324 755920181 754315414 753587646 753671417 753458328 753022079 752985916 753676300 754027939
2682.9 754027939 753978653 753971863 754217300 754098434 752996521 751548996 750648422 750377197 749626770 748880081
2692.5 748880081 748577499 748464813 748812485 749508514 750198746 750216141 749742889 749029007 748245163 747265930
2702.2 747265930 746382599 746107559 745568619 744884567 744715652 744998550 745313110 745634766 745759659 745572205
2711.8G45572205l30964q96225p75375o80771r21554q34427o77796n28106q4992O38809
2721.5G40480804j48239k19345Q96454O49414k88238q56934q23898j341324r58100
2730.2G37390594j48391m23355k55204l4332J41449K69623K64053P6905K9830j36871
2739.8G37174301o86493q41903j035843n61219m5852k60926j31759L17993K20566L38058
2749.4G34486923N71900n46952n56564j82953o40869n66940n51377o40106j038818
2758.1G30334244k90375K60468J28784O06689J6022n3482M03290R155l74832k14005
2767.8G30825958l01666p08618o89011o15921l96652k95105K23389O4239k78549L46298
2777.4G28174362Q927l15400n35888m50058l22953p85217p27081n77316k61460P1259
$$ plain form
2711.8 745572205 745241241 744345016 743569641 742888870 741967316 741132889 740455093 739926987 739841995 740480804
2721.5 740480804 740332565 740113220 741009674 741659088 741370850 740513916 739690018 738348694 737390594
2730.2 737390594 737242203 736818848 736563644 736529312 736670761 736940384 737204437 737281342 737311172 737174301
2739.8 737174301 736487808 735645905 734610062 734048843 734002991 733742065 733610306 733928299 734148865 734486923
2749.4 734486923 735058823 734511871 733955307 733772354 733131485 732564545 732013168 731373062 730334244
2758.1 730334244 730043869 730304337 730433121 731039810 731055832 731002350 731405640 731414795 731039963 730825958
2767.8 730825958 730524292 729815674 729126663 728510742 728114090 727818985 728042374 728106613 727828064 728174362
2777.4 728174362 728183289 727867889 727332001 726881943 726558990 725773773 725046692 724469376 724207916 724279175
2787G24279175K84653j45264k60849k38190q75168p14416l99933n2872n58471p42264
2796.7G20576401l41492q65555q57239r62753n50842K18811K79388n46569q51136J5793
2806.3G16114807m78668q02231q79898q45261p25250j068649o06537o80466l77884
2815G09649963l06778o09817l42331n81436m72489q39843r13163o58264j091842j054612
2824.7G02779388r81750p52640m20303p05109r18884m66004j97906p32422j391067
2833.3F96213303j040039o07224j116104j488037j632843j149903o88629r76715j273804
2842F86240005j190261r11484j193695j238556j304855j331635j498108k107773j859741
2850.7F73603897j384506q03986r05990j053391r66110r37500O2790k0294n64499r61609
$$ plain form
2787 724279175 724563828 724418564 724157715 723919525 723044357 722329941 721930008 721877136 721318665 720576401
2796.7 720576401 720234909 719369354 718512115 717549362 716998520 717217331 717496719 716950150 716099014 716114807
2806.3 716114807 715636139 714833908 713954010 713108749 712383499 711314850 710708313 710027847 709649963
2815 709649963 709343185 708733368 708391037 707809601 707337112 706497269 705584106 704925842 703834000 702779388
2824.7 702779388 701797638 701044998 700624695 699919586 699000702 698534698 698336792 697604370 696213303
2833.3 696213303 695173264 694566040 693449936 691961899 690329056 689179153 688490524 687513809 686240005
2842 686240005 685049744 684138260 682944565 681706009 680401154 679069519 677571411 675463638 673603897
2850.7 673603897 672219391 671415405 670509415 669456024 668489914 667552414 667615204 667594910 667030411 666068802
2860.3F66068802j256561j194611j303635j161880j505585j330414j542511j927948
2868.1F54845657j342315j424637j362152j258927j234817j353531j755066k112884
2875.8F43001328k322770j929016j973190j778908j290016j549225j746826r53827
2883.5F29457550n2605n95512j162758j014061p82242p26967m68521k25410r39789
2892.2F23489685p89566P8239m921l36074l33481k94418k81411j82800n32951o30799
2901.8F20181503j2207j40037p97920p39937q56209p43904k37618p47986j081733j005860
2911.4F13818092n35545l13797j196175j528358j809502k316589k036705j270294j096993
2920.1F01714134j202965j255111j239395k96479k48832p44782p36503n09568j55754
$$ plain form
2860.3 666068802 664812241 663617630 662313995 661152115 659646530 658316116 656773605 654845657
2868.1 654845657 653503342 652078705 650716553 649457626 648222809 646869278 645114212 643001328
2875.8 643001328 640678558 638749542 636776352 634997444 633707428 632158203 630411377 629457550
2883.5 629457550 629404945 628809433 627646675 626632614 625850372 625123405 624654884 624429474 623489685
2892.2 623489685 622700119 622778358 622773437 622437363 622103882 621809464 621528053 621345253 620812302 620181503
2901.8 620181503 620169296 620029259 619231339 618491402 617635193 616891289 616653671 615905685 614823952 613818092
2911.4 613818092 613282547 612968750 611772575 610244217 608434715 606118126 604081421 602811127 601714134
2920.1 601714134 600511169 599256058 598016663 597720184 597471352 596726570 595990067 595480499 595324745
2928.8E95324745n38101o94237m49142R18121J385384L21083P07359J069183J498452
2937.5E99542847J833725J816330K005920J754990J895637J879425J768341J878166
2945.2F14375381J985741J866150J528816J976471K328415J972199J936378J992989
2952.9F29962540J599540J605111J581382J591263K180023J791802J253357J865463
2960.6F43430481K026367J619568J747437J944961K084808J690522J185226J355972
2968.3F57085342J408310J228867R86481J571197J381912M75006Q62351J372833J756821
2977F68129120J487045J323853R57794P86743J096573L66745R30710J012802P33261
2985.7F76824646J281815Q25958O45294P20825J037674P95059O11496L61100p0877
$$ plain form
2928.8 595324745 594786644 594092407 593643265 594561386 595946770 596267853 596975212 598044395 599542847
2937.5 599542847 601376572 603192902 605198822 606953812 608849449 610728874 612497215 614375381
2945.2 614375381 616361122 618227272 619756088 621732559 624060974 626033173 627969551 629962540
2952.9 629962540 631562080 633167191 634748573 636339836 638519859 640311661 641565018 643430481
2960.6 643430481 645456848 647076416 648823853 650768814 652853622 654544144 655729370 657085342
2968.3 657085342 658493652 659722519 660709000 662280197 663662109 664137115 664999466 666372299 668129120
2977 668129120 669616165 670940018 671897812 672684555 673781128 674147873 675078583 676091385 676824646
2985.7 676824646 678106461 678932419 679577713 680298538 681336212 682131271 682742767 683103867 683032990
2994.4F83032990N87387L54461K35062J90658J05973M35943J97373L26843m425n54657
3004F84907608j45950O63223O47202k70844q90579k38190K22397o93207p04727k65427
3013.7F83231506K9374m05350j168823m03367J46866K56424m09851j154480r31091
3022.4F79191208p79648q53348j191101q90121m46701l89176n04379n67474m23432
3031F73145828m72793l87497m85611r10874j373977j069260o98547o44837m93850p27234
3040.7F65881348j008606j191330m86756m60662j252671j261062p87201m66996j048507
3049.4F57917557q98285j260910j207657m34265j111374p92008o16760o64749p41196
3058F50190353r00421n41610j058960j208802j167221q27179p92160j126632j143952
$$ plain form
2994.4 683032990 683620377 683974838 684209900 684400558 684506531 684942474 685139847 685466690 685462265 684907608
3004 684907608 684761658 685424881 686072083 685801239 684910660 684672470 684894867 684201660 683496933 683231506
3013.7 683231506 683260880 682855530 681686707 681283340 681430206 681686630 681276779 680122299 679191208
3022.4 679191208 678411560 677558212 676367111 675476990 675030289 674641113 674136734 673569260 673145828
3031 673145828 672673035 672285538 671799927 670889053 669515076 668445816 667747269 667102432 666608582 665881348
3040.7 665881348 664872742 663681412 663194656 662733994 661481323 660220261 659433060 658966064 657917557
3049.4 657917557 657019272 655758362 654550705 654116440 653005066 652213058 651596298 650931549 650190353
3058 650190353 649289932 648748322 647689362 646480560 645313339 644486160 643694000 642567368 641423416
3066.7F41423416r28879m49600j211967j038475l88527q30536j188584r65042p75871
3075.4F33645935j125565q39729j293983j139679q07343j147270o84891r14039n34096
3084.1F25159340m96483n38673p58477j441574j116638j430282r42650p72705r53713
3092.7F16708145r10911j138993m38614p62558j110534r98345r23118j210137j331863
3101.4F07883072q37593q73604m31366j026955j257896q80127j265564q37173p90024
3110.1E99682770p54853n48400o67916j089821j070747j126633j722793j331597r31434
3118.8E90438576j0567l5515j005020j200867j355514p62940o89354q64448q87413
3127.5E83626938j018143r44633j234131r66797o96907r27887j310730q71353k32277
$$ plain form
3066.7 641423416 640494537 640044937 638832970 637794495 637405968 636575432 635386848 634421806 633645935
3075.4 633645935 632520370 631680641 630386658 629246979 628439636 627292366 626607475 625693436 625159340
3084.1 625159340 624662857 624124184 623365707 621924133 620807495 619377213 618434563 617661858 616708145
3092.7 616708145 615797234 614658241 614219627 613457069 612346535 611348190 610425072 609214935 607883072
3101.4 607883072 607045479 606171875 605740509 604713554 603455658 602575531 601309967 600472794 599682770
3110.1 599682770 598927917 598379517 597711601 596621780 595551033 594424400 592701607 591370010 590438576
3118.8 590438576 590428009 590392494 589387474 588186607 586831093 586068153 585378799 584514351 583626938
3127.5 583626938 582608795 581664162 580430031 579463234 578766327 577838440 576527710 575656357 575424080
3136.1E75424080o66390q19130p66944j042099j290551j190109j142158q79631n68200
3144.8E67058868j053085j072349o66352k71377m23317j081238q70056p84416j406785
3153.5E59429893j464195r66377o76765n70679r93195j171303o42929l90014j73722
3162.2E52380714n20401j286010j199570p35550p30667q92143j139717j189270q32177
3170.9E43855209p31926n19981m08592o28433j001206q75206l48205q09327r56077
3179.5E37576256p10297r34715j311150j041374o06155q87757k14500L2005m49447
3188.2E31452866q01506j013985p67021j259461q92334l99589r75724j157074p99789
3196.9E23386383l96461o93741p45011o98127m85039j47553l65715o81190j016693
$$ plain form
3136.1 575424080 574757690 573938560 573171616 572129517 570838966 569648857 568506699 567627068 567058868
3144.8 567058868 566005783 564933434 564267082 563995705 563572388 562491150 561621094 560836678 559429893
3153.5 559429893 557965698 556999321 556322556 555751877 554758682 553587379 552944450 552554436 552380714
3162.2 552380714 551860313 550574303 549374733 548639183 547908516 547016373 545876656 544687386 543855209
3170.9 543855209 543123283 542603302 542194710 541566277 540565071 539689865 539341660 538532333 537576256
3179.5 537576256 536865959 535931244 534620094 533578720 532972565 532084808 531870308 531902313 531452866
3188.2 531452866 530651360 529637375 528870354 527610893 526718559 526318970 525343246 524186172 523386383
3196.9 523386383 522989922 522296181 521551170 520853043 520368004 520220451 519854736 519173546 518156853
3205.6E18156853r18808q38547o60934o95611p95478l37563q8730k17628q45108q52356
3215.2E11906090m71802k08969m40865j146660r44824m79393m15306q81347q62465
3223.9E06054459r54628j021805j95160m0856L5744n67055o07452j32294j013412r74655
3233.5E00582886n86548n39208o24580r03015n46265r6054m46625o18858J09978j373
3243.2D96330338m18587q74901j100845m33388j88866m90837q72307n04150m59061
3251.9D90987396o84013m86908o50063j69983J60866k31895l55759l63388p58667r24339
3261.5D86523247o19202k97089j38053l67127k19650j35574q9684q1596m68026n18646
3271.2D83588600o29425q32901j013336k15912N8899o34193l5820j5564o57196q08220
$$ plain form
3205.6 518156853 517238045 516399498 515738564 515042953 514247475 513909912 513821182 513603554 512758446 511906090
3215.2 511906090 511434288 511225319 510784454 509637794 508692970 508213577 507798271 506916924 506054459
3223.9 506054459 505099831 504078026 503882866 503842010 503877754 503310699 502703247 502570953 501557541 500582886
3233.5 500582886 499996338 499457130 498832550 497929535 497383270 497287216 496840591 496221733 496331711 496330338
3243.2 496330338 495911751 495036850 493936005 493502617 493313751 492822914 491950607 491446457 490987396
3251.9 490987396 490303383 489816475 489166412 488996429 489157295 488925400 488569641 488206253 487447586 486523247
3261.5 486523247 485904045 485606956 485468903 485101776 484882126 484746552 484656868 484575272 484107246 483588600
3271.2 483588600 482959175 482126274 481112938 480897026 480955925 480321732 480285912 480270348 479613152 478804932
3280.8D78804932m55437K35710K22435l13110m60549l06968p01485o60362k15531j34277
3290.4D76015358l23601q23707n70870n1040j20965l41644m0283J60141k47383p33452
3300.1D72922554q88557o40984n63507o0196J16997k78588o99157r20601l22151n5695
3309.7D68610115l8185l07770n22270o85654n95741j46179p82013p21779o00166o71349
3319.4D63539009j41945N1308j31149o80619l55568m53720l04718k18010r48944m33845
3329D59921799m72145o91872n51720r7770k96288n76248K47612p40280q27103J3504
3338.7D55929489m92210p78313o98357k98347n44853r00650n87502o2179l77045r46884
3348.3D50243149p31888j40686J84784o99768r26552q24547o10657m9819n51110o74171
$$ plain form
3280.8 478804932 478349495 478585205 478807640 478494530 478033981 477727013 477025528 476365166 476149635 476015358
3290.4 476015358 475691757 474868050 474297180 474246140 474125175 473783531 473743248 473903389 473656006 472922554
3300.1 472922554 472033997 471393013 470829506 470769310 470886307 470607719 469908562 468987961 468665810 468610115
3309.7 468610115 468571930 468264160 467741890 467056236 466460495 466314316 465532303 464810524 464210358 463539009
3319.4 463539009 463397064 463448372 463317223 462636604 462281036 461827316 461522598 461304588 460355644 459921799
3329 459921799 459449654 458757782 458206062 458108292 457812004 457235756 457483368 456743088 455915985 455929489
3338.7 455929489 455437279 454658966 453960609 453662262 453117409 452216759 451629257 451567078 451190033 450243149
3348.3 450243149 449511261 449370575 449555359 448855591 447929039 447104492 446493835 446444016 445892906 445218735
3357.9D45218735n75218l69950k17743k25601k18162l08228o42204j256027o03295
3366.6D40802307m18243m03786m13055r95140n50957j8883L17421o51512p28760N72
3376.3D36939964p28149m93088m78325l62892j70784o65245q55637r50203k04238j57624
3385.9D31873779j77765K43073j60027N5924j03264q35266m29230p6713k78092j51291
3395.6D29961128j15928n53132o67343P8354J83983k84042l27263j30615q2589o91719
3405.2D27370834k65579K30446j56250M8256k64206p74536n45426L44391N01519k85035
3414.8D26204414n04837l78647J32599N70336J26114q80318m80461L65753K39830J13564
3424.5D25508347j55068n3635k96630l9559N00527j78757k17362Q4496R9335J7585
$$ plain form
3357.9 445218735 444643517 444273567 444055824 443830223 443612061 443303833 442661629 441405602 440802307
3366.6 440802307 440384064 439980278 439567223 438572083 438021126 438002243 438319664 437668152 436939392 436939964
3376.3 436939964 436211815 435718727 435240402 434877510 434706726 434041481 433185844 432235641 432031403 431873779
3385.9 431873779 431696014 431939087 431779060 431834984 431731720 430896454 430467224 430390511 430112419 429961128
3395.6 429961128 429845200 429292068 428624725 428703079 428887062 428603020 428275757 428145142 428062553 427370834
3405.2 427370834 427105255 427335701 427179451 427227707 426963501 426188965 425643539 425987930 426489449 426204414
3414.8 426204414 425699577 425320930 425453529 426023865 426149979 425269661 424789200 425154953 425394783 425508347
3424.5 425508347 425353279 425299644 425003014 424963455 425463982 425285225 425067863 425152359 425251694 425269279
3434.1D25269279k56576l20129M39834O69708L7346Q3046L02544O52923M120R2697
3443.8D26974792M88663K02942Q83751p32536o00472J005860L99131Q0948Q4381M70276
3453.4D29257736N73082P15904M20304N5961L75710R1743M1314k3499N60989O65055
3463.1D32734299L1128J74217N71976P39936L12844P01599L64914j09711L10593L84674
3472.7D36216469R84497P45354R8991L64037L56521J73912O76003L82805J57089N99632
3482.3D40755310K66037J142578N59578J34316J221656K93160K18315Q17833R16672
3491D46325455O35872J48925P0305K09236K68441k36702N33905J163368J194763Q47931
3500.7D51161499J25961M32396L16201p0458K28729N43137R47227J764946J39351p51724
$$ plain form
3434.1 425269279 425012703 424692574 425132408 425802116 425839462 425922508 426225052 426877975 426882095 426974792
3443.8 426974792 427463455 427666397 428550148 427817612 427217140 428223000 428622131 428703079 428787460 429257736
3453.4 429257736 429830818 430546722 430967026 431022987 431398697 431490440 431531754 431508255 432069244 432734299
3463.1 432734299 432765427 432939644 433511620 434251556 434564400 435265999 435630913 435521202 435831795 436216469
3472.7 436216469 437200966 437946320 438045311 438409348 438765869 438939781 439615784 439998589 440155678 440755310
3482.3 440755310 441021347 442163925 442723503 442857819 444079475 444372635 444590950 445408783 446325455
3491 446325455 446961327 447110252 447180557 447389793 447658234 447421532 447955437 449118805 450313568 451161499
3500.7 451161499 451287460 451719856 452036057 451965599 452194328 452737465 453684692 455449638 455588989 454837265
3510.3D54837265J527405J106148R53254O12450K61459O24352J06163O01806N78919
3519D61209221J038055R18694O07681N29328m10004O94198Q97713O21071O37283N73578
3528.6D67316818L01628L99704N12162R28154J821136N12009J178894O22291p18536
3537.3D72874260J250267R48715J298180J061897Q67157P15218N23224O45523N0926
3546D80235367J478424o50826P09496K010345J458664J644135j075516J095963J007843
3554.7D87913895J431503J675911p03316J444855J486931Q51860l4905K026673K262878
3563.4D98356285k1706L229142l53661l10554N65033q75931L247413J935387J745567
3572E07516975J034279P27730R58710J394806J902160N85480L039475J625785J44387
$$ plain form
3510.3 454837265 456364670 457470818 458424072 459036522 459297981 459922333 460028496 460630302 461209221
3519 461209221 462247276 463165970 463773651 464302979 463892975 464587173 465484886 466105957 466743240 467316818
3528.6 467316818 467618446 468018150 468530312 469458466 471279602 471791611 472970505 473592796 472874260
3537.3 472874260 474124527 475073242 476371422 477433319 478300476 479015694 479538918 480184441 480235367
3546 480235367 481713791 481062965 481772461 483782806 485241470 486885605 485810089 486906052 487913895
3554.7 487913895 489345398 491021309 490317993 491762848 493249779 494101639 494066734 496093407 498356285
3563.4 498356285 498334579 501563721 501210060 500899506 501464539 500588608 503836021 505771408 507516975
3572 507516975 508551254 509278984 510237694 511632500 513534660 514120140 517159615 518785400 518929787
3580.7E18929787J950912J921692R99184K47650L726044J272010j397018J143761q53119
3589.4E27940903L506622L427238L170777O54106m4136L213882j510315K700539L594894
3598.1E46654510n47409J956902J486969J994514K844391J872902J291695K866745
3605.8E60421219J915016k631302L234711q75244O74171Q601036o17256l091202M282761
3614.5E71913910o9885M676742L885918r41086J948853r80874Q78602L635826K824135
3623.1E87772141J710472J870117K226677K446060O005783l609886j1642075O952858
3630.9E93732147O697693N946388K04048k392082K515641L163681K694015J08833K75269
3639.5F12945633K222137K975655N41573k4643K537269L408547N521011l082848l876304
$$ plain form
3580.7 518929787 520880699 522802391 523801575 524049225 527775269 529047279 527650261 528794022 527940903
3589.4 527940903 531447525 534874763 538045540 538699646 538655510 541869392 540359077 543059616 546654510
3598.1 546654510 546107101 548064003 549550972 551545486 554389877 556262779 557554474 560421219
3605.8 560421219 562336235 559704933 562939644 562064400 562738571 571339607 570722351 567631149 571913910
3614.5 571913910 571844025 576520767 580406685 579465599 581414452 580433578 581312180 584948006 587772141
3623.1 587772141 589482613 591352730 593579407 596025467 602031250 598421364 586779289 593732147
3630.9 593732147 600429840 606376228 606580276 604188194 606703835 609867516 612561531 612670364 612945633
3639.5 612945633 615167770 618143425 618684998 618660355 621197624 624606171 630127182 627044334 623168030
3648.2F23168030O158180l039894l746147K480163P183533L967476L300667M266166
3655.9F43738174r578132J781959N914765K077560J712341M84543J822510Q92410J511002
3664.6F50357132J706696O96411L997192J031265k157821N2108n989532M124985R230194
3673.3F63048630P025680p358780j6835861P103195Q774262M740982k117157O77338
3681F65058289K965850J587067J581116L84826Q12912M363480N015488j1158295l098373
3689.7F67512360Q734512n184937J236878N659485P54089K217941L83759m39453J253204
3698.4F82127838Q87146K481613J373062n811233q18100N608139J328278N8364J334076
3707F88569183K523423K385559q461075M694443M420776j3793716N554962N810547
$$ plain form
3648.2 623168030 629326210 626286316 622540169 625020332 632203865 636171341 639472008 643738174
3655.9 643738174 634160042 635942001 641856766 643934326 645646667 646131210 647953720 648846130 650357132
3664.6 650357132 652063828 652760239 656757431 657788696 655630875 655682983 649693451 653818436 663048630
3673.3 663048630 670074310 662715530 645879669 652982864 661757126 666498108 664380951 665058289
3681 665058289 668024139 669611206 671192322 671577148 672390060 676753540 681769028 670610733 667512360
3689.7 667512360 676246872 671061935 672298813 677958298 678712387 680930328 681314087 680874634 682127838
3698.4 682127838 683014984 685496597 686869659 681058426 680240326 685848465 687176743 687235107 688569183
3707 688569183 691092606 693478165 685017090 689711533 694132309 680338593 685893555 691704102
3714.8F91704102J342010R47952J834259Q1787m050598J612015N880585m791794m026794
3723.4F90533524O723480J124191r60464k771378N16892M358139J354980N928650l906632
3732.1G02901382p005233J0412903L60641j0689850l06549K386704Q32061L688736
3739.8G02580795L792038m048691L710175J1562576j6179809j4239960J3233795O714630
3747.5G07125549O244278n897522j1144867J3028183o376037n953598O616211N122070
3755.3G08764267L294754n514526L025589M201126q430863J166764N570449J681061
3763G13758621M94232K942505n033111m692688M773330N155411j655731r294510M322510
3771.7G10770569M456024O12564L57208o48803J459808N78537K361526j862030p672882
$$ plain form
3714.8 691704102 693046112 693994064 695828323 695910110 691859512 693471527 699352112 694560318 690533524
3723.4 690533524 697257004 698381195 697420731 694649353 695166245 699524384 700879364 706808014 702901382
3732.1 702901382 695896149 706309052 706669693 695979843 695673294 698059998 698892059 702580795
3739.8 702580795 706372833 702324142 706034317 717596893 701417084 687177124 700410919 707125549
3747.5 707125549 713369827 707472305 696327438 709355621 702979584 697025986 703642197 708764267
3755.3 708764267 712059021 706544495 709570084 713771210 705340347 706507111 712077560 713758621
3763 713758621 714252853 717195358 712162247 707469559 712242889 717398300 715742569 706448059 710770569
3771.7 710770569 715226593 715839157 716196365 715547562 717007370 717585907 719947433 718085403 710412521
3780.3G10412521M408875L102722J648407J815414l754959o86874J369553J084518
3788G19400177J142883l57208l97720j49536P06253Q4076J704635L159638m762802
3796.7G20530396l876267K892990M660568N150834r260636q544311N708541K860413
3804.4G20122528M818726N947418j0826264l903732N253449K115554J238327J009751
3812.2G25775757L58200J331863M535828m572144j2952499P559967O128159M222107
3819.9G32387238j199494j9397659M986572O472092L148346K854233j752930m650498
3827.6G22847900K035523K804565K834931Q10547q595505M457474P336425q865051
3835.3G25666809K1210R364776j0128097m284363Q118820o333618J570664P940902
$$ plain form
3780.3 710412521 714821396 717924118 719572525 721387939 717632980 716946106 718315659 719400177
3788 719400177 720543060 720185852 719788132 719638596 720344849 720428925 722133560 725293198 720530396
3796.7 720530396 716654129 719547119 724207687 729358521 720097885 711553574 717262115 720122528
3804.4 720122528 724941254 730888672 720062408 716158676 721412125 723527679 724766006 725775757
3812.2 725775757 726133957 727465820 732001648 727429504 714477005 722036972 728165131 732387238
3819.9 732387238 731187744 711790085 716776657 723248749 726397095 729251328 727498398 722847900
3827.6 722847900 724883423 727687988 730522919 731333466 722737961 727195435 734531860 725666809
3835.3 725666809 725688019 735052795 724924698 720640335 728759155 722425537 723996201 731937103
3843G31937103l438492k361526M309921R76639p18460J921921n91736K204437N334396
3851.7G39574203q601303k104797j7193909N769425J2697754m51660j305314K482148
3859.4G30866547K832031K046127o782226O77642O254578p054748l029175N854873
3867.1G31665649N949326N129623j2219467q474121O115341O675110K129440j0160827
3874.8G26810074K481460M498139K82135K521438L397217p080841n630722P526550
3882.6G34805450J729126J195603M136505j2187042K195739M519577O23246L634033
3890.3G40652237k224350r584351L041001M422683q11462K606583J993103K500229
3898G42595673L32718j0924836N514069J54877o813965N298767l105087k090226J642228
$$ plain form
3843 731937103 728498611 726137085 730447006 731423645 730705185 732627106 732035370 734239807 739574203
3851.7 739574203 730972900 728868103 711674194 717443619 730141373 729689713 728384399 730866547
3859.4 730866547 733698578 735744705 728962479 729640121 735894699 728839951 725810776 731665649
3867.1 731665649 737614975 742744598 730525131 722051010 728166351 734841461 736970901 726810074
3874.8 726810074 729291534 733789673 734071808 736593246 739990463 732909622 727278900 734805450
3882.6 734805450 736534576 737730179 741866684 729679642 731875381 736394958 737018204 740652237
3890.3 740652237 738427887 728843536 731884537 736307220 735495758 738102341 740095444 742595673
3898 742595673 742928391 732003555 737517624 737672501 730858536 736157303 733052216 730961990 732604218
3906.7G32604218K154769K534485M63715N24597M27246N38254n69458q51135J118774
3915.3G38945465J310806m888916k293777O370315p2784l972931K393494J729355J233902
3924G40754929l174744k751846K655182J786880J212921j520233m55933J743775l110657
3932.7G37140274m30222K006150L40652J090775O31408q48617o14014P5073J801529
3941.4G41193008R95713m428788q40530J311493J169586J767655k426300J037368J302567
3950.1G41081772j634140K153244l55683j524124m51736K6245Q12073m73862L65448
3958.7G39999237k60849M57153Q26645j145248N56183Q93554m08172l45154O16608
3967.4G41189957K25753j038436J17492J072083M9438l74908J94626L52325J47705
$$ plain form
3906.7 732604218 734758987 737293472 737757187 738281784 738709030 739247284 738677826 737826691 738945465
3915.3 738945465 740256271 735367355 733073578 739443893 739371109 735398178 737791672 739521027 740754929
3924 740754929 737580185 734828339 737483521 739270401 740483322 738963089 738507156 740250931 737140274
3932.7 737140274 736710052 738716202 739056854 740147629 740779037 739930420 739316406 739391479 741193008
3941.4 741193008 742188721 737759933 736919403 738230896 739400482 741168137 738741837 739779205 741081772
3950.1 741081772 739447632 741600876 741245193 739721069 739269333 739295578 740107651 739633789 739999237
3958.7 739999237 739738388 740195541 741022186 739876938 740433121 741326675 740918503 740573349 741189957
3967.4 741189957 741415710 740377274 740494766 741566849 741616287 741241379 741436005 741788330 741936035
3976.1G41936035k26745N3939J15433L1662J30158J81198M26483p9041j05056m47541
3985.7G42016525o93283l10287M60815J068573l58658M25949J161042m04587r46961
3994.4G42419128j182479m52424N97992P88727m1733j01013
4000.2G42028198
$$ plain form
3976.1 741936035 741709290 741763229 741878662 741910324 742040482 742221680 742648163 742569122 742464066 742016525
3985.7 742016525 741323242 741012955 741473770 742542343 742183685 742609634 743770676 743366089 742419128
3994.4 742419128 741236649 740784225 741382217 742170944 742129211 742028198
4000.2 742028198
##END=$$ End of the data block
