##TITLE=$$ Begin of the data block
##JCAMP-DX=5.00 $$ ACD/SpecManager v 10.08
##SPECTROMETER/DATA SYSTEM=Varian
##DATE=20 Nov 2012 14:35:48
##DATA TYPE=INFRARED SPECTRUM
##DATA CLASS=XYDATA
##ORIGIN=
##OWNER=
##NPOINTS=3735
##FIRSTX=399.26403809
##LASTX=4000.35498047
##MAXX=4000.35498047
##MINX=399.26403809
##MAXY=81.82418060
##MINY=37.52431107
##XFACTOR=1.0000000000
##YFACTOR=0.000000100000000
##FIRSTY=62.58928299
##DELTAX=0.96440572
##XUNITS=1/CM
##YUNITS=TRANSMITTANCE
##XYDATA=(X++(Y..Y))
399.3F25892830K152901J889228n241432q773079k929535k501182r26514l458671J832695
407.9F07937241K276687o1760J864510M514389R674911M538575k559700k512513n588798
416.6F20083542r969177m350891J9826812M955254n196037o269951l577538K000008
424.3F17502022N907326K036819j313782o263618o391449l94249p229614j818200N711747
433F07747002K617683J178856r29298m79928J384202L840599l416977n370293Q79135
441.7F07450981L50304M967499M923286j325645K91481O496048J482200N12390L078881
450.4F28227425j175995r9259j850853J511040K956047o837120r359131j683120R060516
459.1F20749550M387283j84173k700234j508407M706115O150284k50244j0351982r328652
$$ y = [625892830, 628045731, 629934959, 624693527, 615920448, 612990913, 610489731, 609563217, 606104546, 607937241, 610213928, 610152168, 612016678, 616531067, 626205978, 630744553, 628184853, 625672340, 620083542, 610114365, 605763474, 625590286, 630545540, 625349503, 619079552, 615502014, 617502022, 623409348, 625446167, 624132385, 617868767, 611477318, 611083069, 603853455, 602035255, 607747002, 610364685, 611543541, 610614243, 610134315, 611518517, 615359116, 611942139, 606571846, 607450981, 607801285, 612768784, 617692070, 616366425, 616657906, 623153954, 624636154, 625148544, 628227425, 627051430, 626952171, 625101318, 626612358, 629568405, 622731285, 613372154, 611689034, 620749550, 625136833, 624952660, 622252426, 620744019, 625450134, 631600418, 631350174, 620998192, 611669540]
467.7F11669540J755j188621O0691Q88062p124252L01475O992493P73506l31535m52385
477.4F11590729j067314n89600l770714m689750l003922L176346k107620p826653K453690
486.1E94165192M371833J530037N853157O980668l18451k538376J83639K58522m165649
494.7F06320572p875671l703614j105919J10932n5542L203811L486939o86836K953834
503.4F02648506j182899k785187j254768l976479l261414l599243k446747m628181
511.1E79513588l103943K378197L004188K129250K128258J034088l762322l967552
518.9E79353752o088676n559693l573303l960686J20507K162895R3613k00844M729576
527.5E67077141L163833J196213J431389n19142q25958n98336k97546l177338j903724
$$ y = [611669540, 611671295, 610482674, 610543365, 611431427, 604307175, 604608650, 611601143, 612374649, 612043114, 611590729, 610523415, 609933815, 606163101, 601473351, 598469429, 601645775, 599538155, 591711502, 594165192, 598537025, 600067062, 605920219, 612900887, 612582436, 610044060, 610227699, 610486221, 606320572, 598444901, 594741287, 593635368, 593746300, 593690758, 596894569, 600381508, 599694672, 602648506, 601465607, 598680420, 597425652, 593449173, 590187759, 586588516, 584141769, 579513588, 576409645, 578787842, 581792030, 583921280, 586049538, 587083626, 583321304, 579353752, 573265076, 567705383, 564132080, 560171394, 560291901, 562454796, 562548409, 562347565, 567077141, 570240974, 571437187, 572868576, 572349434, 571523476, 570925140, 570627594, 567450256, 565546532]
536.2E65546532J345482J121292L688202N289001O594124M697723K870178K478371
543.9E93630905R53293m95338j947518l244552l917504j771393j445503n54352K183037
552.6E83391075L321419K468719o20575J121865J255607j944465n607796o382141k458687
561.3E74545021l763733l628692l395806k139473K08473N54924J399308j244469n18494
570E62017059k332077m066772l349877m212989k480851k516899o89811N80062K722245
578.6E45670090L049164M105796N552636L424110N458145N342484L114433m01802l5401
587.3E75279655L44j394348M59289j041488K247886M470635L932037L175850J231613
596E88361473J976814k34642l64952j893196l745651l534432m210243j343879N19447
$$ y = [565546532, 566892014, 568013306, 571701508, 576990509, 583584633, 588282356, 591152534, 593630905, 594584198, 594088860, 592141342, 588896790, 584979286, 583207893, 581762390, 581208038, 583391075, 586712494, 589181213, 588560638, 589682503, 590938110, 588993645, 583385849, 577003708, 574545021, 570781288, 567152596, 563756790, 561617317, 561825790, 562380714, 563780022, 562535553, 562017059, 559684982, 555618210, 552268333, 548055344, 545574493, 543057594, 542367783, 542947845, 545670090, 548719254, 552825050, 558377686, 561801796, 567259941, 572602425, 575716858, 575315056, 575279655, 575279999, 573885651, 574344940, 573303452, 575551338, 580021973, 583954010, 587129860, 588361473, 590338287, 590103645, 589738693, 587845497, 584099846, 580565414, 576355171, 575011292, 575530739]
604.7E75530739J613235J668930L110924L567124K787208K547455K41013p21436k676392
613.4E87668800k798957k193871j578560L17955J277390L937187M664650N243568L904267
622F00442429K732505K881966J209412l91503j683159j448021j663894j507683O1722
630.7F00633774K083435L766899L534737L207931K608719L603706K773400p15828k553025
639.4F18943748k487335j764450k831192k417068p63893R32540K698937M182663M890594
648.1F21384544K557488K212410K100792M75921k072029m239731l469085k428589n29366
656.8F15992355J77689j70212J666832M758949N336762L396606K301979M74358k98347
665.4F33636971K15835o08406j3881531k608833K793655L42141J598854L704643M690285
$$ y = [575530739, 577143974, 578812904, 581923828, 585490952, 588278160, 590825615, 591066628, 590345192, 587668800, 584869843, 582675972, 581097412, 581415367, 582692757, 586629944, 591294594, 596538162, 600442429, 603174934, 606056900, 607266312, 606874809, 605191650, 603743629, 602079735, 600572052, 600633774, 602717209, 606484108, 610018845, 613226776, 615835495, 619439201, 622212601, 621496773, 618943748, 616456413, 614691963, 611860771, 609443703, 608679810, 609612350, 612311287, 616493950, 621384544, 623942032, 626154442, 628255234, 628731155, 626659126, 622419395, 618950310, 616521721, 615992355, 616170044, 615999832, 617666664, 622425613, 627762375, 631158981, 633460960, 633935318, 633636971, 633852806, 633244400, 619362869, 616754036, 619547691, 619889832, 621488686, 625193329, 629883614]
674.1F29883614M548835L329087L500747P80411j297226k105179l209228l205300k982635
682.8F29243126j013985R8877K106323L812790L988877M363479L527527J955795n70373
691.5F47512436j953430k729569l543472l556252m148979k743873j14022J116982R26704
700.2F30766525J746979K822075K181930K78206k271042k945938k820854l462524l006592
708.8F23288765k097168j094170Q51517K424774L589592N355149O008186M090500J906585
717.5F44323730J709519K23160j312256j371384j638641l37982J461715K434769L641968
726.2F49134598N669784O401062N973511M920960J750717P0038q23670k422638l515701
734.9F67158661k892456m80271N73731J487961L115463M195480M454346M615936K669297
$$ y = [629883614, 634432449, 637761536, 641262283, 642042694, 640745468, 638640289, 635431061, 632225761, 629243126, 628229141, 628328018, 630434341, 634247131, 638236008, 642599487, 646127014, 648082809, 647512436, 645559006, 642829437, 639285965, 635729713, 631580734, 628836861, 628722839, 629839821, 630766525, 632513504, 635335579, 637517509, 637795715, 635524673, 632578735, 629757881, 626295357, 623288765, 621191597, 620097427, 620948944, 623373718, 626963310, 632318459, 638326645, 642417145, 644323730, 646033249, 646256409, 644944153, 643572769, 641934128, 641596146, 643057861, 645492630, 649134598, 654804382, 661205444, 667178955, 672099915, 673850632, 673920670, 673097000, 670674362, 667158661, 664266205, 663785934, 664359665, 665847626, 668963089, 673158569, 677612915, 682228851, 684898148]
743.6F84898148j453553k419281l341293n683670n947800m583587j798935o55518j56555
752.2F58857956R09271J973343K245865O81305m50134j190567k336503m783477n763321
760.9F50143738m686890m163132k425994J4686K394295K556457L432541N173874M705963
769.6F57145538L501282J889038J391678j09558j256714K53220J169586J609955K296219
778.3F67890244M300231N523682O067200O935119N763855M129563K379226P0420k350769
787G00708771l018723j833725j772384m47312J010285L549041N569001N051651N645828
795.6G14462433L757858J701584J144180J6785r31473k886047k558212j226349k44599
804.3G13236160P71714K460556M691925M622497M026795L815460J887283j306763k001724
$$ y = [684898148, 683444595, 681025314, 677684021, 672000351, 666052551, 661468964, 659670029, 659014511, 658857956, 659767227, 661740570, 663986435, 664667740, 664217606, 663027039, 660690536, 655907059, 650143738, 645456848, 641293716, 638867722, 638882408, 641276703, 643833160, 647265701, 652439575, 657145538, 660646820, 662535858, 663927536, 663817978, 662561264, 662814484, 663984070, 665594025, 667890244, 672190475, 677714157, 683781357, 690716476, 696480331, 700609894, 702989120, 703059540, 700708771, 697690048, 695856323, 694083939, 693636627, 694646912, 698195953, 703764954, 708816605, 714462433, 718220291, 719921875, 721066055, 721082840, 720151367, 717265320, 714707108, 713480759, 713236160, 714007874, 716468430, 721160355, 725782852, 729809647, 733625107, 735512390, 734205627, 732203903]
813G32203903k940140m264068l439102k491150j93711J174469K161637K215805K158203
821.7G26585846M099274K211685l48892q45185k608566n421219n613708m196091l116837
830.4G10746307j589279j329727L37906J779938J288604J947480J201553j722336m136581
839G08523865l952332l337250l976211m713287l521958j535034j039505M25491J660691
847.7F88534470R22699J342010J176834p92618k169342l421249m849320m746856l292084
856.4F72704544k368469j772690n74570j13754J603851L592148M086304M062271K818146
865.1F84037781K016754J715240J064988J765441K528992L132706L664017M007339
872.8G03933258M628067N218277N554123L933182K463379J111755o7978r77402l376846
$$ y = [732203903, 729263763, 724999695, 721560593, 719069443, 718875732, 720050201, 722211838, 724427643, 726585846, 730685120, 732896805, 732547913, 731702728, 729094162, 723672943, 718059235, 713863144, 710746307, 709157028, 707827301, 708165207, 709945145, 711233749, 713181229, 714382782, 712660446, 708523865, 704571533, 701234283, 697258072, 692544785, 689022827, 687487793, 686448288, 686873779, 688534470, 689457169, 690799179, 691976013, 691183395, 689014053, 685592804, 680743484, 675996628, 672704544, 670336075, 668563385, 667988815, 667875061, 669478912, 673071060, 677157364, 681219635, 684037781, 686054535, 687769775, 688834763, 690600204, 693129196, 696261902, 699925919, 703933258, 708561325, 713779602, 719333725, 723266907, 725730286, 726842041, 726774063, 725796661, 722419815]
881.5G22419815l708572l181305l179703k806549j697769j91498N72281O9961r07135
890.2G07389526j144027j625061k335282l248520l486480m343415m940109k744827
897.9F83521805j528855q31604n40924r71908N19180Q65326q88977k233963l129883
906.5F74780197l952865m554444m504165m802094n552368m247666k470932k158203
914.3F42537460k687072k656899k154121k293206k223014l813439m547996l513947
922F18647766l307838k360497j550903q44727J16196O24962R72557K238960K374840
930.7F16911316J431770M79508k17781K55890k16485J61477L77616L10097J353455
939.3F20846863J616363K481919K987251L584557L122177K044029N07049k049903k301789
$$ y = [722419815, 718711243, 715529938, 712350235, 709543686, 707845917, 707654419, 708226700, 708296661, 707389526, 706245499, 704620438, 702285156, 699036636, 695550156, 691206741, 686266632, 683521805, 681992950, 681161346, 680620422, 679648514, 680167694, 681033020, 680144043, 677910080, 674780197, 670827332, 666272888, 661768723, 656966629, 651414261, 647166595, 644695663, 642537460, 639850388, 637193489, 635039368, 632746162, 630523148, 626709709, 622161713, 618647766, 615339928, 612979431, 611428528, 610583801, 610699997, 611324959, 612297516, 614536476, 616911316, 618343086, 618822594, 618604813, 618860703, 618644218, 618805695, 619183311, 619493408, 620846863, 622463226, 624945145, 627932396, 631516953, 634639130, 636683159, 637190208, 635140305, 632838516]
948F32838516l002739m356956n373345n066452m012603m677163l953704m664231m933510
956.7E92797813m770279n488166n201950o902085p796516q055153p896080q321571
964.4E38366013q307953p086525o805191o555291p311172o717339p108001p172470
972.1D81302071q187714r097443q340530q976250p456283q535614p548333o193695
979.8D16966209n855980m797210n806542l983001l949356k406884k142219k248917
987.6C85776100j974029k800560j050148k360955j255684r05456j86157P75184R58062
996.2C76976357J955604o2981Q90999j33400M64020P39594k36092N73616n96962K95219
1005.9C80865974j175956j1750L00560m3983O08101j083908J63307m26788N05523m71763
$$ y = [632838516, 629835777, 625478821, 620105476, 615039024, 611026421, 606349258, 602395554, 597731323, 592797813, 588027534, 582539368, 577337418, 570435333, 562638817, 554583664, 546687584, 538366013, 530058060, 522971535, 516166344, 509611053, 502299881, 495582542, 488474541, 481302071, 473114357, 464016914, 455676384, 446700134, 439243851, 430708237, 423159904, 416966209, 411110229, 406313019, 400506477, 396523476, 392574120, 390167236, 388025017, 385776100, 383802071, 381001511, 379951363, 377590408, 376334724, 375429268, 375243111, 376018295, 376976357, 378931961, 378868980, 379759979, 379626579, 380090599, 380830193, 380594101, 381167717, 380570755, 380865974, 379690018, 379678268, 379978828, 379934845, 380542946, 379459038, 379622345, 379195557, 379701080, 379229317]
1015.5C79229317l41034O60972m68101J45607j225777J307907J753426K403908K426567
1024.2C85892792R17244K150230J405373K852478J618690J319466J151199R37729J806641
1032.9D00051842O77261J340637J8463J674157J828575J446724Q61854o64558J511345
1041.6D08746300L26462K60582r81942m31747J21498m81453J215782L68462K121162
1050.2D11265106J638413K275581J918831K433243M440460J828155K278061K188835
1058D30266685L725701L306579L274651L984299L298607N649490N023575N943146M142990
1066.6D68615723K470817K201042j15661j767922n249786n881691p063065o262016
1074.4D46947441m388924k640419j297721k202607L15590o10923J153755J458740Q80012
$$ y = [379229317, 378888283, 379549255, 379081154, 379226761, 378000984, 379308891, 381062317, 383466225, 385892792, 386810036, 388960266, 390365639, 393218117, 394836807, 396156273, 397307472, 398245201, 400051842, 400729103, 402069740, 402088203, 403762360, 405590935, 407037659, 407899513, 407234955, 408746300, 409072762, 409333344, 408351402, 407919655, 408041153, 407559700, 408775482, 409143944, 411265106, 412903519, 415179100, 417097931, 419531174, 423971634, 425799789, 428077850, 430266685, 433992386, 437298965, 440573616, 444557915, 447856522, 453506012, 458529587, 464472733, 468615723, 471086540, 473287582, 473171921, 471403999, 466154213, 460272522, 453209457, 446947441, 442558517, 439918098, 438620377, 436417770, 436733360, 436122437, 437276192, 438734932, 439614944]
1083D39614944K067261Q51555J513825L29666K403946J332664J319237L343773K613907
1091.7D55390778M329032L412858L394279K126579L022080K328262Q164J178550n15136
1100.4D74675446j68267k27966N89294R5902j15738J563301J369095K651367P53555
1109.1D81185989J578675K447853K278633J767654j97181J233520J064530J772384
1116.8D93132057J179886J485519K093239J365433K397232R06944J212235J113510
1124.5E04886055J186142Q52203J79787J370888P06558J082497J060676J933823K162399
1133.2E15421028K195397K514534J004333K79884n38902p38907k460441l545990m318657
1141.9E09812279m589196m400291n003624j062469j322480k627296k391739k633057
$$ y = [439614944, 441682205, 442533760, 444047585, 444377251, 446781197, 448113861, 449433098, 452776871, 455390778, 459719810, 463132668, 466526947, 468653526, 471675606, 474003868, 474012032, 475190582, 474675446, 474507179, 474279213, 474868507, 474964409, 474848671, 476411972, 477781067, 480432434, 481185989, 482764664, 485212517, 487491150, 489258804, 489061623, 490295143, 491359673, 493132057, 494311943, 495797462, 497890701, 499256134, 501653366, 502560310, 503772545, 504886055, 506072197, 506924400, 507104187, 508475075, 509181633, 510264130, 511324806, 513258629, 515421028, 517616425, 520130959, 521135292, 521415176, 520876274, 520137367, 517676926, 514130936, 509812279, 505223083, 500822792, 495819168, 494756699, 493434219, 490806923, 488415184, 485782127]
1149.6D85782127j547851k129402j028061k549515k367630j337929q89129J59225m44412
1158.3D73647423O69708J44768K078094K277680K176704L070526J948014K999572K920990
1166.9D91933479L777314L380126L393212L458404M160424N998954N072251O173706
1174.6E27347870O825867P317733O662865N802574N092812M135208N402985M732818
1182.4E73320732L990708L289642L342628M189644M165154M641609M615517M768447
1190.1F06324081M009324L134346K249984J004563k03209r13620k22473k32430J22604
1198.8F15273170N72815O60210J502419K289886K728806J758117J296387J159096O91833
1207.4F27932739L40233j27144l15819J78872J532554J181145J561432L286552L773995
$$ y = [485782127, 484234276, 482104874, 481076813, 478527298, 476159668, 474821739, 473932610, 474091835, 473647423, 474317131, 474461899, 476539993, 478817673, 480994377, 484064903, 486012917, 489012489, 491933479, 495710793, 499090919, 502484131, 505942535, 510102959, 516101913, 521174164, 527347870, 534173737, 541491470, 548154335, 553956909, 559049721, 563184929, 568587914, 573320732, 577311440, 580601082, 583943710, 588133354, 592298508, 596940117, 601555634, 606324081, 610333405, 613467751, 615717735, 616722298, 616519089, 615605469, 615382996, 615150566, 615273170, 615845985, 616506195, 618008614, 620298500, 623027306, 624785423, 626081810, 627240906, 627932739, 628272972, 628145828, 627830009, 628008881, 629541435, 630722580, 632284012, 635570564, 639344559]
1216.1F39344559L586578K274399J925735J558686K8152l75824o42242r79691j269989
1224.8F45450363r86099n63355j99203J039352R88007O64673P29446J46485k93351
1233.5F46976318j126251j908035k011948j808166j773835j401786p55158j4496O29044
1242.2F36805687J075554J854706J807098J071014Q72117J74026q66623j139831r64203
1250.8F40689545r16024k26516P39708J115570J953506K700424K180710J649246J184082
1259.5F51070251P17850o1111j130524j650162j348266r22394j97983P19528J399918
1268.2F48597107J992035K734299K746200J929855J519013Q09021p28760j486740j700287
1276.9F56411743j537323j600189j110611k04010O65359J629181J574402J210861R12705
$$ y = [639344559, 642931137, 645205536, 647131271, 648689957, 648718109, 648342285, 647700043, 646720352, 645450363, 644464264, 643900909, 643701706, 644741058, 645729065, 646393738, 647123184, 647269669, 646976318, 645850067, 643942032, 641930084, 640121918, 638348083, 636946297, 636191139, 636176643, 636805687, 637881241, 639735947, 641543045, 642614059, 643486176, 643660202, 642793579, 641653748, 640689545, 639773521, 639547005, 640286713, 641402283, 643355789, 646056213, 648236923, 649886169, 651070251, 651788101, 651726990, 650596466, 648946304, 647598038, 646675644, 646477661, 647197189, 648597107, 650589142, 653323441, 656069641, 657999496, 659518509, 660327530, 659598770, 658112030, 656411743, 654874420, 653274231, 652163620, 651959610, 652624969, 654254150, 655828552, 657039413, 657952118]
1285.5F57952118P84225K39182j089401j948014k492218k309723k012710j360016m33578
1294.2F47329865L28674R90448J322250J305847O24085k4033q96530j769104k071991
1302.9F47139511k544632k723389k281188j398850o67381K92854Q10776N70144J162949
1311.6F40360794J333008J3275q54416j441460k053031k216874k229347k195434j255951
1320.3F29460564J53808M03977L23639P74803O26106k85034j029740j717872l146706
1328.9F25563545l560028l163910l426895k927475k492714j181946m27208R4605O61468
1337.6F09139442P0343Q2016O15426O50634m93164j489906j830711j372834n33638
1346.3F04837608j97677M14314N76134J163902J798248J692162Q21876J97297m30871
$$ y = [657952118, 658736343, 658975525, 657886124, 655938110, 653445892, 651136169, 649123459, 647763443, 647329865, 647658539, 648648987, 649971237, 651277084, 651901169, 651877136, 650980606, 649211502, 647139511, 644594879, 641871490, 639590302, 638191452, 637524071, 637816925, 638627701, 639197845, 640360794, 641693802, 641707077, 640852661, 639411201, 637358170, 635141296, 632911949, 630716515, 629460564, 629614372, 630018349, 630341988, 631116791, 631742897, 631457863, 630428123, 628710251, 625563545, 622003517, 618839607, 615412712, 612485237, 609992523, 608810577, 608383369, 608477974, 609139442, 609209785, 609291801, 609907227, 610557861, 610064697, 608574791, 606744080, 605371246, 604837608, 604639931, 605054245, 605630379, 606794281, 608592529, 610284691, 611106567, 611303864, 610872993]
1355F10872993j286468j364021j931076j654816j188545j697007r63935n32456J092797
1363.7F01347466K376785J774673O65856O16798k97279j524811p56989j380691j283531
1372.3F01538277j603241j384774O35949J879692K383957J683693K016525J839180
1380.1F08989258J329269L00827n97381p12548n46417L95546n61485J10054K626114
1388.7F11333237K889709K778740K499733K544251J152572r09385j461335M90837o71615
1397.4F20646744k009163l060417j354981O16608m18472P8086M62380m33617R67408
1406.1F15494576J105194K85225p17774j490860k397118k581596k177887j141624q02117
1414.8F05576019q57162k53334K55852R59701j434593K041244L091011L05138j055717
$$ y = [610872993, 609586525, 608222504, 606291428, 604636612, 603448067, 601751060, 600787125, 600254669, 601347466, 603724251, 605498924, 606164780, 606781578, 606484299, 604959488, 604202499, 602821808, 601538277, 599935036, 598550262, 599186211, 601065903, 603449860, 605133553, 607150078, 608989258, 610318527, 610619354, 610021973, 609309425, 608763008, 609158554, 608597069, 608707123, 611333237, 614222946, 617001686, 619501419, 622045670, 623198242, 622288857, 620827522, 621318359, 620646744, 618637581, 615577164, 614222183, 614838791, 614420319, 614498405, 614960785, 614527168, 615494576, 616599770, 616884995, 616167221, 614676361, 612279243, 609697647, 607519760, 606378136, 605576019, 604718857, 604465523, 604721375, 605681076, 604246483, 606287727, 609378738, 609683876, 608628159]
1423.4F08628159k765961l41797j27831j034126N15747l75442M01993K144470K887077
1432.1F09932289K117729J306610J406098o05698k738876O68487J658974l78418k72827
1440.8F13094368P62863O83632J694069Q48045J842842J800652R57603l33671r8190
1449.5F21252213K90260k075119k120323j764069p12967j485023k396737k689323j639175
1458.2F06659737N106048K154999K472992R09042P64046J574745k786751j81999P00646
1466.8F17373505K052230J574326K635918L322067J376839L801574L734208P666549
1474.6F43537216L803024K512360L261643K575988K058182O61469J620254J183243
1482.3F61213379L266678L403320K957230L405761J231537L515015K270813J89819
$$ y = [608628159, 605862198, 605520401, 605392570, 604358444, 604874191, 604498749, 604900742, 607045212, 609932289, 612050018, 613356628, 614762726, 614157028, 611418152, 612086639, 613745613, 613367195, 613094368, 613857231, 614540863, 616234932, 617082977, 618925819, 620726471, 621684074, 621350403, 621252213, 621542473, 619467354, 617347031, 615582962, 614869995, 613384972, 610988235, 608298912, 606659737, 611765785, 613920784, 616393776, 617302818, 618066864, 619641609, 616854858, 616672859, 617373505, 619425735, 621000061, 623635979, 626958046, 628334885, 632136459, 635870667, 643537216, 647340240, 649852600, 653114243, 655690231, 657748413, 658409882, 660030136, 661213379, 664480057, 667883377, 670840607, 674246368, 675477905, 678992920, 681263733, 681453552]
1490F81453552Q27484L078766J929245n8136J119461k04620p84760K246552K367859
1498.7F91975403L397598L570023K909393Q67538K044907J140060o87637j1677170
1506.4F93540115o445770Q607407L747253K930756J989288K307358K084122K623367
1514.1G11383896J747970O86951k42462m004593L852844J650162m207535n126266R42383
1522.8G06683350N311660J554108K60773J806793K662888J373138J897964K145997
1530.5G23696671j128388o8817l394241n036545K552261J161499J301956R04389l317337
1539.2G16671448o525116P195053L149872j173020K429581m66309j434249J102676
1546.9G20949936L21503j82572k514572k444992K034454K189942M20837k498016J730194
$$ y = [681453552, 682281036, 685359802, 687289047, 687230911, 688350372, 688145752, 687360992, 689607544, 691975403, 695373001, 698943024, 701852417, 702719955, 704764862, 705904922, 705217285, 693540115, 687094345, 695701752, 699449005, 702379761, 704369049, 706676407, 708760529, 711383896, 713131866, 713818817, 713576355, 709571762, 713424606, 715074768, 710867233, 705740967, 706683350, 711995010, 713549118, 713809891, 715616684, 718279572, 719652710, 721550674, 723696671, 722568283, 722499466, 719105225, 714068680, 716620941, 717782440, 719084396, 719988785, 716671448, 710146332, 717341385, 720491257, 719318237, 721747818, 721281509, 719847260, 720949936, 721271439, 721088867, 718574295, 716129303, 718163757, 720353699, 720774536, 718276520, 720006714]
1555.6G20006714M090271J537323j1395035j2937622K842178P076874K344208J132736
1563.3G14697647R61304p00379R48410J485901J209412r30176n528335K768554K038040
1572G16950378r71298j697922n11322k033386q108444L089905K888794J129837P97424
1580.6G11533966N87158P58438L07007n26657j134949j208953j371766j687698j517639
1589.3G05738907j406555m37546o80618J9683L5019m43039M51813m07028m93851j013794
1599G01362991j678466k059861k127762j953811k107392p15866p81173m78440n59921
1607.6F88900299n1956p04041j261749o9122j720810j724625k622223j551666k593765
1616.3F76600342q298111K550125O80542r0485n58319M56391j428605l694076J999206
$$ y = [720006714, 724096985, 725634308, 714239273, 701301651, 704143829, 711220703, 713564911, 714697647, 715658951, 714958572, 715906982, 717392883, 718602295, 717672119, 712143784, 714912338, 716950378, 715979080, 714281158, 713769836, 711736450, 703628006, 706717911, 709606705, 710736542, 711533966, 712121124, 712879562, 713186569, 712659912, 711524963, 710316010, 708944244, 707256546, 705738907, 704332352, 703894806, 703214188, 703233871, 703268890, 702825851, 703277664, 702870636, 702376785, 701362991, 699684525, 697624664, 695496902, 693543091, 691435699, 690719833, 689938660, 689460220, 688900299, 688848343, 688144302, 686882553, 686813431, 685092621, 683367996, 680745773, 679194107, 676600342, 668302231, 670852356, 671532898, 671442413, 670884094, 671340485, 669911880, 666217804, 668217010]
1625F68217010l204p72858l587646k536240k9602r83429o00204r88083R60388L82309
1634.6F60058441n637131O55976K108917J602478J315460K87094j051864p9499o47811
1643.3F58612061N03463O44074l082962k109528K346573N994110L280487L079453L184585
1652F72452316p116165r385834Q754731N115890K453003J816711J177750J375885J838074
1660.7F78482361J732941O12869J534652M033814L075714K104187J559601P55157l237228
1669.4F90654068O64444K849731J303940L106537K922211k14386J419372M953461L682175
1678G11341553K013015O57044M0665K943191K803726j945953q395004N685196N900268
1686.7G21043701L207245J171112J830902K283859K844162K590638J038513J980209
$$ y = [668217010, 668213806, 667440948, 663853302, 661317062, 661287460, 660304031, 659703827, 658715744, 659676132, 660058441, 654421310, 655077286, 657186203, 658788681, 660104141, 660391235, 659339371, 659259872, 658612061, 659115524, 659759598, 656676636, 654567108, 656913681, 662907791, 666188278, 669267731, 672452316, 665336151, 655950317, 664705048, 669820938, 672273941, 674090652, 675268402, 676644287, 678482361, 680215302, 680828171, 682362823, 686396637, 689472351, 691576538, 693136139, 693891296, 690654068, 691318512, 694168243, 695472183, 698578720, 701500931, 701286545, 702705917, 707659378, 711341553, 713354568, 714011612, 714052277, 716995468, 719799194, 717853241, 709458237, 715143433, 721043701, 724250946, 725422058, 727252960, 729536819, 732380981, 734971619, 736010132, 737990341]
1694.4G37990341O84738p624511K088317L016816L100433l189926k581329P008972
1702.1G40493851M003906J085663r8191J311493k30255J626816J982498n73120j296463
1710.8G48306198J87225M72107k64511j568451L56522L160248K64282m022446N057297
1719.5G51948471L592758R27811n33905r58023m57688O27594K1210j144J147842Q53806
1729.1G57168732m56848J130447L294983K394638l859787m496536L880920K673187
1736.9G61729736K7619P11364j585235q60443L289413R92584j48391J780319K629623
1745.5G68566589J124955j3123M120o90689K388687r26285j023407L166809J588059
1754.2G74185715J194839R23920o46744J741409K522431K001800J731339k475052n20706
$$ y = [737990341, 738675079, 731050568, 733138885, 736155701, 739256134, 736066208, 733484879, 740493851, 744497757, 745583420, 745485229, 746796722, 746566467, 748193283, 750175781, 749602661, 748306198, 748493423, 748965530, 748701019, 747132568, 747489090, 750649338, 750913620, 746891174, 751948471, 755541229, 756469040, 755935135, 754977112, 754519424, 755147018, 755168228, 755167084, 756314926, 757168732, 756711884, 757842331, 761137314, 763531952, 759672165, 755175629, 759056549, 761729736, 761757355, 762468719, 760883484, 760023041, 763312454, 764305038, 764156647, 765936966, 768566589, 769691544, 769678421, 769682541, 768991852, 771380539, 770454254, 769430847, 772597656, 774185715, 775380554, 776304474, 775657730, 777399139, 779921570, 781923370, 783654709, 781179657, 780658951]
1762.9G80658951K298584O28586K17132K05307k59018j762542K099075K447433k000198
1771.6G84533310k008438J536407L883744J496048n07355J555786k59857m60739q11386
1780.3G88957520j290665Q98361J510620P29370o13022J342621K016449P77741K97775
1788.9G94626770N17120j232299j506577j477585j56097J955337l04489j89438J822586
1797.6G94055328J228867l16544Q2245K390671K33459K86866O57654q72193m44183
1806.3G97302170o10504n64118Q6060j67389r30939J500931K399521J487427J267013
1815H01770172K64130M1046j031036m30146J9760j057510k96555n33905N08500M82940
1824.6G99737396j312485J292649K660980J482697j871949l020553K050857K354737
$$ y = [780658951, 782957535, 783586121, 783803253, 784008560, 783749542, 781987000, 784086075, 786533508, 784533310, 782524872, 784061279, 787945023, 789441071, 788933716, 790489502, 790229645, 789768906, 788957520, 787666855, 788565216, 790075836, 790805206, 790192184, 791534805, 793551254, 794328995, 794626770, 795143890, 793911591, 792405014, 790927429, 790771332, 792726669, 792422180, 792232742, 794055328, 795284195, 794967651, 795049896, 797440567, 797674026, 797960892, 798618546, 797746353, 797302170, 796691666, 796127548, 796213608, 796046219, 795115280, 796616211, 799015732, 800503159, 801770172, 802034302, 802075348, 801044312, 800614166, 800633926, 799576416, 799279861, 798745956, 799254456, 799737396, 798424911, 799717560, 802378540, 803861237, 801989288, 798968735, 801019592, 803374329]
1832.3H03374329m56391j148300m73175m37088r07898j5030J868515J019135Q19702
1841H03643799L95813R67331J51977m495926J823731J154861j188049o34842r0713
1849.7H01727982J85852J77078R21936N80826R94720Q78983L46298M16641j92413j39237
1859.3H05898666q51974j141510j143723r7046J79291j1673N91812j94320P55920k54593
1869H03730850j9226K204743J182327k94266j302185j043091r93957k52762k01721
1877.7H03010712K5100J034089R55429J299743R26209J120605K48718m58374j87988
1886.3H07974243j255188o70471j557312k130966N65719J420899J088104Q41827O26374
1895H06903229O16684J797943O08826l22037l11966q32062j258621j640320m79889
$$ y = [803374329, 802917938, 801769638, 801296463, 800859375, 799951477, 799936447, 801804962, 802824097, 803643799, 804039612, 805006943, 805158920, 800662994, 802486725, 803641586, 802453537, 801818695, 801727982, 801913834, 802090912, 803012848, 803593674, 804588394, 805467377, 805813675, 806230316, 806037903, 805898666, 805046692, 803905182, 802761459, 802664413, 802843704, 802832031, 803423843, 803229523, 803985443, 803730850, 803711624, 805916367, 807098694, 806804428, 805502243, 804459152, 803465195, 803212433, 803010712, 803035812, 804069901, 805025330, 806325073, 807251282, 808371887, 808620605, 808162231, 807974243, 806719055, 806048584, 804491272, 802360306, 802926025, 804346924, 805435028, 806276855, 806903229, 807519913, 809317856, 809926682, 809604645, 809292679, 808460617, 807201996, 805561676, 805081787]
1903.7H05081787l85437N0659O74134P92007J089630Q60062Q48312M07410O38122o55517
1913.3H09401169j290360j183242r58786k87476k457733M78668K011261J142502J222915
1922H08078918N9586Q03680R62296J87149l77121r93118j041336r55735q41217n36499
1931.7H05346603J9989M51661J537780J413498Q94547R67788K04163m19846q84094
1940.3H09532089o29654k371597k342606Q23594M3029j94854O99386J486664J548080
1949H08594131J172562R71985L10287k28958o05163r64432j302109q49304n04074k30484
1958.7H06364441N2490J25122J150360J460724J188660O08215K44217j44577j171036
1967.3H09878616p61413m73480j027451j181412k40021M83933N22766J095886J098938
$$ y = [805081787, 804696350, 804747009, 805421143, 806213150, 807302780, 808162842, 809011154, 809418564, 810056686, 809401169, 808110809, 806927567, 805968781, 805681305, 803223572, 803702240, 805713501, 806856003, 808078918, 808138504, 808942184, 809904480, 810091629, 809714508, 808721390, 807680054, 806724319, 805883102, 805346603, 805366592, 805818253, 807356033, 808769531, 809664078, 810631866, 810836029, 810416183, 809532089, 808902435, 806530838, 804188232, 805011826, 805054855, 804860001, 805559387, 807046051, 808594131, 809766693, 810738678, 811048965, 810820007, 810214844, 809250412, 807948303, 807098999, 806594925, 806364441, 806416931, 806542053, 807692413, 809153137, 810341797, 810950012, 811194229, 811049652, 809878616, 809117203, 808643723, 807616272, 806434860, 806194839, 806678772, 807201538, 808297424, 809396362]
1976H09396362R63364J175079Q31375l23791q54416j043625j284103j039963j040115
1984.7H06780167m05274L13187P27844Q73489R79767J602555R54589l18756l11584
1993.4H11195984j75095r60235j287766j005096j075058o20651M15420Q99429O67649
2002.1H08054581J269836J587219Q94776L80554l58658p12585j299744j686783j520538
2010.7H06608658r96399j66702K61764Q04978R83886Q18482O34460Q66623O20880k79770
2020.4H10156860q15811j317901j199952j396026r64203l36304q621O50558Q51593
2029.1H05620193J412812J093902N23529K06757j88904m12140j313171j590958j284408
2037.7H04067612m69895m07943o23093J80893J060181J562347J234817R90448K10877
$$ y = [809396362, 810359726, 811534805, 812366180, 812042389, 811187973, 810144348, 808860245, 807820282, 806780167, 806374893, 806688080, 807415924, 808289413, 809269180, 810871735, 811826324, 811507568, 811195984, 811020889, 810060654, 808772888, 807767792, 806692734, 806072083, 806487503, 807386932, 808054581, 809324417, 810911636, 811806412, 812186966, 811828308, 811115723, 809815979, 808129196, 806608658, 805612259, 805445557, 805707321, 806512299, 807496185, 808314667, 808949127, 809815750, 810436630, 810156860, 809341049, 808023148, 806823196, 805427170, 804462967, 804126663, 804118042, 804768600, 805620193, 807033005, 808126907, 808650436, 808857193, 808668289, 808256149, 806942978, 805352020, 804067612, 803597717, 803189774, 802566681, 802747574, 803807755, 805370102, 806604919, 807595367, 807806244]
2046.4H07806244l54767p10068j506042j322327j109085m88052k03018K04315O36215
2055.1H02953415Q77151J175385Q75549J180802L73840m53873q01391j051407r39255
2063.8H04190216j632461q76923m2343N61523R91135R68246J282349R29336Q23212
2072.5H07194290J97983l28522o32858r61609r93881j010285p05413n38865K47803
2081.1H02468643M55399O39038J182480J344223J324844L10822m58527q70132n03922
2089.8H05892868p33185j289978r89685p29599M19617Q39920J060486J226730Q79898
2098.5H06577072O96640K62528L14254k97241q95309r39789r31854r54438m06265J05591
2108.1H03531189J62735J259384J283798Q08945M11453L71475L91541p84836o83746
$$ y = [807806244, 807451477, 806741409, 805235367, 803913040, 802803955, 802315903, 802112885, 802317200, 802953415, 803830566, 805005951, 805881500, 807062302, 807436142, 806982269, 806180878, 805129471, 804190216, 802557755, 801680832, 801638489, 802200012, 803191147, 804159393, 805441742, 806371078, 807194290, 807392273, 807063751, 806430893, 805469284, 804475403, 803465118, 802759705, 802220840, 802468643, 802924042, 803563080, 804745560, 806089783, 807414627, 807725449, 807266922, 806396790, 805892868, 805159683, 803869705, 802880020, 802150421, 802570038, 803409958, 804470444, 805697174, 806577072, 807273712, 807536240, 807850494, 807553253, 806657944, 805718155, 804786301, 803831863, 803425598, 803531189, 803693924, 804953308, 806237106, 807046051, 807457504, 807828979, 808220520, 807435684, 806751938]
2116.8H06751938p87201q78143p83768m33350L51334L81470R79690P15637O10428N77011
2126.5H07485046L07923M62265p2785n79910j422806j066055n54047n31082l44238
2135.1H03684311K88467J523438R95178O44531P32270N67245Q0414n39551p01752j171493
2144.8H06103058n46951m54789n06897k2888R537M40292J081009J449051O96945L71628
2154.4H08619995O6986m56466p24259j078491q05817q06656m09774j35270M99497J201935
2164.1H05971680J043014R61685P00760Q15354K37732k76108o21948o45600m23279
2172.8H07763290q09021j13067m8142J67313M74014P43714J368103P30590N60914K70919
2182.4H11108627K83661r6359q49838r66263j194382l73154L2883O58875J009674N85022
$$ y = [806751938, 805964737, 805086594, 804302826, 803869476, 804220810, 804602280, 805581970, 806297607, 806908035, 807485046, 807792969, 808255234, 808182449, 807602539, 806179733, 805113678, 804559631, 804028549, 803684311, 803972778, 805496216, 806491394, 807135925, 807868195, 808435440, 808515854, 807976303, 807274551, 806103058, 805556107, 805101318, 804594421, 804571533, 804581070, 805021362, 806102371, 807551422, 808248367, 808619995, 808686981, 808230515, 807506256, 806427765, 805621948, 804815292, 804405518, 804270248, 804769745, 805971680, 807014694, 807976379, 808677139, 809492493, 809730225, 809454117, 808832169, 808186569, 807763290, 806954269, 806841202, 806793060, 806960373, 807434387, 808178101, 809546204, 810276794, 810837708, 811108627, 811392288, 811295929, 810446091, 809479828, 808285446, 807912292, 807945175, 808604050, 809613724, 810198746]
2192H10198746P37152P04269O56739P5149k13928k71073l81240o89774q85239m79507
2201.7H09451294l66745M36478Q78601Q30688R56192Q66165Q29621N45730J55411n70297
2211.3H14013138j021729r64355l99704l46604l53393K78473N08194Q84018P28912
2220H13326950R63898R53827M32281L33023q12683j151199q21610o50406m95071j94397
2229.7H11884613K39410L54081R42382R51996P12433N98297O02570N43899m38995j099853
2239.3H15290833r49479p32727r03930m80500j07879M82940J249772J016464J001358
2248H15866852Q44116K15683m99954k83509o01120j381073q23898p30285L7384O06308
2257.6H13250504M80499M47769Q49152J546783M81873J09710L98178l40347j312561
$$ y = [810198746, 810935898, 811640167, 812296906, 812372055, 812158127, 811887054, 811505814, 810816040, 809930801, 809451294, 809084549, 809521027, 810399628, 811230316, 812186508, 813052673, 813882294, 814428024, 814583435, 814013138, 812991409, 812027054, 811627350, 811280746, 810927353, 811205826, 811714020, 812598038, 813326950, 814290848, 815244675, 815676956, 816009979, 815197296, 814046097, 813224487, 812574081, 812079010, 811884613, 812124023, 812478104, 813420486, 814372482, 815084915, 815683212, 816285782, 816829681, 816390686, 815290833, 814341354, 813608627, 812704697, 812224197, 812116318, 812599258, 813849030, 814865494, 815866852, 816710968, 816926651, 816426697, 816143188, 815542068, 814160995, 813337097, 812606812, 812644196, 813250504, 813731003, 814178772, 815027924, 816574707, 817056580, 817166290, 817564468, 817224121, 815911560]
2266.3H15911560r79919m80957r88312k70081J2055O10809J021042N96084R03931Q13751
2275.9H17149963P46766P9956n33295r59015p51419n92270p93838M882r2086M44030
2285.6H14703674P35703P05795R49097O45523N02014l11813j93253j026535j589050
2294.3H15121155q86612o54144O8969l41644J42517N37949Q76770J156006N28717J99432
2303.9H16749115p18079l91006j103363j528626n21850l34931l15246r72748L38669
2312.6H11201935Q38394Q85544O74133k46811P68051R5749j292190j905518j235046
2321.3H09784241l14942q74557q38547o0883N61142Q0185Q51365M83245K5788q8349
2330.9H09608688q39004k48108p88193n74722j384277o62461O42624q42972q7127N12695
$$ y = [815911560, 814931641, 814450684, 813462372, 813192291, 813204346, 813815155, 814836197, 815432281, 816336212, 817149963, 817896729, 817976685, 817443390, 816484375, 815732956, 815140686, 814346848, 814351730, 814259644, 814703674, 815439377, 816145172, 817094269, 817739792, 818241806, 817929993, 817736740, 816710205, 815121155, 814234543, 813580399, 813649368, 813307724, 813450241, 813988190, 814864960, 816020966, 816549683, 816749115, 816031036, 815640030, 814536667, 813008041, 812486191, 812151260, 811836014, 810863266, 811201935, 812040329, 812925873, 813600006, 813353195, 814121246, 814216995, 812924805, 811019287, 809784241, 809469299, 808594742, 807756195, 807695312, 808256454, 808336639, 809188004, 809671249, 809697037, 809608688, 808769684, 808521576, 807733383, 807158661, 805774384, 805111923, 805754547, 804911575, 804824448, 805337143]
2340.6H05337143Q35113J205445L20968j301651R5444P36313k78397J148377N58243
2349.2H08656998p37992j908188j476364r0408r61227m12445n35050K69318R08355
2357.9H03712997n59463j021423j308289N8365Q70132m04358j590194J175308K127685
2366.6H03060760R36814J278610P26242J190109J194687N92270o8893O3324J38626
2375.3H09112549m44794k20642k77100J35193R76639J534271J254654P18155O99692
2383.9H13488617N54199R9869m09241m06036q59909p86743l80783k57035N68924N08118
2393.6H12119980L01895J53656K11258M34112o6604j39465k46048m82865q14972o91375
2403.2H10779572j18409l7689j52664J67694N18951l8070R3765M44183R16m15573l77503
$$ y = [805337143, 806172256, 807377701, 807698669, 806397018, 806492462, 807228775, 806950378, 808098755, 808656998, 807919006, 806010818, 804534454, 804444046, 803482819, 803070374, 802535324, 802804642, 803712997, 803153534, 802132111, 800823822, 800882187, 801752319, 801347961, 799757767, 800933075, 803060760, 803997574, 805276184, 806002426, 807192535, 808387222, 808979492, 808910599, 808973923, 809112549, 808667755, 808447113, 808170013, 808305206, 809281845, 810816116, 812070770, 812788925, 813488617, 814042816, 814142685, 813733444, 813327408, 812467499, 811680756, 811299973, 811042938, 811611862, 812119980, 812421875, 812575531, 812786789, 813220901, 813154297, 813014832, 812768784, 812285919, 811470947, 810779572, 810661163, 810623474, 810470810, 810638504, 811157455, 811119385, 811213150, 811657333, 811658249, 811242676, 810865173]
2413.8H10865173l37753o16989k91519k26364j60370m97055l29361N34591J19706L27682
2423.5H09387741J38702j93786k02789m74930k33689l21045L5172m06647p69119j75171
2433.1H06784439K4033J01928l8604J56250L9825m9972k80533m45862k73056l36304
2442.8H05682144p2174m45633o68564n21927P477K89383k88162j58844N6229M3792
2452.4H03923721j81350K6168j3275k72674j23139n32303j87454J72959K8152l46222
2462.1H02494583m63791o6833J29852L22342m6692j66779p21130p55539K5025j25199
2471.7H00625839j17798n16052m99039k25448k8839M39148J32827k20260l67584O5612
2481.3G99288406J20087k63901r2926j1215m02374n82504k18506m51737m15344M2801
$$ y = [810865173, 810527420, 809910431, 809618912, 809392548, 809232178, 808735123, 808405762, 808940353, 809060059, 809387741, 809526443, 809332657, 809129868, 808654938, 808421249, 808100204, 808135376, 807728729, 806959610, 806784439, 806808472, 806910400, 806871796, 807028046, 807067871, 807017899, 806737366, 806291504, 806018448, 805682144, 805609970, 805164337, 804495773, 803973846, 803981323, 804270706, 803982544, 803823700, 803879929, 803923721, 803742371, 803768539, 803755264, 803482590, 803359451, 802827148, 802639694, 802812653, 802840805, 802494583, 802030792, 801963959, 802093811, 802416153, 802369461, 802202682, 801481552, 800726013, 800751038, 800625839, 800508041, 799991989, 799492950, 799267502, 799238663, 799677811, 799810638, 799590378, 799222794, 799288406, 799408493, 799144592, 799051666, 799040451, 798638077, 798055573, 797837067, 797385330, 796969986, 797012787]
2491G97012787L38440K79159j0223J3275P9498M15192k17743p75375m89502k57187
2500.6G96388321l10059n47714J6251n6839O6604L23716J88446J90200l11660Q4991
2510.3G96032257R6817j19781n02320j011276j79214K58712Q1787k53753k20261j64871
2519.9G94018097R1019L60412J91803K15073k91977k92969n12619o38809l32260m09241
2529.6G92398529l00140n41535N3253K42920J97068N40161K86178J02387n88227m56466
2539.2G91934128n45960r17816m08554m41742k60162k11411j87607L43628N32685L88641
2548.9G90225830J96762k66266n66864l95508m39910o26679q21533o69785m63028j26724
2558.5G86046295J10855J02005M45633M68903M91714Q1864k69547o62918j028976n11551
$$ y = [797012787, 797351227, 797630386, 797620163, 797633438, 797712936, 798128128, 797910385, 797135010, 796645508, 796388321, 796078262, 795530548, 795546799, 795489960, 795556564, 795880280, 796068726, 796258926, 795947266, 796032257, 796129074, 796009293, 795506973, 794495697, 794316483, 794575195, 794656982, 794403229, 794182968, 794018097, 794109116, 794469528, 794661331, 794876404, 794584427, 794291458, 793778839, 793140030, 792807770, 792398529, 792098389, 791556854, 791610107, 791853027, 792050095, 792590256, 792876434, 792978821, 792390594, 791934128, 791388168, 790470352, 790061798, 789620056, 789359894, 789148483, 788960876, 789304504, 789837189, 790225830, 790422592, 790156326, 789589462, 789193954, 788754044, 788127365, 787305832, 786636047, 786173019, 786046295, 786157150, 786259155, 786704788, 787173691, 787665405, 787747269, 787477722, 786814804, 785785828, 785274277]
2568.1G85274277o74515l61633k42462l69492J94244J53Q0109N24826O61697L2883
2577.8G85120087n30472o05621n84794o38885r72748o17218l95050K4414K74201J42288
2587.4G81216202N58853N09491J05133r1019J81580m34876q84704o34766m76456M7989
2597.1G80097427n50308n56412m7226L13874Q21228K95791l1814j97907l66974p14950
2606.7G79062729p14111l56141m18090n77164n09873J30768N951J12534O54678N13916
2616.4G77905197m3869m84848k48489n87845o25839p54929j149368q23899n32684n4245
2626G72599182J69754K95563K96783K58026k60086n96237j55411l56826r16748j354523
2635.6G69979477m54254l94898p40509K3270l57437N2719M43344J98059k8458l54843
$$ y = [785274277, 784599762, 784238129, 783995667, 783626175, 783820419, 783820572, 783900681, 784425507, 785087204, 785120087, 784589615, 783983994, 783399200, 782760315, 781787567, 781170349, 780775299, 780799713, 781073914, 781216202, 781775055, 782284546, 782389679, 782298660, 782480240, 782045364, 781160660, 780525894, 780049438, 780097427, 779547119, 778990707, 778943481, 779257355, 780078583, 780374374, 780342560, 780144653, 779777679, 779062729, 778348618, 777992477, 777574387, 776997223, 776487350, 776618118, 776624069, 776736603, 777391281, 777905197, 777861328, 777376480, 777127991, 776540146, 775914307, 775159378, 774010010, 773186111, 772653427, 772599182, 772768936, 773064499, 773361282, 773619308, 773359222, 772762985, 772607574, 772250748, 771334000, 769979477, 769525223, 769130325, 768389816, 768413086, 768055649, 768108368, 768551712, 768749771, 768721313, 768366470]
2645.3G68366470m46243q82797n94559q69522j299896o94733J18942J54343j55487
2654G63696518J02158k87705p6K95868K9297m75235j258088j007309q99581m08402
2663.6G59787445k45972p27996m98810L66897P38755j92490l5629K85339J52283j02082
2673.3G59527740j107330j424484r60541k96707l18680l60260k64206n1880M37241
2681.9G55180893M18396K69623j50605k22244m83856q04901p16934o98853n66330p44476
2691.6G51480713l85208K2735K14005R0866k6016M62875J12991m30069q12301q41599
2701.2G49888992n90133n22919n99060r18961p86743j59530O96716M88968j24588k24381
2710.9G47148361k51770l06854p40814o25305o24085p43484p04041n29175j82190r2926
$$ y = [768366470, 767920227, 767037430, 766442871, 765573349, 764273453, 763578720, 763697662, 763852005, 763696518, 763798676, 763510971, 763510895, 763806763, 763836060, 763360825, 762102737, 761095428, 760195847, 759787445, 759541473, 758813477, 758314667, 758681564, 759420319, 759227829, 759192200, 759477539, 759629822, 759527740, 758420410, 756995926, 756035385, 755738678, 755419998, 755059738, 754795532, 754743652, 755180893, 755599289, 755868912, 755718307, 755496063, 755012207, 754207306, 753490372, 752791519, 752225189, 751480713, 751095505, 751118240, 751332245, 751423111, 751397095, 751859970, 751972961, 751542892, 750730591, 749888992, 749298859, 748775940, 748176880, 747257919, 746471176, 746311646, 747008362, 747497330, 747372742, 747148361, 746896591, 746589737, 745848923, 745223618, 744599533, 743856049, 743152008, 742622833, 742440643, 742347717]
2720.5G42347717K13013j17493l8299N33447N95474k40631j191788q54644j122055
2729.2G40124741r11789l30887l15781J11313K04544J35880p3777K55051L82309j30539
2738.8G39451065n18494p32803j039352j114731j3733K19345j71051l05023j19400
2747.5G35655823K08511K04163N68771k42157m85001k00958n79147l82843l80554p00302
2757.2G33666306j380616n71747K06910N5771N05600K76184M56085N22308j83945o23779
2766.8G32929077m65393m26712n81207n53589m53644R9106k20718j39695l1814k40174
2776.4G29915237L32413J68152m2801n76706o63605q03375q19702k56500p91550m32434
2786.1G26029129r232K74964J69601k58941p2022l37677k39715q39615o92292m33502
$$ y = [742347717, 742560730, 742443237, 742404938, 742938385, 743533859, 743293228, 742101440, 741246796, 740124741, 739212952, 738882065, 738566284, 738677597, 738882141, 739018021, 738944244, 739199295, 739581604, 739451065, 738932571, 738199768, 737160416, 736045685, 736031952, 736251297, 736080246, 735775223, 735655823, 735864334, 736068497, 736637268, 736395111, 735910110, 735709152, 735130005, 734747162, 734366608, 733666306, 732285690, 731713943, 731920853, 731976624, 732482224, 732758408, 733214493, 733736801, 733552856, 732929077, 732463684, 732036972, 731455765, 730902176, 730448532, 730547638, 730326920, 730187225, 730155411, 729915237, 730247650, 730415802, 730373001, 729796295, 729132690, 728329315, 727509613, 727253113, 726461563, 726029129, 726019897, 726294861, 726464462, 726205521, 726133499, 725795822, 725556107, 724716492, 724024200, 723590698]
2795.7G23590698j040039o68258m65622n76706j357041n36651Q05893L16238n36423
2804.4G19532089j209106m43497k98309n69840l54843q49380j249771j167908n19333
2813.1G12870102n71137n26428l95965m36554m5471o30341p22122n45349j132431j267853
2822.7G06596451r70154o90460r89151j045532m75312l79181m31976m72794p05337
2831.4G00436554q06580j017685r23996q05053j038819j276245j338272j024322j279526
2840.1F90926056j363449j081162r44290q87527j261063j256485j515579j197052j193619
2848.8F80225830k224960j795655j574401j579972q72192l55835o09589q94241m51202
2857.4F69867783m74778m25262r59396j559449j184311j164779j456604j328430j066285
$$ y = [723590698, 722550659, 721882401, 721416779, 720840073, 719483032, 718946381, 719752274, 720068512, 719532089, 718322983, 717879486, 717581177, 717011337, 716656494, 715807114, 714557343, 713389435, 712870102, 712298965, 711772537, 711376572, 710940018, 710894547, 710264206, 709542084, 708996735, 707864304, 706596451, 705626297, 704935837, 703946686, 702901154, 702425842, 702046661, 701614685, 701141891, 700436554, 699629974, 698612289, 697688293, 696883240, 695844421, 694568176, 693229904, 692205582, 690926056, 689562607, 688481445, 687537155, 686649628, 685388565, 684132080, 682616501, 681419449, 680225830, 678000870, 676205215, 674630814, 673050842, 672178650, 671822815, 671213226, 670318985, 669867783, 669393005, 668967743, 668008347, 666448898, 665264587, 664099808, 662643204, 661314774, 660248489]
2866.1F60248489j671447j605759j457291j449432p82318j346741j431045j520081
2873.8F48984375k324677k531280k518082j777229j365128j233902j102829j646003
2881.6F34485245j705780q19512n28526j200523j041756n99442p63664r30099n74761
2890.2F26321182j66664p59582j012459j67771M40789j17646q23860k77710K85149
2898.9F23721428k36435p68738o32744l35579n78765q44384k83317m27284q43049n08270
2908.6F18262863q51440j079369q32786n35927m93279j105308j708107k062226j771316
2917.2F07823105j439629j843834j970634j083336p87125j097183m30641l18565r76487
2925.9E97875671q99391j45378l891m42352n14946j34850P72629P92198K79808M16031
$$ y = [660248489, 658577042, 656971283, 655513992, 654064560, 653282242, 651935501, 650504456, 648984375, 646659698, 644128418, 641610336, 639833107, 638467979, 637234077, 636131248, 634485245, 632779465, 631959953, 631431427, 630230904, 629189148, 628589706, 627826042, 626895943, 626321182, 626154518, 625394936, 624382477, 624214706, 624655495, 624537849, 623713989, 623436279, 623721428, 623484993, 622716255, 622083511, 621747932, 621169167, 620324783, 620041466, 619614182, 618771133, 618262863, 617411423, 616332054, 615499268, 614963341, 614470062, 613364754, 611656647, 609594421, 607823105, 606383476, 604539642, 602569008, 601485672, 600698547, 599601364, 599170723, 598852158, 597875671, 596976280, 596830902, 596827011, 596384659, 595869713, 595734863, 596507492, 597299690, 597579498, 597995529]
2935.6E97995529J259995J956634J917114K114029J465073J150932J761780K169800
2943.3F11790886K359581J966057K263374K167702J489258J133270J492042K349816
2951F27011986K086372J995049J947555J753388J728935J972732K395783J584015J159363
2959.7F43635178J571960J777573J819153J756591J708680J710662J568985J485367
2967.4F57034149J551972J361541J716385J526489J163331J380310J017990Q67080
2975.1F67619247J045609J677704J563034Q31299Q18023J164093J262741N18799P46308
2983.8F77246857J249389J135865R22775P42264R38949N61142Q39768J201553N92041
2992.5F85430603J76392M11300O53992K03781j5945K36282O21719J9150m13132K53754
$$ y = [597995529, 599255524, 601212158, 603129272, 605243301, 606708374, 607859306, 609621086, 611790886, 614150467, 616116524, 618379898, 620547600, 622036858, 623170128, 624662170, 627011986, 629098358, 631093407, 633040962, 634794350, 636523285, 638496017, 640891800, 642475815, 643635178, 645207138, 646984711, 648803864, 650560455, 652269135, 653979797, 655548782, 657034149, 658586121, 659947662, 661664047, 663190536, 664353867, 665734177, 666752167, 667619247, 668664856, 670342560, 671905594, 672736893, 673554916, 674719009, 675981750, 676500549, 677246857, 678496246, 679632111, 680554886, 681297150, 682236099, 682797241, 683637009, 684838562, 685430603, 685606995, 686018295, 686672287, 686876068, 686860123, 687096405, 687718124, 687737274, 687324142, 687577896]
3002.1F87577896L40195O8512J21231M50516l15781m65775K98462K0447k03934o96640
3011.7F87195129o78634k85645k20108j85928m52347k67944l03726m50516l35694o24694
3021.4F83389893r55964o46286p88269j064605p28226r33762n31082j58005l75366
3030.1F77208328p17544j037216m40217m26635q75779j168899q97064m64554n45502
3038.7F70634918o57959j061172j022644r78470o49491k42538q26950j077347q17947
3047.4F63300400j120682j423645p38983p18918p94601o44379r29108p49359j006164
3056.1F55174561q95615n77774o95038r33228j051025r49173j124573o45370p33109
3064.8F47569656j157074j211395j161804r07440r43375k92892m95148j228561j304818
$$ y = [687577896, 687918091, 687986603, 688107834, 688558350, 688242569, 687776794, 688075256, 688095703, 687891769, 687195129, 686516495, 686230850, 686010742, 685824814, 685372467, 685104523, 684800797, 684350281, 684014587, 683389893, 682433929, 681787643, 680999374, 679934769, 679206543, 678272781, 677741699, 677583694, 677208328, 676490784, 675453568, 675013351, 674586716, 673710937, 672542038, 671644974, 671180420, 670634918, 669976959, 668915787, 667893143, 666914673, 666265182, 666022644, 665195694, 664118347, 663300400, 662179718, 660756073, 660017090, 659298172, 658503571, 657859192, 656930084, 656180725, 655174561, 654278946, 653701172, 653006134, 652072906, 651021881, 650072708, 648948135, 648302765, 647569656, 646412582, 645201187, 644039383, 643131943, 642188568, 641895676, 641400528, 640171967, 638867149]
3073.5F38867149j113357r18198j243477j220588r47380m46625r24874j082611m03328
3082.1F30566711o48307p14989j322556j322555r01337r57908r97468j019439n56793
3090.8F22125359r59931r00040r65766j265717p48482r41238j000786r29298q56743
3099.5F13557358j314545j307640p77817q94546o11229r13620j009178p98493q02154
3108.2F05128136p52297r72290p05299n17807r68933j226769p92503j212464j519966
3116.9E96459808j166420j145897o21948n29251n32036j170311j458816p89719q40835
3125.5E88204575q69637j413841j007996m03175j206703j299935q63609r06258p28569
3134.2E79504852l20358q53424r38988n65872p24945j334648j462555m68712j030426
$$ y = [638867149, 637753792, 636835594, 635592117, 634371529, 633424149, 632977524, 632052650, 630970039, 630566711, 629918404, 629203415, 627880859, 626558304, 625656967, 624699059, 623701591, 622682152, 622125359, 621165428, 620265388, 619299622, 618033905, 617285423, 616344185, 615343399, 614414101, 613557358, 612242813, 610935173, 610157356, 609262810, 608651581, 607737961, 606728783, 605930290, 605128136, 604375839, 603403549, 602698250, 602180443, 601211510, 599984741, 599192238, 597979774, 596459808, 595293388, 594147491, 593525543, 592996292, 592464256, 591293945, 589835129, 589045410, 588204575, 587334938, 585921097, 584913101, 584509926, 583303223, 582003288, 581139679, 580233421, 579504852, 579184494, 578331070, 577392082, 576826210, 576101265, 574766617, 573304062, 572835350, 571804924]
3142.9E71804924j271324o45676r24949j008606r18427k42348n06858j240998q72764
3151.6E64172974m75197j015320j398087p64045q42743r95789j132850r73969o29692
3160.3E55945282p71637o33659r64699q01582o17371n59425o94771j338883j117286
3168.9E48445969r69010p18155p54738q09631n91049p63245p48214p86362q96378j237831
3178.6E40171356p25479n61218j107140j108475q22830k07519q06580p12929n7144
3187.3E34062042n48935q06007j026688o30111n50766r06754q09174q30268j026001
3195.9E26927338r60198o15082q00323p24678m35906l64456n60798q65899j026191
3204.6E20573807q34503l72811q32710p71217o85997p19071l48015q28972m63180l19443
$$ y = [571804924, 570533600, 569887924, 568962975, 567954369, 567035942, 566793594, 566286736, 565045738, 564172974, 563697777, 562682457, 561284370, 560520325, 559677582, 558681793, 557548943, 556574974, 555945282, 555173645, 554539986, 553575287, 552773705, 552156334, 551596909, 550902138, 549563255, 548445969, 547476959, 546758804, 546004066, 545194435, 544603386, 543840141, 543091927, 542305565, 541409187, 540171356, 539445877, 538884659, 537777519, 536669044, 535846214, 535638695, 534832115, 534119186, 534062042, 533513107, 532707100, 531680412, 531050301, 530499535, 529592781, 528783607, 527953339, 526927338, 525967140, 525352058, 524551735, 523827057, 523391151, 523026695, 522465897, 521599998, 520573807, 519739304, 519366493, 518533783, 517762566, 517076569, 516357498, 516009483, 515180511, 514717331, 514397888]
3214.3E14397888o04820l69110m43077o97441j065255p42721n91355o06918n67856
3222.9E08709335p83043o75239m48723k76604o30073o70281l78608n35965o25458k17018
3232.6E03468323k69928r71184q74252p56569o75011o56280p74422k86636k07634n06249
3242.2D97490158j03531M28658n25093r59168o15043j124077p45430l61481l65562
3250.9D93119431m93393p47490l41683m2572p6523n26771p79572k06794q8349q93860
3260.5D88922424r72137l23334q5678k25029o07223l50228O0959M1580k96211o70853
3270.2D85494270p60269n82733l69530q72764n75829k22778k04926M0055n94216m47082
3279.8D80904198k02713k27852j92452j65901P9117n87349n39818l25584q17261q00323
$$ y = [514397888, 513793068, 513423958, 512980881, 512283440, 511218185, 510475464, 509884109, 509277191, 508709335, 507926292, 507251053, 506802330, 506525726, 505895653, 505225372, 504846764, 504310799, 503685341, 503468323, 503198395, 502227211, 501352959, 500596390, 499921379, 499265099, 498490677, 498204041, 497996407, 497490158, 497386627, 497815285, 497290192, 496331024, 495715981, 494591904, 493846474, 493484993, 493119431, 492626038, 491878548, 491536865, 491494293, 491417770, 490890999, 490111427, 489904633, 489816284, 488922424, 487950287, 487626953, 487541275, 487316246, 486709023, 486358795, 486419754, 486461334, 486165123, 485494270, 484734001, 484151268, 483781738, 482908974, 482333145, 482110367, 481905441, 481945496, 481351280, 480904198, 480701485, 480473633, 480281181, 480115280, 480194397, 479607048, 479067230, 478741646, 477924385, 477124062]
3289.5D77124062r0905Q049p88765n05027o24085m45099M10691k33498q68797m73671
3299.1D73512955K59361l0098p77283q00438n40580l71209k1133L01819l95432p52601
3308.8D70385361o39115n15594j29280m35219r97925r11903l01628l06282l73116j21345
3318.4D65653954j49155j92413n32685l93409j39123l88488m08745m06914n99212q81386
3328.1D61562424j102066p33757K7198k9945k51198m73900o56890k26670p69272r13848
3337.7D56432076K23541r5482j088715o42471j78947p32537j004753m10461Q1634j93176
3347.3D52390709k31781m72412q09593m26751m51736p23267j038055r10454n99327
3356D46727333o77414k28958p2937k61879j44310l96194j015664p96661l03230l41339
$$ y = [477124062, 477033157, 477041206, 476252441, 475747414, 475123329, 474678230, 475088921, 474855423, 473986626, 473512955, 473772316, 473742218, 472964935, 472164497, 471623917, 471252708, 471231575, 471533394, 471137962, 470385361, 469746246, 469230652, 469101372, 468666153, 467668228, 466756325, 466454697, 466148415, 465775299, 465653954, 465504799, 465312386, 464779701, 464386292, 464247169, 463858681, 463449936, 463043022, 462443810, 461562424, 460460358, 459726601, 459753799, 459723854, 459472656, 458998756, 458341866, 458115196, 457345924, 456432076, 456655617, 456560135, 455471420, 454828949, 454650002, 453917465, 452912712, 452502251, 452583885, 452390709, 452158928, 451686516, 450876923, 450450172, 449998436, 449275169, 448237114, 447326660, 446727333, 446049919, 445820961, 445748024, 445486145, 445341835, 444945641, 443929977, 443133316, 442830086, 442488747]
3365.7D42488747m23546o33125o65589p90977l54691J24741m47808n79567l71704l04489
3375.3D38041992l81508l85475p48558r11331k43721k01378j88332p75756r87015j21880
3384.9D33097038n01098o27175o6223L80516J95809m35868k99606k07062k75917n09567
3394.6D30750847n47524j94816n65834j93100N48668l1968l24172k39525k83013n78727
3404.2D28340836q41484j2284j1787j84899N18189k93312j276932j43776J045837L28980
3413.9D27469368n59349o50253M3678L57704m57802o61125n52139p8125M51050L55758
3423.5D25718765K9145m0131J39694L7346K1400k73132J21384J45645l12843J30386
3433.2D25717659j61858j29585J10016N23415M64706j21422n8059K07557P03201l46679
$$ y = [442488747, 442065201, 441432076, 440766487, 439975510, 439620819, 439745560, 439297752, 438718185, 438346481, 438041992, 437660484, 437275009, 436526451, 435615120, 435371399, 435170021, 434981689, 434205933, 433218918, 433097038, 432595940, 431968765, 431902542, 432283058, 432478867, 432042999, 431743393, 431536331, 431260414, 430750847, 430203323, 430008507, 429442673, 429249573, 429798241, 429766273, 429442101, 429202576, 428919563, 428340836, 427499352, 427487068, 427475281, 427290382, 427808571, 427515259, 426238327, 426094551, 427140388, 427469368, 426910019, 426259766, 426303444, 426661148, 426203346, 425542221, 424990082, 424911957, 425363007, 425718765, 425747910, 425707779, 425847473, 425884819, 425906219, 425633087, 425754471, 425900116, 425587273, 425717659, 425555801, 425426216, 425536232, 426059647, 426524353, 426402931, 426344872, 426552429, 427255630, 426908951]
3442.8D26908951J59683O26144K20108Q19169j167222m6615J126747L8109J88751J66283
3452.5D29040108Q60557N56526K25220M60816O27670O52580j2436k8496k45399L06129
3462.1D32443275L60604M17213R56993L73307r2392K2316J268921O74552k14195k3384
3471.7D36187210J0147J228676M55627l28178P71217Q40226M56695P83005O23398j87645
3481.4D40840378L24859O15578R18961O69899R117R05075O61468j78222N39970Q23975
3491D46131058L86657P67251M24880L30964R24720j51176j06506O41098Q58841J093635
3500.7D51301422J040077K43378p18460j8730N49927R87472J055718J043090J38436
3509.4D55622330r0294J630707O76040L42217R16977R22622P32460J51711Q06274K73476
$$ y = [426908951, 427068634, 427694778, 427914886, 428734055, 427566833, 427520218, 428646965, 428685074, 428873825, 429040108, 429900665, 430457191, 430682411, 431143227, 431770897, 432423477, 432411041, 432382545, 432137146, 432443275, 432803879, 433221092, 434178085, 434551392, 434459000, 434481316, 435750237, 436424789, 436210594, 436187210, 436197357, 437426033, 437881660, 437553482, 438324699, 439164925, 439621620, 440404625, 441028023, 440840378, 441165237, 441780815, 442699776, 443369675, 443378792, 444283867, 444945335, 444767113, 445307083, 446131058, 446517715, 447284966, 447709846, 448040810, 448965530, 448814354, 448707848, 449348946, 450207787, 451301422, 452341499, 452584877, 451866417, 451847687, 452397614, 453385086, 454440804, 455483894, 455622330, 455532036, 457162743, 457838783, 458181000, 459097977, 460020599, 460753059, 460904770, 461711044, 461984520]
3519D61984520R15O87943J178360R26056k46201Q07305J174202P81860J029358M09088
3528.6D68733406l02238O30645O73256R51157J421547J26304J626931O89125r01528
3537.3D73648605J605301J273804O90880M65698J169548R99909J002922P39135o18591
3546D80977211J254234m81491R04083J900673J578370J959686j538086O18477J305046
3554.7D88478203K130775J992684o17218J767616J061630L8223K96936J895791J548385
3563.4D98593025P43561M183922p96967j010017N44891l66401L643722J446266J450348
3572E08432350J570625J438942J364022R05761J296502J87568L000298K048378K47001
3580.7E20491447J853981K113228J609764K13585L587685J373444k561646J595840
$$ y = [461984520, 461985435, 462673378, 463851738, 464777794, 464531593, 465338898, 466513100, 467294960, 468324318, 468733406, 468431168, 469061813, 469735069, 470686226, 472107773, 472234077, 473861008, 474550133, 473648605, 475253906, 476527710, 477218590, 477684288, 478853836, 479853745, 480856667, 481595802, 480977211, 482231445, 481749954, 482654037, 484554710, 486133080, 488092766, 486554680, 487173157, 488478203, 490608978, 492601662, 491984444, 493752060, 494813690, 494851913, 495148849, 497044640, 498593025, 499336586, 503520508, 502723541, 501713524, 502258415, 501892014, 505535736, 506982002, 508432350, 510002975, 511441917, 512805939, 513711700, 515008202, 515195770, 518196068, 520244446, 520491447, 522345428, 524458656, 526068420, 526282005, 529869690, 531243134, 528681488, 530277328]
3588.4E30277328p20443L017616L753433L155556Q62160K87742L152199j730766K366524
3597.1E44421349M024887N50728K268142K82173Q76656K841492K529678J671219K855301
3605.8E62321625K246208k576370L881607k54746k89345Q267670l77083l310852L439751
3614.5E73348465o5575N265770M309082n22613J265220k021904Q96149M179649L156701
3623.1E89810944K367706K507172J115760J064949N992012k305297j1011582O369019
3630.9E95910683O215362N483361O00395j559372K897796L068085J824875k88200R90219
3639.5F15143204K449226K273865O56891L37867K451745L818359N758362l199425n090523
3648.2F24599571N571251j099243k925949J399422O216545M358024M327584M220657
$$ y = [530277328, 529556885, 532574501, 536327934, 539483490, 540345650, 540633392, 543785591, 542054825, 544421349, 548446236, 548996964, 551265106, 551547279, 552423935, 555265427, 557795105, 559466324, 562321625, 564567833, 561991463, 565873070, 565618324, 565328979, 573596649, 573219566, 569908714, 573348465, 573282890, 578548660, 582857742, 582335129, 583600349, 581578445, 582474594, 586654243, 589810944, 592178650, 594685822, 595801582, 596866531, 602858543, 600553246, 589541664, 595910683, 602126045, 607609406, 608209801, 606650429, 609548225, 612616310, 614441185, 614152985, 615143204, 617592430, 619866295, 620523186, 620861053, 623312798, 627131157, 632889519, 629690094, 624599571, 630170822, 629071579, 626145630, 627545052, 633761597, 638119621, 642447205, 646667862]
3655.9F46667862r446526K112656N776634J924668J485900L37372J717148N31693J394806
3664.6F52502213J632690M84314L900604Q31223j987229l24020n912705M689866R178466
3673.3F64995422P548066p781144j9310455R065323R871521M473267k638855Q89587
3681F67112732K931595J409302J311798L85513J221390M033050M775009j0329361l063507
3689.7F69787521Q348084n701370J681747O171188J075135K070541k74048r002J984405
3698.4F85134201J38626K137909K126465o041336j093521N669555J101151L04718J627121
3707F91104889K268906K532196p898560M210892L552322j3922500O061477N871430
3714.8F93781052R46884R02328K162781N88989l715973J115799M950943m931335l202057
$$ y = [646667862, 637221336, 639333992, 645110626, 647035294, 648521194, 648858566, 650575714, 651107407, 652502213, 654134903, 654619217, 658519821, 659351044, 657363815, 657039795, 651127090, 655816956, 664995422, 672543488, 664762344, 645451889, 654517212, 664388733, 668862000, 666223145, 667112732, 670044327, 671453629, 672765427, 673150940, 674372330, 678405380, 683180389, 672851028, 669787521, 678135605, 672434235, 674115982, 680287170, 681362305, 683432846, 683158798, 683149796, 685134201, 685272827, 687410736, 689537201, 683495865, 682402344, 688071899, 689173050, 689477768, 691104889, 693373795, 695905991, 688007431, 692218323, 695770645, 681848145, 687909622, 693781052, 694727936, 695630264, 697793045, 698382034, 694666061, 695781860, 700732803, 695801468, 692599411]
3723.4F92599411O405487O70090l62396k661286j39618M259644J454315N494690m637451
3732.1G03082886o522064J1348266N37186j2473297l29972L497162J548081M161300
3739.8G04849548M170533m126358L736114J1373444j6936646j4275970J2948074O532211
3747.5G08270950N576935n611954j0186004J1553116p582245l484116Q078232M398498
3755.3G11013412K226029n067444L391419M618911q330078K93274M887848J587143
3763G14620514P77969L474350l949814m243927M657135M665146j596374r534683L498535
3771.7G12368851M604492O81991O59867k22550R70307k3270K404404j308212p836533
3780.3G12299347M160690L298035J763763J756287l518829n62973R98001J085357Q82264
$$ y = [692599411, 699004898, 699674988, 699312592, 696651306, 696511688, 700771332, 702225647, 707720337, 703082886, 696560822, 707909088, 708446274, 695972977, 695643005, 699140167, 700688248, 704849548, 709020081, 704893723, 708629837, 720003281, 703066635, 688790665, 701738739, 708270950, 713847885, 708235931, 698049927, 709603043, 702020798, 698536682, 706614914, 711013412, 713239441, 708171997, 711563416, 716182327, 707852249, 708145523, 713033371, 714620514, 715398483, 718872833, 714923019, 710679092, 715336227, 720001373, 718404999, 708870316, 712368851, 716973343, 717655334, 718315201, 718092651, 719062958, 719039688, 721444092, 720135880, 712299347, 716460037, 719758072, 721521835, 723278122, 719759293, 719196320, 720194321, 721279678, 722161942]
3789G22161942p02668N25971N13153M83856j09329J419372L277436n077973m930420
3797.7G17561340L497238N465241N122070r323120r312057N525894M070206N322494
3805.4G27929306M179459j2612687k759704O861191L110809K71072M26789M35714R54590
3814.1G28796539M175492m322434j2194977P196198O271667M280167k020569j9538422
3821.8G12643661N525513P299042L295593K817764j515731n125122J981430L556747
3829.5G30478897L270493L97491r110870L720398P292785p106170l00675P920685j1344147
3838.2G25218887m627075R257431m233856J198273P729721k872162l173676L301773
3845.9G31799316R33228M8523J753311j164169K627334N283585r838028l872910j5554046
$$ y = [722161942, 721459274, 721985245, 722498398, 722982254, 722872925, 724292297, 727569733, 722491760, 717561340, 721058578, 726523819, 731645889, 722322769, 713010712, 718536606, 722606812, 727929306, 732108765, 719496078, 716736374, 723597565, 726708374, 726979446, 727406235, 727841949, 728796539, 732972031, 728649597, 716454620, 723650818, 729922485, 734202652, 732182083, 712643661, 718169174, 725468216, 728763809, 731581573, 730065842, 724940720, 726922150, 730478897, 733749390, 734146881, 725036011, 728756409, 736049194, 728943024, 728642349, 736563034, 725218887, 720591812, 729849243, 725615387, 726813660, 734543381, 731671219, 728497543, 731799316, 732732544, 732781067, 734534378, 733370209, 735997543, 741281128, 731443100, 727570190, 712016144]
3854.6G12016144Q258590J3094407r00498j487808K460785K518158K158661o886139
3862.3G31232300N92575O715011p599182m250793N935135P012329N870132j2135315
3870G33372192q570861N871276O812058J545563j1495667L135224N563507M69894K234039
3878.7G38937225K992249p191544m745788O737747Q77609J606217K937393j3221894
3886.4G28929214L833085M664917J3046L809128j776200r686660L180999N037613n07736
3895.1G37497406J854248N08728J928253K040482r146958N745926p31277q184204N450363
3903.8G36962967k323456J12229J321716J086654K998887P6294K31170L4409Q4686
3912.5G40585556k78168r74426J571350K314453m714966k877960O067810q89663l895722
$$ y = [712016144, 720274734, 733369141, 732468643, 730980835, 733441620, 735959778, 738118439, 731232300, 731824875, 738539886, 730940704, 726689911, 732625046, 739637375, 745507507, 733372192, 724801331, 730672607, 737484665, 739030228, 727534561, 730669785, 736233292, 736703186, 738937225, 741929474, 734737930, 729992142, 736729889, 737607498, 739213715, 742151108, 728929214, 732762299, 737427216, 737440262, 741249390, 739473190, 729786530, 732967529, 738005142, 737497406, 739351654, 739860382, 741788635, 743829117, 734682159, 740428085, 739696808, 731512604, 736962967, 734639511, 734751740, 736073456, 737160110, 740158997, 740235291, 740466461, 740500870, 740585556, 740307388, 739332962, 740904312, 743218765, 738503799, 735625839, 741693649, 740803986, 736908264]
3921.1G36908264M040756J754837M1810l095933k542190K422485J296921J000137j279602
3929.8G40547485o24389J712188k974166n17045K914200Q92716K97928J71966m91791
3938.5G41929092k89230l82996J356812J287384l856430j030350J051407J665497J503601
3947.2G43234787k875977J245804M71268k083588K368622M2420o87J078415l50800
3955.8G43130264q40759j149292N33295J69983J096496J005631p27387P10449k52151
3964.5G43676529j048813l0136O00891K34375j167602o45524J018067P64465n16357
3973.2G42885895k442P01828O37513L01208k72140j32294K05459L052l49731l90015
3982.8G43588333J88065L78647n44053k43301J16882O6147K50778k59399J226578R65347
$$ y = [736908264, 740949020, 742703857, 742745667, 739649734, 737107544, 739530029, 740826950, 741827087, 740547485, 739923096, 741635284, 738661118, 738144073, 741058273, 741950989, 742248917, 742420883, 741929092, 741639862, 741256866, 742613678, 743901062, 740044632, 739014282, 740065689, 741731186, 743234787, 740358810, 741604614, 742075882, 739992294, 742360916, 742403336, 742402649, 743481064, 743130264, 742289505, 741140213, 741673508, 741843491, 742939987, 743945618, 743218231, 743928680, 743676529, 742627716, 742597580, 743198471, 743432846, 742265244, 741619720, 742637787, 743402252, 742885895, 742883453, 743585281, 744222794, 744524002, 744251862, 744119568, 744325027, 744328079, 743978348, 743588333, 743776398, 744155045, 743610992, 743367691, 743484573, 743550720, 743801498, 743542099, 744768677, 745734024]
3992.5G45734024p16019k84881p24030n32989J79519N6458Q6136N99289
4000.2G44397507
$$ y = [745734024, 745018005, 744733124, 744009094, 743476105, 743655624, 743712082, 743798218, 744397507]
##END=$$ End of the data block
