##TITLE=$$ Begin of the data block
##JCAMP-DX=5.00 $$ ACD/SpecManager v 10.08
##SPECTROMETER/DATA SYSTEM=Varian
##DATE=20 Nov 2012 14:22:48
##DATA TYPE=INFRARED SPECTRUM
##DATA CLASS=XYDATA
##ORIGIN=
##OWNER=
##NPOINTS=3735
##FIRSTX=399.26403809
##LASTX=4000.35498047
##MAXX=4000.35498047
##MINX=399.26403809
##MAXY=78.83593750
##MINY=27.17978668
##XFACTOR=1.0000000000
##YFACTOR=0.000000100000000
##FIRSTY=52.79920959
##DELTAX=0.96440572
##XUNITS=1/CM
##YUNITS=TRANSMITTANCE
##XYDATA=(X++(Y..Y))
399.3E27992096j7923546n922508J0086670J0412407K308998l513069l469315J570473
$$ 527992096 510068550 504146042 514232712 524645119 526954117 523441048 519971733 521542206
407E21542206P90787N680046K960205p624436j4791832q544883M853935L815231L994866
$$ 521542206 522332993 528013039 530973244 523348808 508556976 500012093 504866028 508681259 512676125
415.7E12676125M441261L052215K800637m363365R919815R61761j858902n768623j0999375
$$ 512676125 517117386 520169601 522970238 518606873 528526688 529488449 527629547 521860924 510861549
424.3E10861549m566192L126068J334152O86455K602806J168442M062614L170128k534828
$$ 510861549 506295357 509421425 510755577 511442032 514044838 515213280 519275894 522446022 519911194
433E19911194k880173m572983k965393m173240o397591j327705M818267P770615Q551521
$$ 519911194 517031021 512458038 509492645 505319405 498921814 497594109 502412376 510182991 518734512
441.7E18734512M047242l849946K286835P335053L223838l855400o716499r85603J730537
$$ 518734512 522781754 518931808 521218643 528553696 531777534 527922134 521205635 520220032 521950569
450.4E21950569k323913n320969m99611J0093536J1329613M752159m190330l452301
$$ 521950569 519626656 514305687 513806076 523899612 535229225 539981384 535791054 532338753
458.1E32338753k81601l822632n598869o687661l554992j322403k61727L690911R31701
$$ 532338753 532057152 528234520 522635651 515947990 512392998 511070595 510808868 514499779 515431480
466.8E15431480j38473L625908L208885O89926j776886n518455n333672m826927p628327
$$ 515431480 515293007 518918915 522127800 522817726 521040840 515522385 510188713 505361786 497733459
475.5D97733459n057449j18561m74281K81487N455169O033821K610970K878303L523941
$$ 497733459 492676010 492557449 492083168 492364655 497819824 503853645 506464615 509342918 512866859
484.1E12866859N76630m654770n843925m206658n645866k709808J778411N253106M546394
$$ 512866859 513443489 508788719 502944794 498738136 493092270 490382462 492160873 497413979 501960373
492.8E01960373K259178K831345K613411q33207m426803M45137N14526j0502090r704323
$$ 501960373 504219551 507050896 509664307 508831100 504404297 504849434 505363960 494861870 485157547
501.5D85157547j238174j41488k665710L37372O702041N716210j054497l35350n72815
$$ 485157547 483919373 483777885 481112175 481449547 488151588 493867798 492813301 492477951 491905136
510.2D91905136k085075m427605o875801o292648n369263k988205l050308j521111
$$ 491905136 489820061 485392456 478516655 472224007 466854744 463866539 460816231 459295120
517.9D59295120L436203M049263L126068J250954K503586l93868m605751l826027n219841
$$ 459295120 462731323 466780586 469906654 471157608 473661194 473267326 468661575 464835548 459615707
526.6D59615707m161644m581146j473503K522812J839752L663750M542045M929581
$$ 459615707 455454063 450872917 449399414 451922226 453761978 457425728 461967773 466897354
534.3D66897354M038544L555221K231255N56107o57006j501388l77465j098365K27279
$$ 466897354 470935898 474491119 476722374 477278481 476621475 475120087 474742622 473644257 473871536
543D73871536L521843M465599M311257M110412L367386J861038N18647k425576m126701
$$ 473871536 477393379 481858978 486170235 490280647 493648033 495509071 496027718 493602142 489475441
551.6D89475441m066086m460106m821701m349098j014061O32248J665878L359528K054024
$$ 489475441 485409355 480949249 476127548 471778450 470764389 471396637 473062515 476422043 478476067
560.3D78476067p69082q26721j616974m655647m290924p168312r872551m846954k403832
$$ 478476067 477706985 476880264 475263290 470607643 466316719 459148407 449275856 444428902 442025070
569D42025070j11999L02238J228295J291618J697693K738228l090p75452j952057k094231
$$ 442025070 441913071 442215309 443443604 444735222 446432915 449171143 449168053 448392601 446440544 444346313
578.6D44346313j402359Q34465L158532K565002M563637N304413O103058O306457O706238
$$ 444346313 442943954 443778419 446936951 449501953 454065590 459370003 465473061 471779518 478485756
587.3D78485756M723701J996003O31103k248840k894325k864113l014794k511024n62630
$$ 478485756 483209457 485205460 485836563 483587723 480693398 477829285 474814491 472303467 471740837
596D71740837K705383M292145M870987L689194L202896J325531j714172j888237l076325
$$ 471740837 474446220 478738365 483609352 487298546 490501442 491826973 490112801 488224564 485148239
604.7D85148239n179176m621048k142906J99928J783371K706413M360199N461769M518929
$$ 485148239 479969063 475348015 473205109 473405037 475188408 477894821 482255020 487716789 492235718
613.4D92235718L844147J310043j798515k737465k548142k783279k177277o49910J344910
$$ 492235718 496079865 497389908 495591393 492853928 490305786 487522507 485345230 484695320 486040230
622D86040230N109939N609513N097313O137161N245209L563308J190071j340370l563804
$$ 486040230 491150169 496759682 501856995 507994156 513239365 516802673 517992744 516652374 513088570
630.7E13088570l821526k922096j482582r50661R8915L445320N075608O217117N609512
$$ 513088570 509267044 506344948 504862366 503911705 504010620 507455940 512531548 518748665 524358177
639.4E24358177M030113R52225j415520k101669m152717l492127l021278l397332j74026
$$ 524358177 528388290 529340515 527924995 525823326 521670609 518178482 515157204 511759872 511585846
648.1E11585846K446709L845672M546890N993004N852814L061752m24194k628174l179664
$$ 511585846 514032555 517878227 522425117 528418121 534270935 537332687 536908493 534280319 531100655
656.8E31100655l920746l747139k367134k276841m99649K530747N058937O202431O014709
$$ 531100655 527179909 523432770 521065636 518788795 518289146 520819893 525878830 532081261 538095970
665.4E38095970M486962n93758j3296967M488793K131653k778130l988953k402496
$$ 538095970 542582932 541989174 528692207 533181000 535312653 532534523 528545570 526143074
673.2E26143074k91862J350135M490052M186821M358139N922203M399910J709175j210366
$$ 526143074 525851212 527201347 531691399 535878220 540236359 546158562 550558472 552267647 551057281
681.8E51057281k014961l212242n343933m466972j178322o39038o48422L746681N943336
$$ 551057281 549042320 545830078 540486145 536019173 534840851 534201813 533553391 537300072 543243408
690.5E43243408N879364M840813K891045Q9683l813133m901047n300102n709076n315933
$$ 543243408 549122772 553963585 556854630 556944313 553131180 548230133 542930031 537220955 531905022
699.2E31905022l959961j402741O45828L492280L845558K820892K870903J526413p44972
$$ 531905022 527945061 526542320 527188148 530680428 534525986 537346878 540217781 541744194 540999222
707.9E40999222k797089l284416m468346n013771k494163J3695K953796N016670N606117
$$ 540999222 538202133 534917717 530449371 525435600 522941437 522955132 525908928 530925598 536531715
716.6E36531715O701126O547051N284996M685936K179680K19230j074028k020072j283074
$$ 536531715 543232841 549779892 555064888 559750824 561930504 562149734 561075706 559055634 557772560
725.2E57772560p46956L96462K860260N405121P735138Q637733O128426L876342K485009
$$ 557772560 557025604 557422066 560282326 565687447 573422585 582060318 588188744 592065086 594550095
733.9E94550095n44739k409897m697075m896545l822632k193222M48952K526435O239701
$$ 594550095 594005356 591595459 586898384 582001839 578179207 575985985 576434937 578961372 585201073
742.6E85201073O287384M250869L674088J358109j874543m748726o406860p418137
$$ 585201073 591488457 595739326 599413414 600771523 598896980 594148254 587741394 580323257
750.3E80323257o674308o287155l763466P04155J430931J430130K118034K765465J675491
$$ 580323257 573648949 567361794 563598328 564302483 565733414 567163544 569281578 572047043 573722534
759E73722534q95920k831840m822197o164246o698303m646950k170982j039314J742172
$$ 573722534 572826614 569994774 565172577 559008331 552310028 547663078 545492096 544452782 546194954
767.7E46194954M627876P298889Q498001O755410M764137M119377K134705j38283r12361
$$ 546194954 550822830 558121719 566619720 573375130 578139267 582258644 584393349 584255066 583342705
776.4E83342705j176071k62337J110802L486518M622422O452636R972077J0267982
$$ 583342705 582166634 581904297 583015099 586501617 591124039 597576675 607548752 617816734
784.1F17816734Q308754M305268J104927j146965k507553l678627m584351l980064
$$ 617816734 626125488 630430756 631535683 630388718 627881165 624202538 619618187 615638123
791.8F15638123j565514K370796M798889Q275910R821892P269935N904389M521179
$$ 615638123 614072609 616443405 621242294 629518204 639340096 646610031 652514420 657035599
799.5F57035599Q96454l500672m269409n309067m359970k720337j488228K854538N210839
$$ 657035599 657932053 654431381 650161972 644852905 640492935 637772598 636284370 639138908 644349747
808.2F44349747P365493P861023O575242M200973Q24356j981811n521164o018677p393112
$$ 644349747 651715240 659576263 666151505 670352478 671176834 669195023 663673859 657655182 650262070
816.9F50262070o456452k959976n51605K687836M332275N566788N682068N249633K081986
$$ 650262070 643805618 640845642 640294037 642981873 647314148 652880936 658563004 663812637 665894623
825.5F65894623k808304m722214o706085q613968r076347p008019l839836j663818
$$ 665894623 663086319 658364105 651658020 643044052 633967705 626959686 623119850 621456032
833.3F21456032M12254L437348M633522K978286J234131j754646l669357m711304o717796
$$ 621456032 621868286 625305634 629939156 632917442 634151573 632396927 628727570 624016266 617298470
841.9F17298470q067742p235603n048790l019257J91956J964798K559585L099327J583214
$$ 617298470 609230728 601995125 596946335 593927078 594119034 596083832 598643417 601742744 603325958
850.6F03325958J780319L47176l784065n480614o983681p518158n627670m806824l019065
$$ 603325958 605106277 605453453 601669388 596188774 589205093 581686935 576059265 571252441 568233376
859.3E68233376n00298K434425O641236Q126678O792793N653000M641686L280983J307564
$$ 568233376 567733078 570167503 576808739 584935417 591728210 597381210 602022896 605303879 606611443
868F06611443Q85925N35583O41175K651863N191307O987419P545395R001465Q887787
$$ 606611443 607497368 608032951 608674126 611325989 616517296 623504715 631050110 640051575 648939362
876.7F48939362O420745K152939q63266k605514o222382p065353o891709n897636m223709
$$ 648939362 655360107 657513046 656649780 654044266 647821884 640756531 633864822 627967186 623743477
885.3F23743477j359978Q79212P09648J255798M90494m80805k307663m479904o162185
$$ 623743477 622383499 623262711 623972359 625228157 625718651 625237846 622930183 618450279 612288094
894F12288094q081131p957764o615715m678459l008690n57442Q82263J059838K039642
$$ 612288094 604206963 596249199 589633484 584955025 581946335 581388893 582271156 583330994 585370636
902.7E85370636O05125j642646l610382n634118o888542p540626p209320p043801o746368
$$ 585370636 585975761 584333115 580722733 575088615 568200073 560659447 553450127 546406326 539659958
911.4E39659958m211311j707840j887207k427140j411705j362953l047638m650497
$$ 539659958 535448647 533740807 531853600 529426460 528014755 526651802 523604164 518953667
919.1E18953667n193367n086823n734062m508514l053055k518959P53898K345848K502137
$$ 518953667 513760300 508673477 502939415 498430901 495377846 492858887 493612785 495958633 498460770
927.8D98460770L204193L386574K686767J215820M616o70929j070022k273064k139435
$$ 498460770 501664963 505051537 507738304 508954124 508958740 508287811 507217789 504944725 502805290
936.4E02805290p16095O10733K864647M269219N029945N786247N456543K901917L16581
$$ 502805290 502089195 502699928 505564575 509833794 514863739 520649986 526106529 529008446 529325027
945.1E29325027j312484m169693o316643o455841o590538o182747n211105m752808
$$ 529325027 528012543 523842850 517526207 511070366 504479828 498297081 493085976 488333168
952.8D88333168m151230l316841m273453n545845o794929p366181q130989j0090294
$$ 488333168 484181938 480865097 476591644 471045799 464250870 456884689 448753700 438663406
960.6D38663406r964866r400330r095230r094086p384605n973396o438561o190872
$$ 438663406 428698540 419298210 410202980 401108894 393724289 387750893 381312332 375121460
968.3C75121460o454697o393432p798195p488365p608757q737946q657150q487339
$$ 375121460 368666763 362273331 354475136 346986771 339378014 330640068 321982918 313495579
976C13495579o553250o863861n045948m365024l751545j908856k405166j115380j834259
$$ 313495579 306942329 300078468 295032520 290667496 286915951 285007095 282601929 281486549 279652290
984.7B79652290j623096j725464j016655j186657j609688J32485q25348M25129J04828
$$ 279652290 278029194 276303730 275287075 274100418 272490730 272623215 271797867 272222996 272327824
993.3B72327824J324825K405014K174835K490750O85195J428280Q5526q5278o49509
$$ 272327824 273652649 276057663 278232498 280723248 281408443 282836723 282922249 282836971 282187462
1002B82187462n14183K81963j003132N79796K76451J461621R20009J096878J492367
$$ 282187462 281673279 281955242 280952110 281531906 281808357 283269978 284189987 285286865 286779232
1010.7B86779232k57931Q22544M0760j37634k271480j590805k92607m73671Q71601
$$ 286779232 286521301 287343845 287384605 287246971 284975491 283384686 283092079 282618408 283490009
1019.4B83490009L31250K539844K240105L053360K326488J504631K045861j82000J557293
$$ 283490009 283821259 286361103 288601208 291654568 293981056 295485687 297531548 297349548 298906841
1028.1B98906841M14925M7912q1729j07384J035480R47609K753525K335167L320313
$$ 298906841 299321766 299369678 299287949 299180565 300216045 301163654 303917179 306252346 309572659
1036.7C09572659K056388J175614O3228q78696L71761j576500j144390k280540o55804
$$ 309572659 311629047 312804661 312867889 311989193 312360954 310784454 309640064 307359524 306703720
1045.4C06703720K20833J2741K273617J908378L161507J514072K540246K247962J272507
$$ 306703720 306924553 306937294 309210911 311119289 314280796 315794868 318335114 320583076 321855583
1054.1C21855583J576691q0719J307030J161842K953491K687340L747482M459954M462051
$$ 321855583 323432274 323351555 324658585 325820427 328773918 331461258 335208740 339668694 344130745
1062.8C44130745O669197M391136N247803L887710J969147l98292k093277k159615
$$ 344130745 350799942 355191078 360438881 364326591 366295738 365897446 363804169 361644554
1070.5C61644554n751381m865913m991417l534622k822075k258530L90358J10283J344261
$$ 361644554 355893173 351027260 346035843 342501221 339679146 337420616 337810974 337921257 339265518
1079.2C39265518j287918j036339q71505k12822N25245o35910J735916R78547L225555
$$ 339265518 337977600 336941261 336069756 335856934 336382179 335746269 337482185 338460732 341686287
1087.9C41686287L155289L585929M571000L260574L651085K051315K725601J18714
$$ 341686287 344841576 348427505 352998505 356259079 359910164 361961479 364687080 364805794
1095.6C64805794q1444L0136o79436J372834J70707K235871K278747K036209J579018
$$ 364805794 364724350 364754486 364075050 365447884 365618591 367854462 370133209 372169418 373748436
1104.2C73748436Q62923P84759p47566K94189j149978p22237L47366J099816J056099
$$ 373748436 374611359 375396118 374648552 374942741 373792763 373070526 373417892 374517708 375573807
1112.9C75573807J383438M168892L007049L472710L575287K970924J103096J21079
$$ 375573807 376957245 381126137 384133186 387605896 391181183 394152107 395255203 395376282
1120.6C95376282O35032j372070m57153o95458m62150J35879J344414K867088L210793
$$ 395376282 396011314 394639244 394182091 393486633 393024483 393160362 394504776 397371864 400582657
1129.3D00582657M872513L170623L115426K249374P29523j03760j157913o68297k689362
$$ 400582657 405455170 408625793 411741219 413990593 414720116 414616356 413458443 412790146 410100784
1138D10100784k838134j767388N00183o14586l078422k005959k927780q90427k155914
$$ 410100784 407262650 405495262 405995445 405380859 402302437 400296478 397368698 396478271 394322357
1146.7C94322357m677772m349518m446068l584480l270951j944732j811524M89807
$$ 394322357 389644585 385295067 380848999 377264519 373993568 372048836 370237312 370727119
1154.4C70727119L60184K57378J787720J076164J205444j280441l69225k21405o81686
$$ 370727119 371087303 371344681 373132401 374208565 375414009 374133568 373764343 373542938 372861252
1163.1C72861252J34315K23046J910476K021637M495926M535408N299263O388054N804024
$$ 372861252 372995567 373218613 375129089 377150726 381646652 386182060 391481323 397869377 403673401
1171.8D03673401O152077M371376M598083L944092L480034L477211L690529M759216
$$ 403673401 409825478 414196854 418794937 422739029 426219063 429696274 433386803 438146019
1179.5D38146019N344734O876908P189750Q119545P881165P084045O227837M373703
$$ 438146019 443490753 450367661 457557411 465676956 473558121 480642166 486870003 491243706
1187.2D91243706K832069J581612R76562M75121P36542J331062K867737L800049L543777
$$ 491243706 494075775 495657387 496633949 497109070 497845612 499176674 502044411 505844460 509388237
1195.9E09388237M563446M582901L101654P43065n48515j261139k389603k539329j557160
$$ 509388237 513951683 518534584 521636238 522379303 521830788 520569649 518180046 515640717 514083557
1204.5E14083557J75705Q16803J611977L162880M351806N041619N096626M094467K458801
$$ 514083557 514259262 515076065 516688042 519850922 524202728 529244347 534340973 538435440 540894241
1213.2E40894241J593247m18625j072655p39784j133843K20910K013702L096924L454361
$$ 540894241 542487488 542068863 540996208 540256424 539122581 539343491 541357193 544454117 547908478
1221.9E47908478M365883M379043K566071J073837l8452j730614l489761m016876l952523
$$ 547908478 552274361 556653404 559219475 560293312 560254860 558524246 555034485 551017609 547065086
1230.6E47065086l432159k084122o68220J229095K389374K868004K762260J677284
$$ 547065086 543632927 541548805 540880585 542109680 544499054 547367058 550129318 551806602
1238.3E51806602L53470j254654k481536l101044l408623l044662k085839o94961Q89549
$$ 551806602 552160072 550905418 548423882 545322838 541914215 538869553 536783714 536088753 536978302
1247E36978302K856789M052848M484406L986359K878837J401062j77040j426926k370796
$$ 536978302 539835091 543887939 548372345 552358704 555237541 556638603 556461563 555034637 552663841
1255.7E52663841k427406j852036j607856k63749J458664K507515L353272L957481
$$ 552663841 550236435 548384399 546776543 546512794 547971458 550478973 553832245 557789726
1263.4E57789726L705902K325592J112099K35787j096993j798439k469521j725883
$$ 557789726 561495628 563821220 564933319 565169106 564072113 562273674 559804153 558078270
1271.1E58078270r37271K55318K286605L079911L741455L307647K592240J570244k66877
$$ 558078270 557140999 557396317 559682922 562762833 566504288 569811935 572404175 573974419 573707542
1279.8E73707542j317558k826538l660164l411903k541542j828995n05219J450119
$$ 573707542 572389984 569563446 565903282 562491379 559949837 558120842 557615623 559065742
1287.5E59065742K565804K938995K704811K009202N19065p07435k119980l385048l888741
$$ 559065742 561631546 564570541 567275352 569284554 569803619 569096184 566976204 563591156 559702415
1296.2E59702415m319801l368797k067642n58815O07452J654701K208596J663703J708527
$$ 559702415 555382614 552013817 549946175 549387360 549994812 551649513 553858109 555521812 557230339
1304.8E57230339J08414j792221k878151l864365l841591l422622k247086j400337
$$ 557230339 557338753 555546532 552668381 548804016 544962425 541539803 539292717 537892380
1312.5E37892380l50189J434707J965218K070808K169495J104126o72417j231270k155342
$$ 537892380 537542191 538976898 540942116 543012924 545182419 546286545 545614128 544382858 542227516
1321.2E42227516l667335m083672l626289k715416k017060j178512l74680K90909P44400
$$ 542227516 538560181 534476509 530850220 528134804 526117744 524939232 524564552 524855461 525599861
1329.9E25599861j77345q33779j882553l222694l434906l466492l700752l593292k091065
$$ 525599861 525422516 524588737 522706184 519483490 516048584 512582092 508881340 505288048 503196983
1338.6E03196983j024971Q4915K352067K400131K743454K144165J534996M35638r95559
$$ 503196983 502172012 502256927 504608994 507009125 509752579 511896744 513431740 513867378 512871819
1347.3E12871819j356049k323456k593841k111893j493874m92096J033974J824989
$$ 512871819 511515770 509192314 506598473 504486580 502992706 502500610 503534584 505359573
1355E05359573J677781K102279J221733M52919j97143j194344k620621l744773m245568
$$ 505359573 507037354 509139633 510361366 510814285 510617142 509422798 506802177 503057404 498811836
1363.7D98811836j534462K21176k64511O50750J921157K199440K539330J790123J815605
$$ 498811836 497277374 497498550 497234039 497884789 499805946 502005386 504544716 506334839 508150444
1372.3E08150444L06091j623153k028275j311073p88422j999130m91295R17549K190514
$$ 508150444 508456535 506833382 504805107 503494034 502705612 500706482 500215187 501132736 503323250
1381E03323250K770729K934952L226432K506333K448158J329460j53846k35062M1199
$$ 503323250 506093979 509028931 512255363 514761696 517209854 518539314 518385468 518150406 518191605
1389.7E18191605p12357n57136P92121Q92601J032601J741447L165932K122192J211319
$$ 518191605 517479248 516922112 517714233 518606834 519639435 521380882 524546814 526669006 527880325
1398.4E27880325k59971j833420q82340k500953k901345k709732l225326j101952K72103
$$ 527880325 527620354 525786934 524904594 522403641 519502296 516792564 513567238 512465286 512737389
1407.1E12737389R32617J094627J918259J040001P60536l36266j547279j895637k659150
$$ 512737389 513670006 514764633 516682892 517722893 518483429 518147163 516599884 514704247 512045097
1415.7E12045097k307891k454987j109581m060097K49253L328170K182198K340736
$$ 512045097 509737206 507282219 506172638 502112541 502361794 505689964 507872162 510212898
1423.4E10212898Q96645J477012J040917n34134k29111j921653l139039j773262R11484
$$ 510212898 511109543 512586555 513627472 513093338 512864227 510942574 507803535 506030273 506941757
1432.1E06941757Q75054R46121K710228K686958K862816J098747K938690J383515j72272
$$ 506941757 507816811 508762932 511473160 514160118 517022934 518121681 521060371 522443886 522271614
1440.8E22271614r31930k061005j055794j662369j61361O48079J212349R23042J927452
$$ 522271614 521339684 519278679 518222885 516560516 516399155 517047234 518259583 519182625 521110077
1449.5E21110077L032722Q72841P17240r27201n39817j625062m727745p277031m512634
$$ 521110077 524142799 525015640 525732880 524805679 524265862 522640800 517913055 510636024 506123390
1458.2E06123390L013954k0790K465287J953125K934227L715019P52411L372230J330643
$$ 506123390 509137344 509116554 511581841 513534966 516469193 520184212 520936623 524308853 525639496
1466.8E25639496J654205K97699P43370J544457l42598L776169K226181O989784N065918
$$ 525639496 527293701 527591400 528334770 529879227 529536629 533312798 535538979 542528763 547594681
1475.5E47594681O719627O196213N078926N039635K421303K723007K25944J288262
$$ 547594681 554314308 560510521 565589447 570629082 573050385 575773392 575999336 577287598
1483.2E77287598N83191R59816K693290J145020M516029M631729P722588L496895L341980
$$ 577287598 577870789 578830605 581523895 582668915 587184944 591816673 599539261 603036156 606378136
1491.9F06378136L708839J423721J687279j215668l638267O45790j55411j61400L284684
$$ 606378136 610086975 611510696 613197975 611982307 608344040 608989830 608834419 608673019 611957703
1500.6F11957703M309425L549652N541420M470329M299775l932457m366532N059853
$$ 611957703 616267128 619816780 625358200 629828529 634128304 630195847 625829315 630889168
1508.3F30889168k50397K4834k75917m04740j141014K853089L277473L362732N658455
$$ 630889168 630638771 630663605 630387688 629982948 628841934 631695023 634972496 638335228 643993683
1517F43993683j62430M777679L264542j052093k553711m147415J267013q53119k411041
$$ 643993683 643831253 648608932 651873474 650821381 648267670 644120255 645387268 644534149 642123108
1525.7F42123108r2392L318100K896118L992615N361938K817536L244705q17413l617173
$$ 642123108 642030716 645348816 648244934 652237549 657599487 660417023 663661728 662844315 659227142
1534.3F59227142p4157j780320p97042q05588k961121o640930P307129L068619J628723
$$ 659227142 659152985 657372665 656575623 655770035 652808914 646167984 653475113 656543732 658172455
1543F58172455N408249J896896J88904J171875Q2474j810761m586105m862290j33361
$$ 658172455 663580704 665477600 665666504 666838379 666920853 665110092 660523987 655661697 655528336
1551.7F55528336P38678P2860j241531K653885N626907M840622p828293n439758J862869
$$ 655528336 656267014 656339874 655098343 657752228 663379135 668219757 660391464 654951706 656814575
1560.4F56814575M476700K65732j697846k700119n651931j800995J141357K663727
$$ 656814575 661291275 661557007 659859161 657159042 651507111 649706116 650847473 653511200
1568.1F53511200K492218j332245J996689K336731k0142j510772r69773l417969j0900039
$$ 653511200 656003418 654671173 656667862 659004593 658984451 657473679 656503906 653085937 642185898
1576.8F42185898K94189j18103p56607M54788J485901K290116J648636J085433Q94089
$$ 642185898 642480087 642361984 641605377 642060165 643546066 645836182 647484818 648570251 649464340
1585.5F49464340J2818j377030k888565l447800l712349k758293k223854m69475L40195
$$ 649464340 649477158 648100128 645211563 641763763 638051414 635293121 633069267 632599792 632939987
1594.1F32939987M44107J657067J618003J363030K72255j182480k320938l243332l736115
$$ 632939987 633384094 635041161 636659164 638022194 638294449 637111969 634791031 631547699 627811584
1602.8F27811584m264106l054657k389832r42154n14984P28378Q21648K19956J227188
$$ 627811584 623547478 620492821 618102989 617160835 616645851 617374229 618195877 618415833 619643021
1611.5F19643021o62232j467857k456360k050705l851242j1860390O62232J1787l02238
$$ 619643021 618980789 617512932 615056572 613005867 609154625 597294235 597956467 597968254 597666016
1620.2E97666016n72319J756630J370010k346687J051063M00505p0724l450508l492203
$$ 597666016 597093697 598850327 600220337 597873650 598924713 599325218 599254494 595803986 592311783
1628.9E92311783j755295l136291k079964j368103J542435J842689k579613l29284
$$ 592311783 590556488 587420197 585340233 583972130 585514565 587357254 584777641 584448357
1636.6E84448357L070640J819267J060982K61231j987801j108589j649132M1962o8398
$$ 584448357 587518997 589338264 590399246 590660477 588672676 587564087 585914955 585956917 585888519
1645.3E85888519m605446m58030J596451M809303M096184M409828M055328K4338m495163
$$ 585888519 581283073 580825043 582421494 587230797 591326981 595736809 599792137 599816475 595321312
1653.9E95321312J336784J506615J96915k88658l4447R91401K139740L678246M325295
$$ 595321312 596658096 598164711 598361626 598072968 598038521 599029922 601169662 604847908 609173203
1662.6F09173203K045326L696136L159943K068138J880760J360092k882003l79792
$$ 609173203 611218529 614914665 618074608 620142746 622023506 623383598 620501595 620121803
1670.3F20121803J665535m8485K737847L512153J667328K607270N396309N097732M314575
$$ 620121803 621787338 621738853 624476700 627988853 629656181 632263451 637659760 642757492 647072067
1679F47072067L388901M04816J724395J207734o174698o819229P793045O009674L555145
$$ 647072067 650460968 650865784 652590179 653797913 647623215 640803986 648597031 654606705 658161850
1687.7F58161850L274994M592590M580231M074707L812561K225876J983948r86863
$$ 658161850 661436844 666029434 670609665 674684372 678496933 680722809 682706757 681719894
1695.4F81719894q438339L571472L741150L885193l390427m080581Q117065N912781
$$ 681719894 673281555 676853027 680594177 684479370 681088943 677008362 685125427 691038208
1703.1F91038208M473495L078385K608871q9035m6615l51792k078399j789399j43737
$$ 691038208 695511703 698590088 701198959 701109924 701063309 700711517 698633118 696843719 696699982
1711.8F96699982R28344J197892P39441J301956M887466N161057k564926K347183K675628
$$ 696699982 697628326 698826218 699565659 700867615 705755081 710916138 708351212 710698395 713374023
1720.5G13374023N01252j577759k564926k616196m72946K55813M21906K289200L226242
$$ 713374023 713875275 712297516 709732590 707116394 706643448 706899261 707321167 709610367 712836609
1729.1G12836609K694397J833420L580093L105087l302536m620819J379853R49401
$$ 712836609 715531006 717364426 720944519 724049606 720747070 716126251 717506104 718455505
1736.9G18455505j850204l69873k047882j322785M655686M026184K521591K109833
$$ 718455505 716605301 716235428 714187546 712864761 717520447 721546631 724068222 726178055
1744.6G26178055L135910J918259J70135q51669k633972M16946l632431j659012L032379
$$ 726178055 729313965 731232224 731402359 730550690 727916718 728333664 724701233 723042221 726074600
1753.3G26074600K190933L441239L919983K139587K093277K951279J613388J102295
$$ 726074600 728265533 731706772 735626755 737766342 739859619 742810898 744424286 745526581
1761G45526581l382797k715378L28750r58862l20969R26896J778183k70157L322296
$$ 745526581 742143784 739428406 739757156 738798294 738477325 739404221 741182404 740912247 744234543
1769.7G44234543N745849K538529J87378j760788J288147l88260l292847q38470j741333
$$ 744234543 749980392 752518921 752706299 750945511 752233658 751845398 748552551 747714081 745972748
1778.3G45972748k22092p2174K31400K576980L509064L478241J589355J047287R96552
$$ 745972748 745750656 745678482 745909882 748486862 751995926 755474167 757063522 758110809 759107361
1787G59107361l02582j782074j286316k522735k905808l146591M26102M567031L043518
$$ 759107361 758804779 757022705 755736389 753213654 750307846 747161255 747587357 752154388 755197906
1795.7G55197906K058259L073806K693863Q95844j452866k04468k173538k053985j377259
$$ 755197906 757256165 760329971 763023834 763919678 762466812 762262344 760088806 758034821 756657562
1804.4G56657562j594085j0605N72586J565170K598190L417893J728973J645584J466065
$$ 756657562 755063477 755052872 755625458 757190628 759788818 763206711 764935684 766581268 768047333
1813G68047333n67551j129532k258453j917114k443772j216049j82114N11094K165756
$$ 768047333 767479782 766350250 764091797 762174683 759730911 758514862 758332748 758843842 761009598
1821.7G61009598K238998L806458L089752K71225J82419M66156k46353l314743o397171
$$ 761009598 763248596 767055054 770144806 770416031 770598450 771064606 770818253 767503510 761106339
1830.4G61106339n01938J035003j61819O73218K040023L000489K898636J387481J602783
$$ 761106339 760604401 761639404 761477585 762150803 764190826 767191315 770089951 771477432 773080215
1839.1G73080215K55127n20019j603165j441498k896118o986542J577607J593704R97848
$$ 773080215 773335342 772815323 771212158 769770660 766874542 759888000 761465607 763059311 764057159
1847.8G64057159K100678K766189K765198J785202J523590l61938j165543j944504
$$ 764057159 766157837 768924026 771689224 773474426 774998016 774636078 773470535 771526031
1855.5G71526031k294616k015534k147903o05774J22375J494065J770019K386246K222900
$$ 771526031 769231415 767215881 765067978 764462204 764584579 766078644 767848663 770234909 772457809
1864.2G72457809J330796J673736o4392m46090k879410l459549j188507j280213k32773
$$ 772457809 773788605 775462341 775397949 774951859 772072449 768612900 767424393 766144180 765911407
1872.8G65911407L72696J422120J910553K778091K416153J653442J053696o86035j024323
$$ 765911407 766284103 767706223 769616776 772394867 774811020 776464462 777518158 776832123 775807800
1881.5G75807800k254257k016754k166977j912537l2653M20761K229995K320328J254654
$$ 775807800 773553543 771536789 769369812 767457275 767424622 767845383 770075378 772395706 773650360
1890.2G73650360K111511K233963P35855j06124j483155l104324j710281j756745j279144
$$ 773650360 775761871 777995834 778731689 778625565 777142410 774038086 772327805 770571060 769291916
1898.9G69291916n47485N54046J790466J940995K726440K039795J577225O43005r15680
$$ 769291916 768744431 769298477 771088943 773029938 775756378 777796173 779373398 780016403 779100723
1907.6G79100723j858597k214889k485275k405854p01980m13666R20258J818695K340469
$$ 779100723 777242126 775027237 772541962 770136108 769434128 769020462 769940720 771759415 774099884
1916.2G74099884L418503Q10470M55018Q48922n73196j445236l276749k270279q48465
$$ 774099884 777518387 778328857 778783875 779632797 779059601 777614365 774337616 772067337 771218872
1924.9G71218872p12128m37317R34906J800690J918640K216339J979752J378708k30942
$$ 771218872 770506744 770069427 771004333 772805023 774723663 776940002 778919754 780298462 780067520
1933.6G80067520o08826j686019k543946k263870j754761o11191k80761J767959J938172
$$ 780067520 779458694 777772675 775228729 772964859 771210098 770598907 770318146 772086105 774024277
1942.3G74024277R14459K273178K149963J053849j70899n56106j622620k663422k402801
$$ 774024277 774938736 777211914 779361877 780415726 780244827 779688721 778066101 775402679 772999878
1951G72999878j561661m37088M23813J323166J560059K015380K182007K002335R72366
$$ 772999878 771438217 771001129 771424942 772748108 774308167 776323547 778505554 780507889 781480255
1959.6G81480255l79104j129685k240219j876526j429367j161652q38012n95627J196594
$$ 781480255 781101151 779971466 777731247 775854721 774425354 773263702 772425690 771830063 773026657
1968.3G73026657K422714K534333J828537J593780M23813l62701r26590k074891j767654
$$ 773026657 775449371 777983704 779812241 781406021 781829834 781467133 780540543 778465652 776697998
1977G76697998j934128j346130n95780K27662J306305J572647K429123K172012J491012
$$ 776697998 774763870 773417740 772821960 773049622 774355927 775928574 778357697 780529709 782020721
1985.7G82020721M23737o25076j718445k064362j131744k097321k516632j34735J445389
$$ 782020721 782444458 781819382 780100937 778036575 776904831 774807510 772290878 772156143 773601532
1994.3G73601532J290741J536941K190857J753617J484146P3700q14209j481476k023697
$$ 773601532 774892273 776429214 778620071 780373688 781857834 781931534 781117325 779635849 777612152
2003G77612152j839447j765442j048202l06015Q53042J357956J788483K007065J178131
$$ 777612152 775772705 774007263 772959061 772653046 773506088 774864044 776652527 778659592 779837723
2011.7G79837723N07278k06070p56454j595764j859055k282333j712494p63016l02505
$$ 779837723 780345001 780138931 779382477 777786713 775927658 773645325 771932831 771169815 770867310
2020.4G70867310J026077J436691J894455J689987J293183R19342o68946j271133j851273
$$ 770867310 771893387 773330078 775224533 776914520 778207703 779127045 778458099 777186966 775335693
2029.1G75335693j778412j964569j710968n10330J9074N49698J048431J764831J518326
$$ 775335693 773557281 771592712 769881744 769371414 769390488 769940186 770988617 772753448 774271774
2037.7G74271774J480332N67779r94262j151200j732788k020721k024842r18045k87170
$$ 774271774 775752106 776319885 775325623 774174423 772441635 770420914 768396072 767478027 767190857
2046.4G67190857J71127J247711J234131J724015J943206J209565K8457l01208r97696
$$ 767190857 767361984 768609695 769843826 771567841 773511047 774720612 774749069 774447861 773450165
2055.1G73450165k106171j667251j637726j003647m45252L08991J321564J847076K164612
$$ 773450165 771343994 769676743 768039017 767035370 766590118 766899109 768220673 770067749 772232361
2063.8G72232361J188812P15942R7428o21491j080703j525956j775741j703186p92237
$$ 772232361 773421173 774137115 774234543 773613052 772532349 771006393 769230652 767527466 766735229
2072.5G66735229l90014P86362J835250K002640J428909Q84476J238480M0207o95572
$$ 766735229 766345215 767131577 768966827 770969467 772398376 773282852 774521332 774561539 773865967
2081.1G73865967j325913j871872j645126j274490l46146j80588P69806J610489J593857
$$ 773865967 772540054 770668182 769023056 767748566 767402420 767221832 767991638 769602127 771195984
2089.8G71195984J675262J545639O84510m29154q33435j400757r98687j430054j499558
$$ 771195984 772871246 774416885 775101395 774672241 773838806 772438049 771439362 770009308 768509750
2098.5G68509750o19125k49710R05685J307831J960907J656723J057816Q76617j18713
$$ 768509750 767890625 767640915 768546600 769854431 771815338 773472061 774529877 775406494 775287781
2107.2G75287781m29611j738282k096023j476898j133423n95780K76337J472855J591110
$$ 775287781 774858170 773119888 771023865 769546967 768413544 767817764 768094101 769566956 771158066
2115.9G71158066J817932J588211Q16193L25470J26113q43353j988296j783142j982422
$$ 771158066 772975998 774564209 775380402 775705872 775831985 774988632 773000336 771217194 769234772
2124.5G69234772j031876m4479N11322R86786R25140J858215J943055J354065K89306
$$ 769234772 768202896 768158417 768669739 769656525 770581665 772439880 774382935 775737000 776026306
2133.2G76026306o10885j319962j709976j200180j310196j032028n55039O18897J140365
$$ 776026306 775415421 774095459 772385483 771185303 769875107 768843079 768288040 768906937 770047302
2141.9G70047302J510315K126389J042480P61795M41590n12772j700592j775818j220703
$$ 770047302 771557617 773684006 774726486 775488281 775929871 775417099 773716507 771940689 770719986
2150.6G70719986j315613o33545j64184Q73489J145859J217193J579743J381149J340790
$$ 770719986 769404373 768770828 768606644 769480133 770625992 771843185 773422928 774804077 776144867
2159.3G76144867J75857m83627j414490j844482j429443q76999k71607k89001J011734
$$ 776144867 776320724 775837097 774422607 772578125 771148682 770271683 770000076 769711075 770722809
2167.9G70722809J381454J695481J887970J157226R24835P7820l13415j201325j494980
$$ 770722809 772104263 773799744 775687714 776844940 777769775 777847595 777534180 776332855 774837875
2176.6G74837875j487426j062317j18027k9449J016616J448822J852494J629943R18808
$$ 774837875 773350449 772288132 772170105 772140656 773157272 774606094 776458588 778088531 779007339
2185.3G79007339R73435J39313m77295r12781j249008j711197j171646k81143N32226
$$ 779007339 779980774 780120087 779642792 778730011 777481003 775769806 774598160 774317017 774849243
2194G74849243J335831J142578J744919J406708Q99200O27441m38995r31702r29412
$$ 774849243 776185074 777327652 779072571 780479279 781378479 782005920 781566925 780635223 779705811
2202.6G79705811n84565j188888j037827k37427M66614J060181J210098J499100J221924
$$ 779705811 779121246 777932358 776894531 776657104 777123718 778183899 779393997 780893097 782115021
2211.3G82115021J486130P61642m14047q25272j305847j256256j023789p52563o92368
$$ 782115021 783601151 784362793 783948746 783123474 781817627 780561371 779537582 778785019 778092651
2220G78092651N46799J174240J561508K035370J213761J118927k5406q05130r35593
$$ 778092651 778639450 779813690 781375198 783410568 784624329 785743256 785717850 784912720 783977127
2228.7G83977127j306305j182098q97980l02887m56848N35278J341934J561127J670990
$$ 783977127 782670822 781488724 780590744 780287857 779831009 780366287 781708221 783269348 784940338
2237.4G84940338J126251P85599l25165o14090j096954j534195j478653j168976k23694
$$ 784940338 786066589 786852188 786527023 785912933 784815979 783281784 781803131 780634155 780410461
2246G80410461L39737J112976R84574J361084J393585R72366R20258j86539o43463
$$ 780410461 780750198 781863174 782847748 784208832 785602417 786574783 787495041 787308502 786665039
2254.7G86665039j178894j066437j086654j052170q30231n96237J159744J619034J541367
$$ 786665039 785486145 784419708 783333054 782280884 781450653 780854416 782014160 783633194 785174561
2263.4G85174561J200103Q84705L99551n07202m12674j150131j406326j259995m88205
$$ 785174561 786374664 787259369 787658920 787151718 786739044 785588913 784182587 782922592 782434387
2272.1G82434387J20926J27640P47070J338425J530762N44891P48138P10526N6610
$$ 782434387 782555313 782682953 783430023 784768448 786299210 786844101 787592239 788302765 788359375
2280.8G88359375n09949j387405j147232j795044j076431k04087L32260J088639J008224
$$ 788359375 787849426 786462021 785314789 783519745 782443314 782239227 782571487 783660126 784668350
2289.4G84668350J505432J211853P00760l30429l50570p01981j749039j060791j418228
$$ 784668350 786173782 787385635 788086395 787755966 787405396 786703415 784954376 783893585 782475357
2298.1G82475357n45273j73034J67770Q29391M94996J035690J169739R96780p53098
$$ 782475357 781930084 781757050 781924820 782754211 783249207 784284897 785454636 786451416 785698318
2306.8G85698318j118927o73828j146087j559143k131729n18799n29785K88085Q99277
$$ 785698318 784579391 783905563 782759476 781200333 779068604 778549805 778020020 778308105 779207382
2315.5G79207382J177292J636581K4415J66015q70895q52356j507263j976090q13904
$$ 779207382 780384674 782021255 782045670 782211685 781340790 780488434 778981171 777005081 776191177
2324.2G76191177j579132k94342o17828O76117R22088K82059O10047j80665J513978
$$ 776191177 774612045 774317703 773699875 774375992 775298080 775580139 776190186 776009521 777523499
2332.8G77523499M55856n59845k531204j877671O51245j789245k194901m25415J762619
$$ 777523499 777979355 777419510 774888306 773010635 773661880 771872635 769677734 769252319 771014938
2341.5G71014938P47605J427078J854324J300125J240387o76574J199417M84237k338104
$$ 771014938 771762543 773189621 775043945 776344070 777584457 776907883 778107300 778591537 776253433
2350.2G76253433k840118j274414m05503j855163r43146k25067N90897J387558M19845
$$ 776253433 773413315 772138901 771733398 769878235 768935089 768710022 769300919 770688477 771108322
2358.9G71108322k43912j515960k427368j960755O22406J46942L15857J79138m96444
$$ 771108322 770864410 769348450 766921082 764960327 765582733 765729675 766045532 766224670 765728226
2367.6G65728226J779327K622757K080841J173248K290879J765060m18243j296387
$$ 765728226 767507553 770130310 772211151 773384399 775675278 777440338 777022095 775725708
2375.3G75725708q36716l13720p80411O50558J336518Q42132J058045J687622J716537
$$ 775725708 774888992 774575272 773794861 774445419 775781937 776624069 777682114 779369736 781086273
2383.9G81086273R04694O67038j49155k86026o31714j313324j227569j450348n03464
$$ 781086273 781990967 782658005 782508850 782222824 781591110 780277786 779050217 777599869 777096405
2392.6G77096405J27182L83682O75812J099167J392898M86146J39770j41296m31366
$$ 777096405 777223587 777607269 778283081 779382248 780775146 781261292 781401062 781259766 780828400
2401.3G80828400j022873j600342j604767q68072M3487j6403O67267N52368M84085
$$ 780828400 779805527 778205185 776600418 775732346 775775833 775759430 776426697 776979065 777463150
2410G77463150J113586O63147R1019p54013j007233j101684j213684j213913r26743
$$ 777463150 778576736 779239883 779330902 778576889 777569656 776467972 775254288 774040375 773113632
2418.7G73113632k77862o8360O3019K36130J361923J322098M05273K42768o45752j496582
$$ 773113632 772835770 772767410 772830429 773066559 774428482 775750580 776155853 776398621 775752869 774256287
2428.3G74256287j716690j238938j073608r41544m67834M89883J111679K90451O23322
$$ 774256287 772539597 771300659 770227051 769285507 768817673 769307556 770419235 770709686 771333008
2437G71333008J072006N23377m16413j047516j028976j289826j282882j387101q68453
$$ 771333008 772405014 772928391 772511978 771464462 770435486 769145660 767862778 766475677 765607224
2445.7G65607224m31748k00729Q28094J269074R35669M79889K85491n51910r68704
$$ 765607224 765175476 764974747 765802841 767071915 768007584 768487473 768772964 768221054 767252350
2454.3G67252350j011353j221924j029815j128693p08999j70823M79432N67550O40412
$$ 767252350 766240997 765019073 763989258 762860565 762151566 761980743 762460175 763027725 763668137
2463G63668137R36279K07214N3635l24707o64826r27124j108017j099853j531448q16727
$$ 763668137 764604416 764811630 764865265 764540558 763875732 762948608 761840591 760740738 759209290 758392563
2472.7G58392563J9531P77969R34220O59180O72454J05439o0730l60260p70569j203766
$$ 758392563 758412094 759190063 760124283 760783463 761455917 761561356 761500626 761140366 760369797 759166031
2482.3G59166031j432190j119385o27594j39160n9204L55148P67136Q61206N15671
$$ 759166031 757733841 756614456 755986862 755847702 755788498 756143646 756910782 757771988 758287659
2491G58287659M33120K92130n09796q39768r82818p95365j156616j243362l97263L21198
$$ 758287659 758720779 759012909 758503113 757663345 756680527 755885162 754728546 753485184 753087921 753409119
2500.6G53409119O86645M34876P93991Q34579L21427j29395k68707n17731j266174
$$ 753409119 754095764 754530640 755324631 756159210 756480637 756351242 756082535 755564804 754298630
2509.3G54298630j088410j022491p77969n65644o0425R39789J054764J008530L24554
$$ 754298630 753210220 752187729 751409760 750844116 750783691 751723480 752778244 753786774 754111328
2518G54111328K20719P3852n38788p25326j159592j138611r70154p33719n75866L42102
$$ 754111328 754332047 754405899 753867111 753141785 751982193 750843582 749873428 749139709 748563843 748905945
2527.6G48905945N28030K95792J239929O49567M1961k91061p84760j053009j279602
$$ 748905945 749433975 749729767 750969696 751619263 751661224 751370163 750585403 749532394 748252792
2536.3G48252792j036834j109925q21762o59714K02637J211395J047974K50397k07291
$$ 748252792 747215958 746106033 745284271 744624557 744827194 746038589 747086563 747336960 747129669
2545G47129669M11606j91650n32837p62253j453323j137848j130600q22678l46909
$$ 747129669 747541275 747349625 746816788 746054535 744601212 743463364 742332764 741510086 741163177
2553.7G41163177K94724N32303N51376Q20389L89023q1864o92367p20139o71234j016998
$$ 741163177 741457901 741990204 742541580 743361969 743750992 743669128 742976761 742256622 741585388 740568390
2563.3G40568390j275253j238327o93360j00097L99169L82996P55081O47583K05460
$$ 740568390 739293137 738054810 737361450 737261353 737660522 738043518 738798599 739446182 739651642
2572G39651642K02255l75442j069107j450577q31070q88138r08356m11606k93197P14721
$$ 739651642 739853897 739478455 738409348 736958771 736127701 735239563 734331207 733919601 733626404 734341125
2581.6G34341125Q41980P82090O06155l53241p14874l29209j43508j012421j061936
$$ 734341125 735183105 735965195 736571350 736218109 735503235 735174026 735030518 734018097 732956161
2590.3G32956161r39102p71179l62549l43704N15518O59485K78854L98484J56173o4239
$$ 732956161 732017059 731245880 730883331 730539627 731055145 731714630 731993484 732391968 732548141 732483902
2600G32483902N3177m54865j060409j086579j193084q56324l69796L41873O22330N41687
$$ 732483902 732537079 732082214 731021805 729935226 728742142 727885818 727516022 727857895 728480225 729021912
2609.6G29021912N06210m6158K21329o867p56759j077957j268006j109390r49097p54089
$$ 729021912 729528122 729481964 729703293 729696426 728939667 727861710 726593704 725484314 724535217 723781128
2619.3G23781128o68945K38342P11975N33066L96499j66702j9379l46069j100006j522827
$$ 723781128 723112183 723350525 724062500 724595566 724992065 724825363 724805984 724459915 723359909 721837082
2628.9G21837082j551056j325073j017838n69992l68118J26800J1521J07879K55585
$$ 721837082 720286026 718960953 717943115 717373123 717005005 717131805 717143326 717251205 717506790
2637.6G17506790J88599K96860j012650j472549r86405r19571r30328j161347j214370
$$ 717506790 717695389 717992249 716979599 715507050 714520645 713601074 712670746 711509399 710295029
2646.3G10295029m37470N45349J00556M0359M83704K32010n81055j123199q94700j361007
$$ 710295029 709857559 710402908 710503464 710543823 711027527 711259537 710678482 709555283 708660583 707299576
2655.9G07299576j133576o92749p74765o59179l91007J90048O8207K08969L16086R7275
$$ 707299576 706166000 705473251 704698486 704039307 703648300 703838348 703906555 704115524 704431610 704528885
2665.5G04528885l07617r53141j103439j197891q74329q39081p25250p27691p02439
$$ 704528885 704221268 703268127 702164688 700966797 700092468 699253387 698528137 697800446 697098007
2674.2F97098007N06439J029663N06363j05514k15836m15878o78711j041336j489868
$$ 697098007 697604446 698634109 699140472 699034958 698819122 698403244 697724533 696683197 695193329
2682.9F95193329j168213r13467l44849r842N9814L65754J98288r9106q8425q850o15692
$$ 695193329 694025116 693111649 692766800 692756958 692816772 693182526 693380814 693281708 693193283 693184433 692568741
2693.5F92568741q53653j118698j024246n63279q03909l80783n76477n64804Q9798
$$ 692568741 691715088 690596390 689572144 689008865 688204956 687824173 687247696 686682892 686772690
2702.2F86772690J76697K18887N1575m58n07050q82721j032257j064224j166992j340027
$$ 686772690 686949387 687168274 687219849 687219391 686712341 685829620 684797363 683733139 682566147 681226120
2711.8F81226120o91376j68838K63824R4071N1422L91617K64053j28326q71811q94471
$$ 681226120 680534744 680365906 680629730 680723801 680775223 681166840 681430893 681302567 680430756 679536285
2721.5F79536285j151657j105652p40966p00226l44238l81775J33972L00522J49688
$$ 679536285 678384628 677278976 676538010 675837784 675493546 675111771 675245743 675546265 675695953
2730.2F75695953N4016k76718r7961k27280n13839r34525q31070o66733r00345p07702
$$ 675695953 675749969 675473251 675375290 675148010 674634171 673699646 672868576 672201843 671301498 670593796
2739.8F70593796k48871N37491O76422O6910l80860J18637K15531m72336o41785j094360
$$ 670593796 670344925 670882416 671558838 671625748 671244888 671363525 671579056 671106720 670464935 669370575
2749.4F69370575j217499r80911p56912m08173L02887Q11462K42081l2196J83487O18897
$$ 669370575 668153076 667172165 666415253 666007080 666309967 667121429 667363510 667331314 667514801 668133698
2759.1F68133698J56021r21173j185990j176147j015473p48138k73056j16654K56958
$$ 668133698 668289719 667368546 666182556 665006409 663990936 663242798 662969742 662853088 663110046
2767.8F63110046M77982K19269M41208K71835j60828n97381p30896j111908j008454
$$ 663110046 663588028 663807297 664248505 664520340 664359512 663762131 663031235 661919327 660910873
2776.4F60910873l66516p02972p48749p88116J46484J114655J37710n66635k30484
$$ 660910873 660544357 659841385 659092636 658304520 658451004 659565659 659703369 659136734 658906250
2785.1F58906250R8190m62188o80008q84247j360779j292877j005554p38449q07724
$$ 658906250 659004440 658542252 657862244 656977997 655617218 654324341 653318787 652580338 651772614
2793.8F51772614K10418N28336j86768Q1330k71759r65043j221160j264267r91517
$$ 651772614 651983032 652511368 652324600 652405930 652134171 651169128 649947968 648683701 647692184
2802.5F47692184o22787j091766j451340r94721o86416j02616j05056l51944l02811
$$ 647692184 647069397 645977631 644526291 643531570 642845154 642742538 642637482 642285538 641982727
2811.2F41982727l61023p49893j118469o67649j257896k023087j739425j439820j116371
$$ 641982727 641621704 640871811 639753342 639085693 637827797 635804710 634065285 632625465 631509094
2819.8F31509094o45256p5722j35345m70467o88438p98416j079178j349525j291657
$$ 631509094 630863838 630788116 630652771 630182304 629493866 628695450 627616272 626266747 624975090
2828.5F24975090j355743j379052j555442j415139j040611o02722o83670j001816p53174
$$ 624975090 623619347 622240295 620684853 619269714 618229103 617626381 616942711 615940895 615187721
2837.2F15187721j085090j268654j476708j372757j544075k181282j800728j933479
$$ 615187721 614102631 612833977 611357269 609984512 608440437 606259155 604458427 602524948
2844.9F02524948j606598j669121j855087j304741j693153j364479r81026p89795j282310
$$ 602524948 600918350 599249229 597394142 596089401 594396248 593031769 592050743 591260948 589978638
2853.6E89978638j824608j374474j451874j183967j376915j338463q82683r13849p84187
$$ 589978638 588154030 586779556 585327682 584143715 582766800 581428337 580545654 579631805 578847618
2862.3E78847618j186905j257973j100845j522674j731301j485100k181549k610435
$$ 578847618 577660713 576402740 575301895 573779221 572047920 570562820 568381271 565770836
2870E65770836k052765k213440j940956k031136k076187j625137j919365j701393j652260
$$ 565770836 563718071 561504631 559563675 557532539 555456352 553831215 551911850 550210457 548558197
2878.7E48558197j742439j673050j833992j662445j242752j318360j833915j501236
$$ 548558197 546815758 545142708 543308716 541646271 540403519 539085159 537251244 535750008
2886.4E35750008p35436o2446l57895o82640K74772K27852l69186m73862o27785o69059
$$ 535750008 535014572 534952126 534594231 533911591 534186363 534414215 534045029 533571167 532943382 532274323
2896E32274323l62092j67808n37071o18363l34205M0245J49841j33133n84831p71485
$$ 532274323 531912231 531744423 531207352 530588989 530254784 530295029 530444870 530311737 529726906 528955421
2905.7E28955421m66194m82902q62503j356583j458931j067848j063728j452065j208496
$$ 528955421 528489227 528006325 527143822 525787239 524328308 523260460 522196732 520744667 519536171
2914.3E19536171r50584j185570j065064j435394j595192j734314k069092j329040
$$ 519536171 518585587 517400017 516334953 514899559 513304367 511570053 509500961 508171921
2922.1E08171921j061669j120338j141052r70917n37529j06239J86424k96593K04277
$$ 508171921 507110252 505989914 504848862 503877945 503340416 503234177 503420601 503124008 503328285
2930.7E03328285O69556P34863J110764Q13331J147461J441727J467361J607895J283188
$$ 503328285 503997841 504732704 505843468 506656799 507804260 509245987 510713348 512321243 513604431
2939.4E13604431J677170K353172J827164J884994K950402K677345J945610J980438
$$ 513604431 515281601 517634773 519461937 521346931 524297333 526974678 528920288 530900726
2947.1E30900726K480393K226677J803779K303124J966476J803932K227898K192154
$$ 530900726 533381119 535607796 537411575 539714699 541681175 543485107 545713005 547905159
2954.8E47905159K253227K563172K779388K609901K360459K077408K294273K308083
$$ 547905159 550158386 552721558 555500946 558110847 560471306 562548714 564842987 567151070
2962.6E67151070J534576J187744J448670J537513J598931J938209J951294K017937
$$ 567151070 568685646 569873390 571322060 572859573 574458504 576396713 578348007 580365944
2970.3E80365944K090149K233276J916695J308975J223335Q67386J314316J316566
$$ 580365944 582456093 584689369 586606064 587915039 589138374 590005760 591320076 592636642
2978E92636642J007348J452789J244964J289254J353454J467438J461678J192894Q46138
$$ 592636642 593643990 595096779 596341743 597630997 598984451 600451889 601913567 603106461 603952599
2986.7F03952599Q42437J413346Q55903M79737K34031j1940K00768N49087J453591
$$ 603952599 604795036 606208382 607064285 607544022 607778053 607766113 607966881 608515968 609969559
2995.3F09969559Q22677K00692M91447L40500M50859K36244k33993n26886n48363o09779
$$ 609969559 610792236 610992928 611484375 611824875 612275734 612511978 612277985 611751099 611202736 610592957
3005F10592957n86510l04337j83906K34604K71301j33553K63214J01891q38089n98907
$$ 610592957 610006447 609702110 609518204 609752808 610024109 609890556 610153770 610255661 609417572 608818665
3014.6F08818665p83539j382752q74672n42526j000366j107216k65312n35889q19893
$$ 608818665 608035126 606652374 605777702 605235176 604234810 603127594 602862282 602326393 601506500
3023.3F01506500j57051m69169q05397r12552p38449q83408j478958j489411j298866
$$ 601506500 601349449 600880280 600074883 599162331 598423882 597540474 596061516 594572105 593273239
3032E93273239r75036j142159j294060p55005j42021j68037n53932q67043j438332
$$ 593273239 592298203 591156044 589861984 589106979 588964958 588796921 588242989 587375946 585937614
3040.7E85937614j500320j439781j486016j292343j228561j392937j239624p56416
$$ 585937614 584437294 582997513 581511497 580219154 578990593 577597656 576358032 575601616
3048.4E75601616n84908l49197q91609q68836k81257j300354j533509j395721j748886
$$ 575601616 575016708 574667511 573775902 572907066 572625809 571325455 569791946 568396225 566647339
3057.1E66647339j414375j208458j085968j081887j193924p70645o37398j112709p10907
$$ 566647339 565232964 564024506 562938538 561856651 560662727 559892082 559254684 558141975 557431068
3065.7E57431068q08754j521225j467933j397286q92677j273231j958542j215859n67741
$$ 557431068 556622314 555101089 553633156 552235870 551343193 550069962 548111420 546895561 546327820
3074.4E46327820p91092j310005j070519m59251n15976j278229j464119j179733j448746
$$ 546327820 545536728 544226723 543156204 542696953 542180977 540902748 539438629 538258896 536810150
3083.1E36810150j503944j317177j238861j448822j012497o20995r04045m69627n02968
$$ 536810150 535306206 533989029 532750168 531301346 530288849 529667854 528763809 528294182 527791214
3091.8E27791214j131363j612205j478501q44993q49114j170196j391716j367493j369095
$$ 527791214 526659851 525047646 523569145 522724152 521875038 520704842 519313126 517945633 516576538
3100.5E16576538r89342m76875p16782j122322j033706q41637r37576p86515j228675
$$ 516576538 515587196 515110321 514393539 513271217 512237511 511395874 510458298 509671783 508443108
3109.1E08443108j394959j271706j768951j165543n83839q92563j477814j129303k52838
$$ 508443108 507048149 505776443 504007492 502841949 502258110 501365547 499887733 498758430 498505592
3117.8D98505592n69152o88019r12400j590309j451759r41887j144562j044006o04820
$$ 498505592 497936440 497248421 496336021 494745712 493293953 492352066 491207504 490163498 489558678
3126.5D89558678q97065r53331j217803r54361l01629o44798j089020j415557j077958
$$ 489558678 488661613 487708282 486490479 485536118 485234489 484589691 483500671 482085114 481007156
3135.2D81007156r20868j092681q98133j014900j255302j093407o22253n96314o72073
$$ 481007156 480086288 478993607 478095474 477080574 475825272 474731865 474109612 473513298 472841225
3143.9D72841225p70226q14819o21262n79033r01909j279182j022377j418915j510734
$$ 472841225 472070999 471256180 470634918 470055885 469153976 467874794 466852417 465433502 463922768
3152.5D63922768o12374k79464o35529j226044q54988m89273l77083n41420j018715
$$ 463922768 463310394 463030930 462395401 461169357 460314369 459825096 459448013 458906593 457887878
3161.2D57887878r75875j328354j212349q14896n75905n07202n88226n44472j016388
$$ 457887878 456912003 455583649 454371300 453556404 452980499 452473297 451885071 451340599 450324211
3169.9D50324211o23932m73823j120453r40552n60455n24445o16798r15833j632232
$$ 450324211 449700279 449226456 448106003 447165451 446604996 446080551 445463753 444547920 442915688
3178.6D42915688r89228j81274o38466p28264o07109m97208o68068n92079j78756l25509
$$ 442915688 441926460 441745186 441106720 440378456 439771347 439274139 438606071 438013992 437835236 437509727
3188.2D37509727n84373j071777j373558j125718j011772o74972k42729n43709m88816
$$ 437509727 436925354 435853577 434480019 433354301 432342529 431667557 431424828 430881119 430392303
3196.9D30392303j1367k46315q13103q35228m81644o80389o70166p68585o87981m30412
$$ 430392303 430380936 430134621 429321518 428486290 428004646 427324257 426654091 425885506 425197525 424767113
3206.5D24767113q40531m60205p43980q89015j06964j05706j67961p95250q21724l58314
$$ 424767113 423926582 423466377 422722397 421833382 421726418 421620712 421452751 420657501 419835777 419477463
3216.2D19477463n55840p49054q75320n88074j60370j96991o74209n45998m90265n08957
$$ 419477463 418921623 418172569 417297249 416709175 416548805 416351814 415677605 415131607 414641342 414132385
3225.8D14132385j44882n02243p51495n65491k54974n54810r14269p97042n60723J01319
$$ 414132385 413987503 413485260 412733765 412168274 411913300 411358490 410444221 409647179 409086456 409187775
3235.5D09187775j46408n84145l45421k14615n44586p02133k49596l4408k05841r81675
$$ 409187775 409041367 408457222 408111801 407897186 407352600 406650467 406400871 406366463 406160622 405178947
3245.1D05178947n08079L1776o72722l10211k21481p48596p35398j71814R2469l36685
$$ 405178947 404670868 404702644 404029922 403719711 403498230 402749634 402014236 401842422 401934891 401598206
3254.8D01598206n35393m55055n25780p55654k63786k10342m51546j18637j10703k26707
$$ 401598206 401062813 400607758 400081978 399326324 399062538 398852196 398400650 398282013 398171310 397944603
3264.4C97944603m73785k72294k53295m93813l83034j96991m65812p03392K6359l41492
$$ 397944603 397470818 397198524 396945229 396451416 396068382 395871391 395405579 394702187 394728546 394387054
3274C94387054n39474l12347m69094K08016K81601O9351p32346p01942J0261m59976
$$ 394387054 393847580 393535233 393066139 393274155 393555756 393625107 392892761 392190819 392201080 391741104
3283.7C91741104m77219l09829j65596n32799n09567J27334L7957l06054o64329j45645
$$ 391741104 391263885 390954056 390788460 390255661 389746094 389873428 389911385 389605331 388941002 388795357
3293.3C88795357k84920p00378j69831j3237k1896k47917l67928j95503k81525n68466
$$ 388795357 388510437 387810059 387640228 387626991 387605095 387357178 386989250 386793747 386512222 385943756
3303C85943756l37639l37944n77469J3390J90964o7063m14734n62744n97229o70776
$$ 385943756 385606117 385268173 384690704 384704094 384895058 384827995 384413261 383850517 383253288 382582512
3312.6C82582512m06418k52075j60446k54708J88637Q1062p64045p06749n01747j67885
$$ 382582512 382176094 381924019 381763573 381508865 381697502 381778564 381014519 380307770 379806023 379638138
3322.3C79638138l32451n60837m76723o28814m57001l86314j75972L9634m6959l32069
$$ 379638138 379305687 378744850 378268127 377639313 377182312 376795998 376620026 376659660 376612701 376280632
3331.9C76280632l08876k25220o35185n84526n43938l05900o8055n48210l56445q2245
$$ 376280632 375971756 375746536 375111351 374526825 373982887 373676987 373608932 373060722 372704277 372622032
3341.6C72622032o53686n81475j17492l14370l83720m18472n75066n06019j93596j52359
$$ 372622032 371968346 371386871 371269379 370955009 370571289 370152817 369577751 369071732 368878136 368725777
3351.2C68725777l80974m32930q08602m66041P7248J62544P3242p22084o71883j62697
$$ 368725777 368344803 367911873 367103271 366637230 366714478 366877022 366950264 366228180 365556297 365393600
3360.8C65393600l41911p64847l59459j41220r70878o30989l02277j47057r6168p53021
$$ 365393600 365051689 364286842 363927383 363786163 362815285 362184296 361882019 361734962 361638794 360885773
3370.5C60885773m93851r4719J11389k4605m16984l47595k42424n82810o69098n8784
$$ 360885773 360391922 360297203 360408592 360383987 359967003 359619408 359376984 358794174 358125076 358066292
3380.1C58066292l62168m32472Q3885l10402k65846K59362P476o37664p53060m16145
$$ 358066292 357704124 357271652 357355537 357045135 356779289 357038651 357046127 356408463 355655403 355239258
3389.8C55239258j13449k5521K0867l5668j57661k30942k78778j86996m98047J2665
$$ 355239258 355125809 355100288 355121155 355085487 354927826 354696884 354418106 354231110 353733063 353745728
3399.4C53745728N39016j04599l17306n67284l09143K17514o5498m57001o32324k16675
$$ 353745728 354284744 354180145 353862839 353295555 352986412 353203926 353138428 352681427 352049103 351832428
3409.1C51832428J52283R8800j56746k19192j26457J95274O63834J79062k19117j46141
$$ 351832428 351984711 352083511 351926765 351707573 351581116 351776390 352440224 352619286 352400169 352254028
3418.7C52254028j84135j10169j91803k64740J3848N17998O14204J27335p1259j11542
$$ 352254028 352069893 351959724 351767921 351503181 351517029 352035027 352649231 352776566 352705307 352593765
3428.3C52593765n71747j99546K63519k74429m31366L92875J196404K51045q38699
$$ 352593765 352022018 351822472 352085991 351811562 351380196 351773071 352969475 353220520 352381821
3437C52381821l66173N88951L16925l76816M07868L17764K1248L24707P42760P62863
$$ 352381821 352015648 352604599 352921524 352544708 352952576 353270340 353291588 353616295 354359055 355121918
3446.7C55121918j308975o22483P90405O84243P57255K19040K12670N13610M66652
$$ 355121918 353812943 353190460 353980865 354665108 355422363 355641403 355854073 356367683 356834335
3455.3C56834335J79711Q0719j18981K24686P88078K93122M04052o6223K08512N82771
$$ 356834335 357014046 357094765 356975784 357200470 357988548 358281670 358685722 358619499 358828011 359410782
3465C59410782j98212M42963M27055J85662M69360O09588N78118K39487L52363J08872
$$ 359410782 359212570 359655533 360082588 360268250 360737610 361347198 361925316 362164803 362517166 362626038
3474.6C62626038J30615M65889M33235L18832L81661K26707M49982M94995l59230O63033
$$ 362626038 362756653 363222542 363655777 363974609 364356270 364582977 365032959 365527954 365168724 365831757
3484.3C65831757O69975K81715J070862J99242J47018O69556O66656J65596l75061
$$ 365831757 366501732 366783447 367854309 368053551 368200569 368870125 369536781 369702377 369327316
3493C69327316O02532J140556M79889j82877J52359Q53463J008949P06253L74107q545
$$ 369327316 369929848 371070404 371550293 371367416 371519775 372373238 373382187 374088440 374462547 374454002
3502.6C74454002J55983Q30422O04973N06973R01909J463089j24245j344528Q70590
$$ 374454002 374609985 375440407 376045380 376552353 377454262 378917351 378793106 377448578 378319168
3511.3C78319168J271324R65653O84700J88980J21498M72145Q22907M02984O69785
$$ 378319168 379590492 380556145 381240845 381429825 381551323 382023468 382846375 383249359 383919144
3520C83919144O65245J198692M24309q23174J020966Q81576N09186R42002Q18557j92413
$$ 383919144 384584389 385783081 386207390 385384216 386405182 387286758 387795944 388737946 389556503 389364090
3529.6C89364090K9602Q40874N91240J083374L62281R95865N96619o26640J349334
$$ 389364090 389393692 390234566 390825806 391909180 392271461 393267326 393863945 393237305 394586639
3538.3C94586639Q38738J85699O17409J319237J310844J042939N2604m92897J507912
$$ 394586639 395425377 395611076 396228485 397547722 398858566 399901505 399954109 399461212 400969124
3547D00969124k63901R02443J565590J042519J249198j075897J373215Q92143R93309
$$ 400969124 400705223 401607666 403173256 404215775 405464973 404389076 405762291 406654434 407647743
3555.6D07647743J742859J24512J826935J449012L38211m86068J511650J310386R81789
$$ 407647743 409390602 409515114 411342049 412791061 413129272 412643204 414154854 415465240 416447029
3564.3D16447029N035286q71010k412338j47018m05694L823967J907578J630020J922722
$$ 416447029 421482315 420611305 418198967 418051949 417646255 421470222 423377800 425007820 426930542
3573D26930542J470489P14112J239013J928940J02730K027512J086235L77388J656151
$$ 426930542 428401031 429115143 430354156 432283096 432385826 434413338 435499573 435876961 437533112
3581.7D37533112J672630J557693Q07991M268113J774711j904449P81975j372338L061867
$$ 437533112 439205742 440763435 441571426 445839539 447614250 445709801 446491776 445119438 448181305
3590.4D48181305L316765L186149J206704N77125L441048j867142K332039M079780
$$ 448181305 451498070 454684219 455890923 456468048 459909096 458041954 460373993 464453773
3598.1D64453773L85552K589302N43594Q97904K652778J196633J390419L719139L244781
$$ 464453773 464839325 467428627 467972221 468870125 471522903 472719536 474109955 477829094 481073875
3606.8D81073875r52568L033066j749000L93409Q974343J175270k424660K966156m99077
$$ 481073875 480121307 483154373 481405373 481798782 490773125 491948395 489523735 492489891 491990814
3615.4D91990814N017014M171257n67055J180153k174606M19845L864594L688163L114853
$$ 491990814 497007828 501179085 500612030 501792183 499617577 500037422 503902016 507590179 510705032
3624.1E10705032K682495J280175K733574P362861k770195j0990829N153236N980759
$$ 510705032 513387527 514667702 517401276 524764137 521993942 511003113 516156349 522137108
3631.8E22137108O041069M89273j973648K521286L494682K373009J04828K043266L018990
$$ 522137108 528178177 528667450 526693802 529215088 532709770 535082779 535187607 537230873 540249863
3640.5E40249863K187309O87027O22520K797737M040108N803986j823235l500633N158577
$$ 540249863 542437172 543124199 543746719 546544456 550584564 556388550 554565315 551064682 556223259
3649.2E56223259k177658m580841J664924P174416M894295M243126L538093q439636
$$ 556223259 554045601 549464760 551129684 558304100 563198395 567441521 570979614 562539978
3656.9E62539978L180008N037765M99573J251335J351700L253555J510087J155509
$$ 562539978 565719986 570757751 571257324 572508659 573860359 577113914 578624001 579779510
3664.6E79779510J851502J080704N032272L542519j448632j926918o747932M156532
$$ 579779510 581631012 582711716 587743988 591286507 589837875 587910957 581163025 585319557
3672.3E85319557J0156746J0582199k752266k2926140O108895J0081672M759102l106117
$$ 585319557 595476303 606058502 603306236 580380096 586488991 596570663 601329765 598223648
3680E98223648N36614L249740J808815J705399Q59298J376000N027695N167999j2864533
$$ 598223648 598760262 602010002 603818817 605524216 606383514 607759514 612787209 617955208 605090675
3688.7F05090675j512832R521141o287804J229630N788879J330299K411957M19731
$$ 605090675 603577843 613098984 606811180 608040810 613829689 615159988 617571945 617991676
3696.4F17991676R0866J359787P65381L315544K278405p379723j152878N691147J158981
$$ 617991676 618082542 619442329 620207710 623523254 625801659 618421936 617269058 622960205 624119186
3705.1F24119186Q06466J747665L799705L512307q407173N609588L498116j5330582
$$ 624119186 624925652 626673317 630473022 633985329 625578156 631187744 634685860 619355278
3712.8F19355278N980530N190048L54805R14612K957344J852188l408890J560936O526413
$$ 619355278 625335808 630525856 630880661 631795273 634752617 636604805 633195915 634756851 641283264
3721.5F41283264m692192m585991O472664R68094p72324k291450O72645L871651J467896
$$ 641283264 636591072 632005081 638477745 639445839 638673515 636382065 637054710 640926361 642394257
3730.2F42394257N957260n442810o669808J0881615p74155j0499267J927070L380928
$$ 642394257 648351517 642908707 636238899 647120514 646346359 635847092 637774162 641155090
3737.9F41155090Q90885L937378L278885l678132N684281J2408752j9108963j5009498
$$ 641155090 642045975 645983353 649262238 645584106 651268387 663677139 644568176 629558678
3745.6F29558678J4117012P364731O600265l999863r282226J2336960q058548p385331
$$ 629558678 643675690 651040421 657640686 653640823 644358597 656695557 648637009 641251678
3753.3F41251678O982804O131668L147507o651917L987045N222397r836120M33120
$$ 641251678 648234482 654366150 657513657 650861740 654848785 660071182 650235062 650668182
3761F50668182N328675J932678O79245K283401m402999l736039N261689O116027o52389
$$ 650668182 655996857 657929535 658608780 660892181 656489182 652753143 658014832 664130859 663478470
3769.7F63478470j0274887K702865L681565M46014J922302O32706N66864J86081L112869
$$ 663478470 653203583 655906448 659588013 660034027 661956329 662589035 663155899 663341980 666454849
3778.4F66454849q61130p982788L822251K331466J069336K720261l799515j266784
$$ 666454849 665593719 657610931 661433182 663764648 664833984 667554245 663754730 662487946
3786.1F62487946K302932J806336N36117n47256P47833k83127m9743K28195K162781
$$ 662487946 664790878 666597214 667133331 666586075 667333908 667050781 667001038 667229233 669392014
3794.8F69392014L422470n465851k856903M122314M673767M904480r854812q707428
$$ 669392014 672814484 667348633 664491730 668614044 673287811 678192291 668337479 659630051
3802.5F59630051N186386L807068O002807M543686j3344574k539291O886978K203064
$$ 659630051 664816437 668623505 674626312 679169998 665825424 663286133 670173111 672376175
3810.2F72376175K58789P88269M53339K206802O959915k192917j5703201O510849O239548
$$ 672376175 672634964 673423233 673876572 676083374 683043289 680850372 665147171 671658020 677897568
3818.9F77897568M698944J008072k1562348M008255P312317K820206L146515r08203
$$ 677897568 682596512 683604584 662042236 666050491 673362808 676183014 679329529 678421326
3826.6F78421326n127564J187515K630692L595123J553116r472732L545913P328415
$$ 678421326 673293762 674481277 677111969 680707092 682260208 672787476 676333389 683661804
3834.3F83661804p366714Q70132Q547516r481964k196503Q214951p004471Q59756Q107377
$$ 683661804 676295090 677165222 685712738 676230774 674034271 682249222 675244751 676104507 684211884
3843F84211884l318177m184646K666092J509094J002197J890869p27997K646790N779953
$$ 684211884 680893707 676709061 679375153 680884247 681886444 683777313 683049316 685696106 691476059
3851.7F91476059m911194r79309j9898071N358734J2475204j687622k373886L007050
$$ 691476059 686564865 685585556 665687485 671046219 683521423 681833801 679459915 682466965
3859.4F82466965L882522K412720o937637J384506O889725q216935m676132N417023
$$ 682466965 686349487 688762207 681824570 683209076 690098801 681881866 677205734 682622757
3867.1F82622757O944504P403564r619980j0290069M643631O923065J619034j2712937
$$ 682622757 689567261 696970825 687350845 677060776 681704407 688627472 690246506 677533569
3874.8F77533569K518921N497208N85861L358307M699783q619079o353836P863769
$$ 677533569 680052490 685549698 686135559 689493866 694193649 685574570 679220734 687084503
3882.6F87084503J815949K288055L387375j5194397K299576N172653K668152N776596
$$ 687084503 688900452 691188507 694575882 679381485 681681061 686853714 689521866 695298462
3890.3F95298462k314530j0262832K421570L306808j229400K537155J589431J946106
$$ 695298462 692983932 682721100 685142670 688449478 687220078 689757233 691346664 693292770
3898F93292770L66898r717102O559143J107407o513520N724945l105697k200699J401596
$$ 693292770 693659668 683942566 690501709 691609116 685095596 690820541 687714844 685514145 686915741
3906.7F86915741K207794K100372j153488J21994l62014M043O94122K0600J671371
$$ 686915741 689123535 691223907 690070419 690192413 689830399 689834442 690528564 690549164 692220535
3915.3F92220535J606827m507751l035508M975281k98309l050003L356476J293640
$$ 692220535 693827362 689319611 686284103 691259384 690961075 687911072 691267548 692561188
3923.1F92561188N37185k683792l183136K596970K296448J179504j417007M79354K595215
$$ 692561188 693098373 690414581 687231445 689828415 692124863 693304367 691887360 692366714 694961929
3931.7F94961929l336486j322327J395187m13360N57479J174775p09992j040878P40738
$$ 694961929 691625443 690303116 691698303 691284943 691842422 693017197 692307205 691266327 692007065
3940.4F92007065K653351P76825n025406k74735K348404J492539J250076k293701J248398
$$ 692007065 694660416 695437241 690411835 690137100 692485504 693978043 695228119 692934418 694182816
3949.1F94182816k5254l123550J885605O48651p46384r1705N54123M41971r94873l34626
$$ 694182816 694157562 691034012 692919617 693568268 692821884 692730179 693284302 693726273 692731400 692396774
3958.7F92396774k15301J518326J021881j155396M69361N64193j47247N798N2491l70408
$$ 692396774 692181473 693699799 694721680 693566284 694035645 694599838 694452591 694458389 694510880 694140472
3968.4F94140472j354217o5079J596375k84043k67105J085282m2191N6610m43420m5929
$$ 694140472 692786255 692721176 694317551 694033508 693766403 694851685 694809494 694866104 694422684 694376755
3978F94376755O21643k74811O0883K26440l85818n71061K82441R0332M87747P57217
$$ 694376755 694998398 694723587 694784470 695010910 694625092 694054031 694336472 694426804 694914551 695671768
3987.7F95671768j86157M06723k36588j7471M57688J87683K2812q72422L23715N39704
$$ 695671768 695485611 695892334 695655746 695638275 696095963 696283646 696306458 695434036 695757751 696297455
3997.3F96297455M42200L78646n98983
$$ 696297455 696739655 697118301 696519318
4000.2F96519318
$$ 696519318
##END=$$ End of the data block
