##TITLE=$$ Begin of the data block
##JCAMP-DX=5.00 $$ ACD/SpecManager v 10.08
##SPECTROMETER/DATA SYSTEM=Varian
##DATE=20 Nov 2012 14:22:44
##DATA TYPE=INFRARED SPECTRUM
##DATA CLASS=XYDATA
##ORIGIN=
##OWNER=
##NPOINTS=3735
##FIRSTX=399.26403809
##LASTX=4000.35498047
##MAXX=4000.35498047
##MINX=399.26403809
##MAXY=78.93711090
##MINY=27.19739342
##XFACTOR=1.0000000000
##YFACTOR=0.000000100000000
##FIRSTY=52.82514572
##DELTAX=0.96440572
##XUNITS=1/CM
##YUNITS=TRANSMITTANCE
##XYDATA=(X++(Y..Y))
399.3 528251457 521263275 519949036 516731949 521446648 522436409 522846909 523492546 520647736 523123283
407.9 523123283 523206291 517691536 513120651 507721748 506226044 515060997 522938042 527925911 531675453
416.6 531675453 526840973 509386520 513113937 529552612 528279839 526463928 522721672 511201401
424.3 511201401 507019043 508855934 508285294 506857719 508429031 517638168 526341324 525448341 520417099
433 520417099 514591560 507880783 503806305 499366188 496348724 496937141 499090347 502382851 503677025
441.7 503677025 509625473 518104858 524315491 528931313 531796417 532738075 528010101 520446129 514642296
450.4 514642296 513312874 514403877 518202782 526315231 533209343 541003456 540564537 535721245 538739166
459.1 538739166 533704529 527712555 523162918 516835747 513257561 511543617 511077728 513586464 521481361
467.7 521481361 524687424 522938652 523330727 528762550 524305840 507178040 501848106 495412445
475.5 495412445 492500572 494192390 493209724 493474503 497471008 505351295 508013535 510704193 515187035
484.1 515187035 513530998 509405937 504820099 501781960 499335899 499570427 497202606 494914284 497581406
492.8 497581406 498668480 499602585 501988106 506629677 506020889 502762718 502234879 497114334 489826355
501.5 489826355 483826141 482305222 480493546 480149345 484635048 490613136 493107910 493585052 493982124
510.2 493982124 492177811 486307755 479224854 475545464 470290604 463933487 463679428 464907036 465439835
518.9 465439835 464753799 466284943 469152489 469609299 468576012 466280289 462665138 456231384 453018723
527.5 453018723 449947624 447213364 448030472 451459618 459218559 464840431 469310188 474238968 476849136
536.2 476849136 477585983 477950935 478647690 477596664 475481262 472659988 472996521 477188873 480252876
544.9 480252876 484850578 490435448 494401436 496361389 495715446 492831612 488904915 485502090 480057449
553.6 480057449 474792824 472884445 472154617 472794647 474609070 476107407 478833275 480543213 478349571
562.3 478349571 474524956 470254097 466342964 460157967 451627197 446658440 442994461 442310791 443182144
570.9 443182144 443786926 444463768 445975571 447945328 448116035 449658318 448798828 445427780 443893051
579.6 443893051 445273933 447397385 449127579 454455528 460340385 465817719 472896500 479542427
587.3 479542427 482248383 484253006 486127586 484491768 481375732 477509117 475343781 475126610 475410843
596 475410843 478250313 481914062 485363159 488488655 490741081 491615143 491709366 489859772 484148560
604.7 484148560 478652496 476115417 474671593 473509979 474741211 477852859 481763725 487493591
612.4 487493591 492803192 496094017 496653023 496131973 494579430 491055069 488438530 487881775 488960915
621.1 488960915 490018349 491701050 495571976 502039261 509116096 513972664 517472000 518691444
628.8 518691444 517110023 514278374 511248055 507637215 504182281 502825050 504787979 508850288
636.5 508850288 513153992 519131470 525301933 529437485 530256691 529661751 527967529 523539658 519204521
645.2 519204521 515196075 511634560 510686302 512934456 518032684 522699165 527563438 532124596 535561523
653.9 535561523 537592621 536967697 533447037 528272171 524183998 520734596 517893562 518097725 521390228
662.5 521390228 526983833 532042847 537359734 541542664 540285072 530100784 534243546 535664215
670.3 535664215 532367439 528352394 526541405 526696358 527599564 530935783 535974312 541339912 548419342
678.9 548419342 553362961 553566666 551866302 548973846 545640526 541948814 537552299 534488373 533911324
687.6 533911324 536051674 540144310 544775810 549890175 554538078 557181473 556460991 553242798 548657036
696.3 548657036 542907524 537439957 533063431 529858322 528353157 528602295 530707512 534291191 538334122
705 538334122 541203728 541966133 541082954 538797722 535428085 531804962 528302727 525795670 525276604
713.7 525276604 527103882 531096191 536742706 544041862 551305275 556751671 561248627 563128090
721.4 563128090 563074951 562083092 560005379 557839661 556456184 557574539 561654778 567961464 575284843
730.1 575284843 582400322 588167229 592296486 594709587 594653015 592228241 587070465 582242355 578829803
738.7 578829803 577463722 578648567 581136360 586011276 591944084 598020439 601859894 602479858 600993690
747.4 600993690 595761452 588503227 580917015 574527664 569093094 565571213 565299721 565508308 567252693
756.1 567252693 570622559 572692108 574319153 574847488 571328011 565722198 559987717 553623466 548838043
764.8 548838043 546210175 545502930 547612572 551948776 558206673 565904732 573635178 579373627 583346634
773.5 583346634 585415688 585456543 584275589 582438393 581764641 582972260 586899757 592045937 598843193
782.1 598843193 608860245 618385277 625452423 630532799 633634567 632553978 629002724 624421120
789.9 624421120 620063934 617590942 616119919 617568626 622713242 630795670 639029236 645892639
797.6 645892639 652345276 657142792 658621750 655774078 652057877 647154312 642716446 640292206
805.3 640292206 638800812 640134506 644464722 652125626 659858704 666455612 670900421 671306763 668804550
814 668804550 663341522 657396393 650652008 644791489 640717850 639398117 642921143 648748856 655594940
822.6 655594940 661018066 664477005 665722198 663962402 659135361 651599045 643695526 635532074
830.4 635532074 628357201 623816910 622314110 622747078 625280647 629400444 632526932 634430847 633213959
839 633213959 629436340 624306831 617450905 609849281 603163757 597707443 593708801 593519478 595630531
847.7 595630531 598779526 602434349 604728050 606596642 606035347 601860886 595899124 589292488 582116890
856.4 582116890 575616531 570401764 567205887 567815857 571294861 577476654 584776573 591155128 597734222
865.1 597734222 602417831 605287743 607407722 608824692 608712578 608418388 611251106 616430626 623242455
873.8 623242455 631059647 639928055 648734360 655467682 658295593 657677917 654777527 648311920 641187057
882.4 641187057 633811302 627446251 623493004 621874733 622050705 622182579 623973885 625631180 625660553
891.1 625660553 623483047 617986526 611521301 604070358 596197319 590003815 585994797 583076935
898.8 583076935 581175232 581470375 583258705 585279312 585561638 584136734 581274300 575742187 568846512
907.5 568846512 561153145 553354416 546627388 540765228 536991272 533960114 531528587 530486336
915.2 530486336 528733597 526261940 523158302 518988953 514122658 508793488 502871666 498106918
922.9 498106918 495310860 493533554 493821678 495511742 498320236 501514549 504268990 506831512 509088707
931.6 509088707 509826164 508715782 506884995 504299202 502887878 502948875 503748169 505971413 509435234
940.3 509435234 514327736 519841385 525510292 528877831 529709167 528660622 524444237 518531837 511320686
949 511320686 504032059 498034325 493356895 489546318 484854088 480490646 475867271 470600052 464530334
957.7 464530334 457561226 449037895 438110695 428048935 418463402 409829979 402007980 394574089
965.4 394574089 387956810 381186981 375092583 368641090 362349205 355372124 347695160 338617897
973.1 338617897 329526711 321596184 313010559 306575222 300458031 295676289 291371613 287248974
980.8 287248974 284767761 282567101 281926899 280117187 278745174 276870956 275135670 274226665 272910194
989.5 272910194 272643185 271973934 273113747 273253021 274027920 276146641 277791805 279848366 280939045
998.2 280939045 282938004 282875671 282647686 282245178 281607990 282127018 281333447 281500130 281961918 283603268
1007.8 283603268 283932056 284830036 286587734 286561146 287582722 286974678 286191921 284546165 283733196
1016.5 283733196 283578930 283291931 284614353 284510384 286081295 287736225 290388775 293327007 295589485
1025.2 295589485 297704773 298443661 300314426 299947586 300158119 299779835 299295216 300993500 302457981
1033.8 302457981 305618305 307431030 309696999 311138287 312546120 313534241 312503738 312101288 309732723
1042.5 309732723 308862972 307698975 306817894 306847324 307729435 310250797 311070900 313826866 315524921
1051.2 315524921 317393837 319506760 321600990 324142189 324487381 325745087 326067085 328190346 330856934
1059.9 330856934 334725533 340343323 345235672 351507339 356404991 361526413 364439774 366123924
1067.6 366123924 366640129 363782082 359976311 354594383 350360947 345453796 342010117 339975739
1075.3 339975739 338383369 338267899 337408333 338015366 337019386 336958733 336608200 336120758 336916885 336578674
1085 336578674 337957344 339187241 342694817 345970306 349088058 352946205 356261139 360177650 361697693
1093.6 361697693 363307800 363274117 363198204 364177055 364723969 365800323 366255341 367948112 369179230
1102.3 369179230 371219330 373275261 375374985 376416664 375649338 376020393 374389763 373935890 374166336
1111 374166336 374616928 375952950 377440872 380791473 384007912 388450050 391622963 393939857 395663795
1119.7 395663795 396515808 396765099 394749718 393474426 392022400 392579803 394165001 395868950 398657494
1128.4 398657494 401127281 405334778 408418236 411236496 413700409 414989510 415208817 413712730
1136.1 413712730 412019119 409621162 407447319 404988785 404456062 404717293 403107986 399186287 395542068
1144.8 395542068 397013741 395470886 390153046 384817352 380512543 378020439 374903412 373125877
1152.5 373125877 371048813 370850754 370823708 371248131 373212395 373745155 375353355 375376549 374944496
1161.1 374944496 373622856 372582741 372531319 372431946 374916801 377538834 381612663 385809708 391467018
1169.8 391467018 397966614 403648148 409770393 414569626 418995552 421818771 425396996 429239120
1177.5 429239120 432916107 437856674 443352623 450719032 458265305 466577988 474292068 481120262
1185.3 481120262 487138176 491503906 494743004 495976944 496622162 497188873 498286972 499861794 502181549
1193.9 502181549 505824280 509726906 514381714 518169441 520640602 521904869 522205963 521373367 518576584
1202.6 518576584 515768585 514067421 514020576 515037918 517000313 520201645 524355545 529626999 534790955
1211.3 534790955 539035683 541229134 542256546 542464371 541296425 539928207 538879929 538928833 540298767
1220 540298767 543116837 547201958 551929779 556629333 559928360 561288490 560883827 558610039 554748764
1228.6 554748764 550344658 546619568 543536911 541641541 541512413 542895393 545142021 547650108
1236.4 547650108 549992714 551563873 551974335 550875206 548572769 545621109 542114029 539015388
1244.1 539015388 536927414 536059914 536849365 539681435 543654556 547966881 552048683 555089149 556596107
1252.8 556596107 556681633 555275574 552720604 550084534 548280373 546865692 546589890 548189240 550767288
1261.4 550767288 554182167 558202438 561594162 564089394 565490150 565014648 563273811 561872215
1269.2 561872215 559967537 558083572 556895142 557184639 559532356 562682838 566158218 569472733
1276.9 569472733 572526054 574404831 574326668 572669449 569583511 566021309 562447433 560097733 558668442
1285.5 558668442 558362770 559538765 561712990 564921799 567629738 569693909 570408707 569423981 567144203
1294.2 567144203 563658333 559952698 555502396 551832466 550145340 549876213 550848007 552547569 554776001
1302.9 554776001 556478424 557342987 557150269 555692444 552898331 548713188 544636002 541448669 539320717
1311.6 539320717 538253784 538008041 539104919 540810509 542705727 544984245 546471825 546149254 544500198
1320.3 544500198 542186546 539021492 535153694 531342049 528342667 526282463 525029640 524804535
1328 524804535 525129509 525662613 525712433 525050888 523354073 520224991 516687202 513043060 509401169
1336.7 509401169 506296234 504189568 503121948 502851677 504689484 507260590 510112991 512227783
1344.4 512227783 513590240 513914566 512969322 511276474 508787994 506481209 504406509 503080101 502780342
1353.1 502780342 503476524 505327301 507292824 509359131 510611305 511151085 511003838 509940910 507727776
1361.7 507727776 504267006 500122833 498452339 498010101 497476196 498455353 500203438 501961250 504378204
1370.4 504378204 506260338 508229446 508491173 506934738 504806252 503229256 502901688 501456528 500799713
1379.1 500799713 501139832 502825813 505636749 508746414 511934586 514467087 517145500 518618736
1386.8 518618736 518645134 518568459 518504333 517853699 517241287 517507172 518095131 519432983 521189308 524226646
1396.4 524226646 526523094 527650909 527706947 526204033 525125732 522659264 520166016 517846794 514295731
1405.1 514295731 512778244 513242722 514290962 515027008 516599045 517896309 518907852 518488731 516913147
1413.8 516913147 515143585 512463379 509883690 507321281 506471405 502439270 502168121 505474205 507733383
1422.5 507733383 510328903 511680069 513218842 514525642 513833275 513049469 511259727 508666916 506659698
1431.2 506659698 507081032 507661629 508583527 511801300 514762268 517265854 518215599 520707359 522335815
1439.8 522335815 522691383 521677399 519333611 518085976 516618958 516796417 517525749 518595581 519830704
1448.5 519830704 521877251 524545822 524975319 525497208 524858742 524194336 522577400 519416122 512735672
1457.2 512735672 506656113 509157219 509216690 511913452 513942642 516725082 520523033 521771355 524789581
1465.9 524789581 526170044 528092384 527983780 528696327 530989799 530733719 532637138 534542465 542630501
1474.6 542630501 548308449 554772186 560631142 565512009 570562172 573255730 575901947 576374741
1482.3 576374741 577860222 578056908 578675957 581550407 583577652 588100319 591352692 597266083 602170258
1491 602170258 606665497 610091820 611289711 612935829 611828117 609083748 609484253 609243050 609378700
1499.6 609378700 612547417 616844330 620424805 625995522 630125046 633717995 632356224 630937729
1507.3 630937729 633144188 630922775 630474052 630153160 629682388 628960228 631948509 635268593 638610153
1516 638610153 644607773 644651718 649271088 652509689 649332962 645052261 642836685 645072479 644599838
1524.7 644599838 642445297 642201080 644992447 648110352 652115555 657323074 660447693 663435593
1532.4 663435593 662398682 659192123 659302673 657834854 657410889 657769318 655016251 642653885 651112442
1541.1 651112442 656240311 658998108 663754120 665622711 666751328 667691193 667566376 666034927 661263657
1549.8 661263657 655824127 655731583 656723862 657146759 655604172 658194885 663659897 667032700 656739120
1558.5 656739120 653563614 656499023 660986862 661813354 660359573 657007141 651087036 649735489
1566.2 649735489 651235657 654146500 656763229 655215988 656879272 659158173 659237823 657988052 656869659
1574.9 656869659 652320023 641808777 642880096 642831573 642217026 642625046 643787308 646011810 648024139
1583.5 648024139 649362411 650152435 649805984 648159180 645544739 642494659 638717728 635775795 633330421
1592.2 633330421 632400665 632775002 633852730 635559425 637007790 638283043 638474731 637605438 635333900
1600.9 635333900 631931229 628270569 623680267 620577431 618547707 617448578 616764793 618230286
1608.6 618230286 619664230 619386215 620195274 619255295 617467232 615061302 613394737 610087013 597777100
1617.3 597777100 598117142 598063240 598013268 597987366 599616966 600807991 598863220 599655190 599907570 599921646
1626.9 599921646 596530380 592675018 590921440 588109627 586053925 584540138 585822754 587624855
1634.6 587624855 586501236 586151543 588957748 590471115 591000481 590970879 589269714 588362885 586377258
1643.3 586377258 585810394 585558510 582248001 582844887 584205093 587926674 591625137 596307678 600696411
1652 600696411 601173286 594181557 596942253 599428711 599630547 599129524 599067917 600240097 602483826
1660.7 602483826 605979118 609940872 611896515 615653114 619018135 621395988 622970619 623784027
1668.4 623784027 621328812 621160393 622490311 622023659 624993210 629376373 632058830 633925056 639256439
1677.1 639256439 644435654 648182526 650973434 651191864 652881165 654372482 649719772 643790665
1684.8 643790665 649835358 655577393 659460602 662483749 666691284 671709747 675993195 679368515
1692.5 679368515 681162949 683235931 682984848 676256638 679171295 681772537 684910660 681310806
1700.2 681310806 677635040 685519714 691575165 696367264 699233627 701860352 701774063 702091293 702378540
1708.9 702378540 700147552 697678833 697408371 698412704 699448624 700034866 701804047 706955948 711951141
1717.6 711951141 709216843 711696854 713976059 714396896 713247833 710605469 707956390 707664185 707896271
1726.3 707896271 708247375 710421982 713511353 715801010 717540665 721464233 724894257 720973206
1734 720973206 716173096 718060303 718929138 717137985 717046127 715011444 713793030 718379288 722052841
1742.7 722052841 724338150 726554184 729955368 731809921 731445084 730466995 728229294 728920670 724938507
1751.3 724938507 723222275 726545715 728717270 732249603 736138153 738293839 740516434 743258514
1759 743258514 745082932 746650543 743364029 740312271 740461197 739157562 738532791 739512939 741260757
1767.7 741260757 741423874 744850464 750374146 753346710 753560638 751539841 752717819 752130356 748945847
1776.4 748945847 748301086 746543503 746142578 746291046 746706314 749291992 752907486 756378860 758161774
1785.1 758161774 759054489 759624252 759163818 757482300 756372681 754080124 751250610 747764435 748087082
1793.8 748087082 752438507 755198364 757253113 760345459 763304367 764346008 763013687 763251266
1801.5 763251266 760911026 758537598 757215729 755599060 755638275 756239090 757491150 759960785 763484650
1810.2 763484650 765313110 767267990 768795776 768332291 767727127 765413971 762943115 760215912 759000626
1818.8 759000626 759007187 759693985 761964951 763976440 767443542 770709229 771045685 770843964 771061630
1827.5 771061630 770657043 767619095 761674805 760883789 761654739 761672211 762973404 765264282 767917633
1836.2 767917633 770701828 772011795 773410187 773720856 773272400 771522903 769831238 767274094 760774689
1844.9 760774689 762076187 763822174 764792480 766378860 769039612 772065811 773989639 775505753
1852.6 775505753 775259247 774113922 772104721 769714890 767674179 765759964 765137024 764949875 766369553
1861.3 766369553 768217316 770714951 773225174 774651413 776188583 776054611 775416641 772308960 768647232
1869.9 768647232 767683182 767040710 766911850 766998672 768495865 770414429 773022690 775459442 777107162
1878.6 777107162 778137436 777480469 776487045 774248581 771957397 769698563 768051758 767941208 768215866
1887.3 768215866 770592575 773160706 774459381 776472168 778730164 779390335 779062958 777469940 774369354
1896 774369354 772816620 771197510 769824142 769286346 769882050 771681442 773776932 776636505 778632812
1904.7 778632812 779948654 780292587 779284821 777693710 775256958 772374268 770492935 769969101 769580154
1913.3 769580154 770777740 772611771 775117645 778517761 779088135 779441223 780378494 779835892 777891388
1922 777891388 774506454 772601471 771921539 771109543 770492172 771726532 773665771 775650253 777891235
1930.7 777891235 779704666 781208878 780879288 780060501 778362427 776012955 773972473 771856995 770940018
1939.4 770940018 770892410 772806091 774410782 775044861 777718582 780197296 781042862 780701447 780079651
1948.1 780079651 778317566 775861969 773708649 772229004 771865311 772090302 773233490 774970932 777273026
1956.7 777273026 779444580 781204529 782202682 781830215 780445023 778439178 776888351 774992294 773543701
1965.4 773543701 772894516 772565231 774131393 776396561 778789368 780606308 781905136 782350998 782128296
1974.1 782128296 781270676 779318924 777506714 775484390 774231491 773620834 773621979 775000992 776679993
1982.8 776679993 778969650 781031265 782413025 782785950 782376785 780911713 778622131 777456436 775915680
1991.5 775915680 773495789 772732468 773933411 775711212 777844925 780198441 781469345 782355194 782419357
2000.1 782419357 781693420 780268250 778385925 776659698 774978104 773770065 773278656 773946381 775077286
2008.8 775077286 776895065 779015961 780570679 781594543 781195831 779976654 778231659 776298218
2016.5 776298218 774053574 772579575 772203751 771875458 772720566 774328842 776209106 777862244 778994446
2025.2 778994446 779521561 778748932 777542419 775865479 774139252 772201767 770620270 769915924 769873962
2033.9 769873962 770873795 772228165 774032898 775540237 776396790 776691208 776423492 775147018 772931976
2042.6 772931976 771127014 769147568 768126831 767717285 767861786 769093552 770381241 772360077 774058075
2051.2 774058075 775141907 775384827 774833832 773747940 771943970 770415344 768715973 767705154 767277908
2059.9 767277908 767543259 768852310 770654449 772942429 774311218 775028915 775102158 774461517 773295746
2068.6 773295746 771551666 769885406 768370743 767396545 767002411 767777863 769355545 771244354 772914963
2077.3 772914963 774235840 775668716 775576324 774702988 773403473 771755753 770258255 768562469 767781448
2086 767781448 768035736 769101944 770503387 772101898 773585205 775087967 776174088 775856934 775186996
2094.6 775186996 773706436 772126694 770472946 768784409 768232117 768431473 769470444 770676498 772365875
2103.3 772365875 774150848 775493393 776194839 775943604 775494919 773891068 771855392 770156326 769095230
2112 769095230 768807449 769027100 770225296 771733093 773620682 775305252 775971451 775938644 775894012 775358887
2121.6 775358887 773751602 771919098 770176239 769524155 769274750 769336090 770228424 771567841 773411407
2130.3 773411407 774988937 776388626 776784210 776402130 775279922 773449554 772193146 770812607 769582291
2139 769582291 768903580 769537888 770749893 772175751 774247971 775691452 776743698 776777267 776017227
2147.7 776017227 774455872 772610550 771528702 770392227 769620285 769264374 769758072 770947723 772773361
2156.4 772773361 774532318 775678787 776951752 777195816 776624146 775036926 773343964 772333984 771286469
2165 771286469 770675507 770638123 771528702 772596970 774443054 776533203 777794724 778711395 778779984 778350983
2174.7 778350983 777096024 776001129 774781647 773230362 772714539 772945404 774076614 775528870 777214737
2183.4 777214737 778551941 779493408 780512848 781261826 781242676 779696884 778077087 776629791 775605698
2192 775605698 775149689 775502625 776877670 778078079 779768143 781240234 782311096 782884140 782664337
2200.7 782664337 781958008 780669708 779738846 778365326 777381668 777070465 777372589 778934174 780507660
2209.4 780507660 782038040 783319244 784478149 785153961 785038605 784027328 782552643 781496811 780274582
2218.1 780274582 779476166 779145660 779724808 780777893 782205124 784304733 785521774 786330643 786344604
2226.8 786344604 785748978 784838257 783631058 782813721 781711273 780721588 780482178 781322861 782537994
2235.4 782537994 784235077 786007309 786789169 787051849 786941223 786842804 785613556 783887253 782711334
2244.1 782711334 781540298 780831299 781246796 782546616 783466492 784923859 786418076 787344589 787968445
2252.8 787968445 787798920 787369308 786156006 784893188 783598633 782733765 782220306 781928711 783044891
2261.5 783044891 784521790 786306381 787215271 787741852 788407288 788188171 787841492 786752243 785326843
2270.2 785326843 783817978 783096695 782834702 782867050 783880539 785272980 786982727 787857437 788851166
2278.8 788851166 789371109 789095535 788702927 787418976 786102676 784309387 783474045 783087158 783345947
2287.5 783345947 784626923 785497589 787142258 788363190 788903656 788637924 788170090 787625504 786253510
2296.2 786253510 785133133 783377304 782512894 782060318 782462845 783718796 784387207 785480652 786231384
2304.9 786231384 787193375 786691208 785577316 784960327 783411484 781982269 780198593 779383163 778700409
2313.5 778700409 779084549 780052872 780849304 782595596 782996826 783102798 782475586 781762924 780172729
2322.2 780172729 777563171 776135559 774531326 774489059 774426270 774900818 775281754 775821991 777618790
2330.9 777618790 778124847 778899460 778751373 778157959 775742874 772866287 772179565 771148834 770574722
2339.6 770574722 770281372 771255875 771673431 773177948 775242767 775797043 776982193 778105927 779739761
2348.3 779739761 779551773 777061615 774302826 772653427 771615906 769556274 768071823 767276840 768444519
2356.9 768444519 770860367 771316910 769564285 768052826 768507309 767870102 767231674 766662521 766809921
2365.6 766809921 767438889 767467194 768539810 770807114 773207474 774551392 776126175 776879730 776877975
2374.3 776877975 776885147 776701965 775922470 774901733 775438232 776092300 777020035 778403549 780088730
2383 780088730 781953201 782743378 783321228 783311234 783194733 782425308 780778656 779727325 778438339 777799988
2392.6 777799988 777875443 778201141 778967590 780308685 781616821 781941681 782379837 782277679 781500549
2401.3 781500549 780272522 778822403 777935181 776998520 776244278 776170654 776972046 777666702 778312912
2410 778312912 779247131 779677124 779846954 779484634 778674011 777638626 776367340 775170822 774631348
2418.7 774631348 774197845 773730164 774078217 774660263 775741959 776642303 777058411 777156372 776151657
2427.3 776151657 774843369 773348007 771903152 771041031 770531845 769960480 770178833 771146622 771472549
2436 771472549 772053375 772902069 773423996 773211746 772478790 771589584 770059967 768576431 767288818
2444.7 767288818 766363220 765845566 766088638 767072754 768166275 769200974 769540634 769523621 769090271
2453.4 769090271 768559723 767594452 766085129 764780045 763500137 763050385 762916565 763287048 764077530
2462.1 764077530 764815292 765740204 766011887 766193619 765863113 765017929 763755646 762327652 761373367
2470.7 761373367 760063171 759432755 759686203 760197983 760764999 761430588 762194672 762678528 763097534
2479.4 763097534 762741318 761795120 760544128 759221497 758004608 756740036 756021347 756026077 756821823
2488.1 756821823 757757187 758677521 759390411 760054016 760390244 759462280 758469772 757596130 756665344 755433578
2497.7 755433578 754328690 754190826 754465561 755026855 755461273 756391449 757513580 757779617 757448578
2506.4 757448578 756916046 756565857 755650558 754083862 752766418 752222214 752044983 752312393 753068314
2515.1 753068314 753826447 754583511 754972916 755512390 755594101 755114212 754348068 752827682 751599426
2523.8 751599426 750493011 749576492 749252014 749753342 750424118 750760651 751801758 752654648 752822647
2532.5 752822647 752292175 751430359 750608749 749450455 748318024 747257462 746352005 745641022 745867386
2541.1 745867386 746963730 748027039 748370743 748227081 748427200 748344040 748040466 746814499 745465164
2549.8 745465164 744744873 743395920 742474213 742150421 742509689 743400650 744042892 744297943 744357452 744524231
2559.5 744524231 744188919 743792572 742879333 741483612 740069351 738741226 738374939 738312073 738714066
2568.1 738714066 739470825 740008316 740280380 740580597 741049500 740627594 739545593 738184509 737034607
2576.8 737034607 736107635 735298920 734954758 734712830 735137405 735913620 736476517 737008896 737313538 737062073
2586.5 737062073 736470795 735819397 734859238 733833313 732634659 731756363 731368484 731238251 731685028
2595.1 731685028 732296295 733048859 733651352 733861160 733889236 733780518 733207321 732051468 730631714
2603.8 730631714 729287262 728714294 728645096 729003296 729699936 730324631 730506134 730295334 730497360 730417023
2613.5 730417023 729949112 729121704 727669296 726053162 725111313 724912262 724350739 724466400 724910278
2622.1 724910278 725138626 725830078 726012421 725707855 724905624 723814163 722744522 721516037 720098724
2630.8 720098724 719010239 718418121 717980347 718212814 718419647 718630371 718820953 718816528 718798370 718027420
2640.5 718027420 717101517 715659027 714118576 713155670 712267685 711574020 711213379 711493607 711701050
2649.1 711701050 712074661 712432251 712076645 711296997 710292740 709424515 708270493 707354202 706577454
2657.8 706577454 705680161 705179825 704872360 704786301 704953003 705339355 705205154 705087433 705065842 704367752
2667.5 704367752 703381195 702140884 701107407 700406113 700029373 699346237 698754272 699037552 699390411
2676.1 699390411 699801636 699918365 699848480 699444504 698701553 697895966 696734238 695455627 694214859
2684.8 694214859 693903961 693802032 693574219 693912735 694374695 694653854 694596481 694558868 694008484 693277512
2694.5 693277512 692280731 690901489 689850082 688951950 688848038 688518066 688030319 688117676 688412781
2703.1 688412781 688716888 688286972 687987061 687613449 686979218 686102524 684731979 683710175 682805557
2711.8 682805557 681922760 681360474 681575470 681758118 681739044 682213287 682331924 681933289 681081924 680387573
2721.5 680387573 679659576 678456650 677716904 677326508 676809158 676447754 676268997 676177139 676672058 677090225
2731.1 677090225 676921616 676467438 675956268 675432968 674587555 674032516 673273163 672480545 672138443 671960297
2740.8 671960297 672124710 671977386 672098618 672576904 672869568 672546005 671881638 671382980 670318527
2749.4 670318527 669525452 668650589 667701263 667457047 667687988 668465424 668779068 668844910 668993683 669249878
2759.1 669249878 669187775 668300934 667369461 666226425 665240402 664614182 664206009 664165649 664211578 664439468
2768.7 664439468 664954300 665307541 665374374 665461655 664894562 664126282 663360977 662510986 662058411 661028595
2778.4 661028595 660095596 659864273 660036316 660480270 660401154 660215836 660451279 660387650 659845047 659300995
2788 659300995 657808228 656035004 655070724 654207840 653604279 653228683 653381348 653535080 653374405 653525162
2797.7 653525162 653310699 652404633 651194687 650236359 649053116 647855225 647015762 646033478 645287857
2806.3 645287857 644707108 644293747 643880386 643480606 643100662 642325821 641567230 640906143 639873924 638254318
2816 638254318 636492538 635036964 634252396 633464203 632407036 631796608 631258965 631071815 630681648
2824.7 630681648 629669876 628707047 627609482 626484070 625335045 623947372 622251625 620916862
2832.4 620916862 619859276 618738174 617808380 616945724 616563721 615938530 614743614 613184319 610996323
2841.1 610996323 609002991 607524796 605880394 603822250 602062988 600364342 598590202 597022171
2848.8 597022171 595508881 594429131 593455124 592362709 590903893 589420853 588250198 586749420
2856.5 586749420 585150833 583635750 582441444 581594315 580908356 580178566 579057007 577754135 576665802
2865.2 576665802 575352058 573530579 572018929 569664078 566668167 564524384 562434540 560457077
2872.9 560457077 558484612 556574707 554735260 552972870 551678505 549978905 548020935 546019440
2880.6 546019440 544072380 542370033 540723763 539293938 537931175 536657219 535610657 535310516
2888.3 535310516 535490875 535612183 535520821 534938164 534598503 534350700 533834190 533484344 533142319 532554283
2897.9 532554283 532073402 531882744 531698227 531626244 531333160 530654488 530208626 530039024 529302101 528281136
2907.6 528281136 527649689 526701546 525536079 524310989 522971382 521526680 520201073 519342957 518208694
2916.3 518208694 517012329 515863762 514417343 512581253 510671883 509312592 507784233 506313400
2924 506313400 505348129 504515038 503950386 503793945 503801003 504145546 504887238 505140266 505648842 506684875
2933.6 506684875 507630806 508659668 509565353 510673599 512330017 514227524 515654449 517375107 519774323
2942.3 519774323 522430191 525492058 528053551 530380898 532530022 534262962 535977974 538075523
2950 538075523 540422020 542056122 543987617 546341743 548584824 550892830 553476562 556273041 558502655
2958.7 558502655 561009407 563581924 565759850 567574081 569130898 571256485 572977219 574092941
2966.4 574092941 575692139 578012619 580198669 581867142 583657761 585703087 587670670 589118462
2974.1 589118462 590289841 591382484 592613373 593759003 594455185 595573387 597409897 599214668
2981.8 599214668 600630112 602114296 603444214 604376488 605295601 606171722 606869507 607627525 608340149
2990.5 608340149 608489914 608908463 609575462 610313416 611520920 612102699 612421799 612900848 613053970
2999.2 613053970 613350983 613682022 613326569 612793198 612567101 612124825 611695251 611506653 611535759 611609154
3008.8 611609154 611606827 611539879 611626396 611629028 610737190 610163612 609701271 608556213 607505531 606592255
3018.5 606592255 605635262 604728546 604649773 604224434 603250008 602805443 602325516 602027550 601154861 599626694
3028.1 599626694 598173943 597173729 596265297 594700356 593556900 592851944 592276840 591402779 590623360
3036.8 590623360 590618591 590125504 589104080 587707443 586081123 584853592 583780670 582504845 581108437
3045.5 581108437 579721527 578471260 577523842 576715584 576286507 575798798 574926147 573973083 572699585
3054.2 572699585 571185150 569335632 567441788 566083450 565227203 564385147 563422203 562332153 561410408
3062.9 561410408 561012726 560160255 559149780 558024826 556658669 555675430 554168320 552259178 550625725
3071.5 550625725 549458351 548576851 547988014 547447014 546611176 545737648 544355087 542957649 541748695
3080.2 541748695 540861435 539983025 538358040 536737213 535355835 534486961 533526382 532643204 531995316
3088.9 531995316 531025543 530211945 528837585 527529106 526649437 525688324 524290276 522699242 521905022
3097.6 521905022 520546951 519225731 518692131 517703667 516690636 516000595 514814110 513570633 513346825
3106.2 513346825 512502785 510778618 509320717 507849617 506514091 505362091 504288559 503214607
3114 503214607 502795830 502459755 501545029 500624008 499436874 498214684 497105179 496306000 495456238
3122.6 495456238 494107056 492484131 491198311 490759850 490166473 489464378 488392830 486871300 486145096
3131.3 486145096 485927238 485076866 483687172 482793655 481634293 480137405 479205246 478270874 476899147
3140 476899147 475845566 475653076 475271111 474388161 473291855 472401619 471877518 471044540 469904938
3148.7 469904938 468929901 467947273 466175957 464906235 464470940 463835678 462872467 461758766 461458664
3157.4 461458664 460929985 460336990 459826927 458608284 457779007 456876106 456055870 455373573 454650688
3166 454650688 454014549 453048210 452146225 451383629 451116066 450601845 449497375 448668671 448123627 447416267
3175.7 447416267 446569824 445718651 444412880 443577690 442907486 442102737 441572380 440794907 440399590
3184.4 440399590 439865608 438843002 438038139 437596245 436896896 435799675 434976082 434398880 434262581
3193 434262581 433765717 432872963 431882820 431131172 431253471 431058044 430521011 429676476 428848648 428389397
3202.7 428389397 427816353 426815796 425538521 425279655 425054512 424577980 424307938 423616333 422952881
3211.4 422952881 422276192 421921730 421527901 420955620 420558929 419886093 419317703 418612671 417329979
3220 417329979 416447411 416070366 415859032 416369095 416077347 415168114 414922981 414160385 413458977 412836685
3229.7 412836685 412345619 412004662 411276550 410888824 410545692 410271149 409869499 409464340 409125214 408490067
3239.3 408490067 408045578 407544785 406832466 406554680 406901245 406235313 405122604 404880295 404691963
3248 404691963 404781837 404449005 403567085 403016624 402915955 402734184 402260323 401846390 401221886 400905228
3257.7 400905228 400755196 400636292 400075302 398868942 398369141 398415375 398290863 397471199 397413483 398335838
3267.3 398335838 398160095 397450066 396904182 396104469 395249062 395069389 394726868 394075623 394000092 393900642
3276.9 393900642 394046249 394130020 393886299 393448257 392883987 392713814 392355766 391843185 391402130 390881958
3286.6 390881958 390440483 390197182 390188828 390222778 390202827 390153694 390247612 389957161 389077568 388432503 388043900
3297.2 388043900 387379951 386881638 386759186 386582069 386364288 386179962 386385460 386419258 385931091 385469360
3306.8 385469360 385009346 384633751 384054565 383617859 383461227 383113823 382610016 382476921 382870979 382452049
3316.5 382452049 381791077 381931534 381786461 380931931 380464554 380329018 379413681 378793030 378823509 378849564
3326.1 378849564 378451347 377828979 377586021 376861038 376285172 376081390 375983276 375874710 375340042 375380020
3335.8 375380020 375173607 374740067 374572678 373934593 373489876 372834091 372072754 372160530 372175217 371611977
3345.4 371611977 371150627 370586128 369896011 369572792 369299889 368962212 368885307 368979759 368589554 367905846
3355.1 367905846 367519455 367189941 366550140 365992966 365893097 365622330 365027885 363883095 363360710 363899689
3364.7 363899689 363454590 363235130 363372383 362409744 361580696 361190567 360969772 360779228 360532188 360340767
3374.3 360340767 360124931 360092964 360113640 359609642 358612747 358037415 358037376 358097610 358024826 357701683 357496758
3384.9 357496758 357619972 357600746 357045250 356053200 355529785 355492973 355332069 355344009 355122910 354704018
3394.6 354704018 354300232 353919182 354102898 354006691 353483925 353245125 353446693 353731422 353731575 353648453
3404.2 353648453 353195839 352864227 352699089 352308884 352442055 352864647 352640953 352207260 352360420 352463760
3413.9 352463760 352225723 352037888 352164650 352407494 352488747 352444992 352268333 352331619 351933823 351727142
3423.5 351727142 351968689 351926003 352336960 352597046 352650871 352407303 352347374 352649117 352171516 351962624
3433.2 351962624 352090874 352157631 351941109 352006760 352663383 352922134 353129463 353496208 353980980 353797569
3442.8 353797569 353736992 354223709 354990730 355670891 354088974 353266106 353916626 354655457 355321083 355312767
3452.5 355312767 355754700 356246834 356734314 357234573 357632332 357854958 357665596 357866020 358027878 358432121
3462.1 358432121 358603249 358763695 359329414 359584274 360027466 360626068 361576233 362074585 362007904 361866570
3471.7 361866570 362090034 362919960 363019600 363498573 364180832 364097023 364327965 364537163 364304581 364884300
3481.4 364884300 365976944 365984993 366447945 367274170 367618141 367959366 368086014 368645821 369353333 369727554
3491 369727554 370039177 370591049 370924339 371252289 371894608 371957054 372313766 373019218 373501396 374089546
3500.7 374089546 374724007 374881096 374962463 375382271 375842667 376799698 377648010 378591537 378368454 377866058
3510.3 377866058 379259415 379721718 380147667 380690956 380775986 381416245 382312126 383302650 383623085 384073677
3520 384073677 384716415 386009750 386614571 385595741 386298943 387484665 388668213 389148102 388950882
3528.6 388950882 389198341 389809265 390724792 391561852 392724304 392937965 393558960 394066124 393669739
3537.3 393669739 395054169 396422348 397047729 397256126 397988510 398794327 399784698 400545692 399914360
3546 399914360 400397797 400277977 401655426 403230133 404614601 406853943 406086540 406189728 406655998
3554.7 406655998 408023338 409882202 410153198 411877441 413043060 413132744 413234138 415511398 416775169
3563.4 416775169 417577209 422807083 422550278 419644623 418273163 417603378 422158699 424606209 425873947
3572 425873947 427809143 429553299 430470810 431344719 432793503 433437309 435653992 436503296 436559334
3580.7 436559334 437997932 439238777 440626640 443027954 448574753 450689125 447783890 447579651
3588.4 447579651 447111359 450646248 453648987 455787773 455892525 456674461 460842247 459905472 462265205
3597.1 462265205 465704689 465333214 467603569 468839035 469350471 471178551 473439217 475861053 480052872
3605.8 480052872 483826485 482294998 484722061 482199364 482056389 490974274 492044640 490077553
3613.5 490077553 493204117 492557640 497975769 503219833 503076820 502839851 500170898 501849365 505795059
3622.2 505795059 508281059 510443993 513426208 516337395 519669342 526986694 525097351 511716423
3629.9 511716423 516951256 523200226 529098320 529942741 527836037 530165138 533829613 536251030
3637.6 536251030 535920258 537969818 541152725 543423004 544675064 545346870 547827606 551630592 557486534
3646.3 557486534 555895958 552829666 557890053 554736862 551569176 553557701 560825920 565635147
3654 565635147 569395523 573726006 565258865 567352028 571889191 572334137 573895454 575168610 577555199
3662.7 577555199 578684502 580787201 582897072 584320412 589688911 593007355 592105217 589439697
3670.4 589439697 583251114 587535439 597112961 607218399 603171692 582426682 588052902 597337914
3678.1 597337914 601572113 598224869 599655762 603517036 605742989 607354355 608008614 609117126
3685.8 609117126 613160133 617816391 606470146 605607681 614181061 607594147 609710350 615615005
3693.5 615615005 616169319 618259392 619477577 619631996 620432625 621196060 624502831 626987267 620291710
3702.2 620291710 619016495 624478073 625925102 627047920 628313179 631539574 635344887 627560081
3709.9 627560081 633405304 636786461 621413269 627753906 632376251 632394371 634102783 637934189
3717.7 637934189 639459801 634608498 636023750 642665253 638036995 633627625 639629555 640706711
3725.4 640706711 640307159 637554550 638033600 642369995 644544296 651030579 646492996 639968681 649722595
3734 649722595 646610870 635698700 638466034 643129349 644767685 647639847 650305862 646993561
3741.8 646993561 652224808 663700256 645917435 632653961 646433182 653987808 660088196 653900757
3749.5 653900757 644193039 656248398 647457199 641942368 649696732 655722961 659226379 653366776
3757.2 653366776 657375488 663166504 653392639 652648239 657416382 658621902 659369431 662304459 658006287
3765.9 658006287 655033798 660178070 665373077 663749084 653497086 657637558 661962662 662405167
3773.6 662405167 663935242 663734360 664453506 665309067 668489532 667256088 658749542 662092743 664680099
3782.3 664680099 666390152 668998108 665436401 664240112 665713425 667111435 668174133 667892380
3790 667892380 668388290 668690109 668889542 668752441 670742569 674027252 669110641 665550308 669420395
3798.7 669420395 675349121 681104507 672122955 662659454 666521149 669978256 676190491 681983032
3806.4 681983032 669575958 665743561 672094955 674010391 674369888 675562363 675926437 677782669
3814.1 677782669 684282227 682133255 666716766 673155289 680213928 684804077 682647095 660223083
3821.8 660223083 666338501 674503479 677419662 680409393 680074310 676150589 677401352 679760208
3829.5 679760208 682806625 682694550 673125687 677697525 685964661 679076996 678909073 687311783 677123642
3838.2 677123642 674773636 683226471 675836792 677152939 685212936 682108307 678180084 680565033
3845.9 680565033 681794739 682615891 685235825 685446014 688669281 694736557 688218613 687324219 669896011
3854.6 669896011 673517990 684330292 682436218 680898819 684020615 687431946 690004501 684424210
3862.3 684424210 685893860 692277832 682997742 678546295 684439468 690724182 697705765 688541031
3870 688541031 677712021 681986847 689454803 692115631 680622025 683118515 687414627 687431488 690713272
3878.7 690713272 696164017 689137573 680979385 688487625 690426102 691938400 694626999 680581284
3886.4 680581284 684340134 689267883 690935745 695941467 693282623 683341522 686508942 690356216
3894.1 690356216 688689346 690292740 691381607 694503632 695558167 685220490 691740875 692000122
3901.8 692000122 686327286 692063675 688296127 686878281 687855072 689857712 692503281 691981506 692406464
3910.5 692406464 692506409 692389755 692215958 691991348 693403854 694505234 689813461 687742081 693817444
3919.2 693817444 693592453 689579620 692490082 694205551 695438614 693574219 689998245 691846008
3926.9 691846008 693545074 694005356 692662659 692667236 694938736 692036514 691036148 693245163 693246155
3935.6 693246155 693496094 693777390 693595047 693747330 693809509 695684814 695972290 691564255 692175140
3944.3 692175140 694073792 695230179 696583786 694033279 694706345 694581070 691809692 694337769 695546417
3953 695546417 694495392 694170609 694890671 695135345 693971786 694391708 694766922 696227875 696759415
3961.6 696759415 694930954 695611115 695888748 695347519 695927353 696060181 695657883 694666138 694246979
3970.3 694246979 695641479 695973434 695405045 696022263 696000443 695719528 695905609 697164917 698267517
3979 698267517 697315674 696712875 696679764 696162186 695675583 695204468 694717102 695352173 696412811 696706009
3988.6 696706009 697298889 697597809 697834167 698340073 698742065 698264999 696527405 696092682 696621475
3997.3 696621475 697264709 697791748 697872620
4000.2 697872620
##END=$$ End of the data block
