##TITLE=$$ Begin of the data block
##JCAMP-DX=5.00 $$ ACD/SpecManager v 10.08
##SPECTROMETER/DATA SYSTEM=Varian
##DATE=20 Nov 2012 14:22:38
##DATA TYPE=INFRARED SPECTRUM
##DATA CLASS=XYDATA
##ORIGIN=
##OWNER=
##NPOINTS=3735
##FIRSTX=399.26403809
##LASTX=4000.35498047
##MAXX=4000.35498047
##MINX=399.26403809
##MAXY=79.04692078
##MINY=27.07216835
##XFACTOR=1.0000000000
##YFACTOR=0.000000100000000
##FIRSTY=50.61592865
##DELTAX=0.96440572
##XUNITS=1/CM
##YUNITS=TRANSMITTANCE
##XYDATA=(X++(Y..Y))
399.3 506159286 513561630 513525047 516391983 520892143 515508575 514712791 514931068 515260620 518700981
407.9 518700981 521754150 521787109 514077835 507096214 507465820 508848763 507590752 514027214 522005196
416.6 522005196 512678909 490546455 509298668 527210922 526480598 524064980 513529091 505567818
424.3 505567818 508304367 508508797 509151382 514812775 515971756 517948875 522955437 523789902 523512192
433 523512192 517763138 508239708 503397293 498759460 496496544 493589478 493334122 501987839 510317917
441.7 510317917 515586281 519017792 522241173 525855408 528911896 529776154 527121925 520776749 514426613
450.4 514426613 514012566 515081558 517204971 524524574 533458138 540763321 540033379 531960907 531156044
459.1 531156044 531074371 526245422 522512093 520418472 516470871 512769089 510749054 511137047 514089165
467.7 514089165 520638657 523355789 521266365 519177971 508102684 504246330 504415970 498701324
475.5 498701324 495772324 493198700 490420570 489003372 494379463 502585564 502555733 500803299 503018990
484.1 503018990 506502724 503539085 500157013 497338753 491247711 489539299 488679543 489264297 492828102
492.8 492828102 496441116 500174065 504316292 506549072 503646698 502015762 499912224 493562279
500.5 493562279 487962952 484985695 482763634 479915352 480492516 482718010 488465538 493655968 493735733
509.2 493735733 490771599 487836494 483597260 476407166 472742653 469638634 465461082 462386398
516.9 462386398 460423355 461159515 461964684 467852211 471788826 471221962 470140495 467442055 464002457
525.6 464002457 457803993 455252151 453304482 450253067 449788742 452087936 457505608 461696243 466406670
534.3 466406670 470376816 472841530 474727821 475759468 476768417 476201248 474645309 473028183 474593887
543 474593887 477729988 479751930 484637260 490737228 494725723 497217827 497579155 493293076 487481766
551.6 487481766 483672638 480341568 476199570 471358566 470051575 471771736 473109474 475008774
559.4 475008774 478196793 479316368 476976128 473862152 469809685 463978691 457052612 451665115
567.1 451665115 447687340 443212280 442320366 441844330 442092018 443224869 445531464 448121758 448415527
575.8 448415527 449119682 448529930 448507347 446713333 444685593 445879250 447670784 452730484 459003258
584.4 459003258 467170448 475203743 480838852 483912468 486458092 487811928 483979111 479845810
592.1 479845810 477320366 475146980 474116859 474343452 476599121 479618568 484058876 487682724 489964180
600.8 489964180 492107391 492264557 489186401 483422661 478200417 474910507 472733231 471987152 474241447
609.5 474241447 478229675 483266029 488653717 491924706 494637413 495657921 495489197 494750557 492293510
618.2 492293510 489039345 485986786 485785103 487734070 491556206 496888580 503022499 509275475 513261299
626.9 513261299 516046944 518074112 518490715 515087509 510260925 507577171 506089973 506068115 506775742
635.5 506775742 508710632 513443031 519679489 525942230 531014786 531887550 530068016 527308083 523379707
644.2 523379707 519189034 514924049 511784363 510731659 512641792 517470970 523119736 529889793
651.9 529889793 533907280 536102524 538023720 536724358 532945366 528178253 524371796 521336861
659.7 521336861 518947487 519562111 521984634 526608925 532046318 538081779 543348961 542221146 529739227
668.3 529739227 533732758 535371361 533587494 529890709 526421585 525539017 527655792 531767387 535067101
677 535067101 540417633 546939392 550766220 552466393 551527252 549528008 546266556 541645851 537722435
685.7 537722435 535148468 534530182 535727730 540403519 546172180 550481911 555010796 557411652 556305389
694.4 556305389 554004707 549798279 543686752 537625961 532903099 530426445 529780579 530823097 533173141
703.1 533173141 535510521 538633499 541499062 542588463 541770287 539195442 535887299 531378098 526919022
711.7 526919022 524725456 524986305 527601395 531800270 537530441 544724503 551725769 556937141 561389618
720.4 561389618 564048958 563846169 561794014 559686699 558200493 556506233 556317329 560607452 568313103
729.1 568313103 576088066 583651009 589690361 593547134 596405220 596086159 593062172 588301086 583247681
737.8 583247681 579184647 577818146 579219437 581298447 586505547 593533363 599075089 601957512
745.5 601957512 601963196 600359077 595575485 587829933 579923897 574334030 569989700 566398888 565596428
754.2 565596428 566782265 568805161 570286407 571269264 573328362 573624191 569744225 564362831 559018860
762.8 559018860 553605690 549626732 546827469 545742760 548454666 553342247 559499092 567076340
770.6 567076340 574496651 580324059 584266396 585764160 585584373 584904213 583677483 582965164 584334183
779.2 584334183 588516655 593434677 599717216 609014244 618409958 626041489 631065826 633476906
787 633476906 633271713 630992165 625990372 621069260 618096886 616334229 618404770 623778000 631461792
795.6 631461792 639673004 646615982 652868729 657426605 658879623 656115799 652168732 647010880
803.4 647010880 641568680 638093109 637813034 641056747 646014938 652945480 659734726 666641006 671782913
812 671782913 672023315 668671188 663019409 657984390 651780853 645774002 641695557 640087433 643165054
820.7 643165054 648613052 654410782 659675064 664520721 666620178 664300232 658487854 651002579
828.4 651002579 643650970 635304680 627791290 623559456 622816238 623913994 626764297 630630150 632623558
837.1 632623558 633350334 632258911 629403801 624643784 617777138 609860420 601991959 596607780 593885231
845.8 593885231 593354340 595001831 598389244 602315025 604442596 605511131 604916801 601168861 596220932
854.5 596220932 589737434 581514702 575019150 569778099 566668625 567647400 571490669 577741013 584990349
863.1 584990349 591838417 597977180 602947273 606856117 608216362 608129425 607986259 608627472 611096802
871.8 611096802 615765686 622698555 630718460 640206909 649155960 655000305 657081909 656489258 653850708
880.5 653850708 648231049 640861588 632566032 626810226 623355370 621735840 622281723 623297157 625028076
889.2 625028076 625807228 625425148 623240967 618491135 611478233 602852669 595135765 589642754 585692902
897.9 585692902 582532501 581621857 582005386 583213005 585328598 585689011 583912239 579983177 574786110
906.5 574786110 568835869 561724167 553525162 545444260 539734077 536266632 533239288 530208778
914.3 530208778 528756256 528407669 526184120 522190399 518018837 513423157 508168564 502426224 497444305
922.9 497444305 494433479 493179245 493494644 495152626 498142395 501304245 504468842 507228622 509167824
931.6 509167824 509451065 507733345 505770607 503484726 502050133 502113571 503009148 505441399 508973961
940.3 508973961 514123878 520411682 525633926 528432541 529090462 527643242 523876915 518676300 512263489
949 512263489 504673767 497782784 492558479 487771339 483413963 479974060 475742874 470582657 464219322
957.7 464219322 456827583 448200035 438396873 428897095 419181900 410383148 401790771 394012070
965.4 394012070 386945534 380318375 374800529 367994423 361159973 353479729 346144371 337900352
973.1 337900352 328484726 320471725 312567501 306871586 300577488 295126762 291247044 287898178
980.8 287898178 285677357 283142357 281814537 280048580 278490448 275882454 274699688 274427586 272396832
989.5 272396832 271603508 270721684 271475964 272528706 274428463 275987396 277740269 280713558 281370144
998.2 281370144 282479362 282224693 282513638 282393036 281288509 281076794 280529041 281966000 282042370
1006.8 282042370 283139381 284286594 284773979 285926628 286166325 287047253 286183777 286035118 285078640
1015.5 285078640 284087067 283861351 283274784 284324646 285008030 287306023 288647480 290600548 292951145
1024.2 292951145 294661980 297224541 298045616 299118423 299143448 299877605 299946938 299941597 300838585 301411858
1033.8 301411858 304883080 307160873 309523087 311370583 312553673 312762299 311609802 311782322 310086575
1042.5 310086575 309021835 307591934 306803703 306537876 307045746 309762688 311295605 314768753 316884823
1051.2 316884823 318880844 320866547 321474686 322873993 324182053 326062927 326483612 328459282 330850868
1059.9 330850868 334919624 339750252 343793831 350469360 355587196 360586052 363803329 365361061
1067.6 365361061 365727348 363699989 360797348 355906334 351265450 345807419 342232056 339374695
1075.3 339374695 337297287 337363281 336457329 337655144 337617989 337642403 337042961 336229019 336278801 335657997
1085 335657997 337122841 338542023 342528877 346041946 349686813 353651314 355859528 359595757 362103539
1093.6 362103539 363941040 363764114 363781357 364412117 364880714 365822678 365727806 368060913 370011673
1102.3 370011673 371855507 373024025 373773727 374744492 374679298 375610504 374435272 373659821 373023682
1111 373023682 373433342 375734291 378060341 382260666 385132561 387994003 390827141 393692055 395643616
1119.7 395643616 396207695 396319389 394270592 393302689 392414894 392564774 393896370 395203934 397515793
1128.4 397515793 400528107 405015907 408462486 411762047 413576546 414162560 414310722 412808151 411846123
1137 411846123 409611549 406967659 405048485 404509735 404171944 401999855 399617691 398483505 398610916
1145.7 398610916 395352669 390477486 385694695 380912781 377062225 373752365 372643890 371053658
1153.4 371053658 370808296 371137352 371992950 373481407 374126625 375453186 374987030 375056381 374532051
1162.1 374532051 374071922 373586540 372948418 375042152 376939850 381023293 385897636 391947746 398292999
1170.8 398292999 403543816 409535522 414494324 419174042 422193718 425372047 429002380 432981720
1178.5 432981720 438095856 443611565 450542068 457889938 466746674 474971123 481662941 487234344
1186.2 487234344 491426468 494511490 495650215 496184883 496489372 497510567 499382782 502185516 506184158
1194.9 506184158 510078506 514315567 517995796 520748672 522143173 522080307 520900383 518574028 516136169
1203.6 516136169 514415092 514170189 514632149 516629295 520453720 524659462 529675217 534704933 538861732
1212.3 538861732 541474037 542540512 542260017 541219902 540287514 539494591 539419518 540488968 543300362
1220.9 543300362 547761421 552303085 556261139 559147453 560140419 559875870 557919426 554384193 550349884
1229.6 550349884 546467056 543514214 541485062 540857544 542243347 544829674 547516899 549831619
1237.3 549831619 551647110 551932335 550734024 548620758 545737839 542286377 538884239 536894722
1245 536894722 536494560 537567902 540394363 544040375 547994537 551611252 554648361 556517754 556647034
1253.7 556647034 555275688 553157959 550753860 548714905 547320480 546789131 547852898 550577202
1261.4 550577202 554571648 558679543 561623878 563870773 565298157 565429459 563925209 561686745
1269.2 561686745 559277077 557529411 556773109 557210808 559307137 562350922 566106262 570150871 573256416
1277.8 573256416 574288979 573919220 572618561 569496880 566027794 562963829 560352783 558543282
1285.5 558543282 558304596 559684334 562102547 564805489 567161636 569521103 570508347 569830666 567537270
1294.2 567537270 563664818 559669151 555615273 552189255 550122681 549873314 550814018 552341309 554581833
1302.9 554581833 556489563 557568779 557307854 555941429 553357658 549579582 545567513 541916122
1310.6 541916122 539361992 537889290 537582893 538840256 541162491 543535881 545639725 546643791
1318.3 546643791 545786552 544451485 542017097 538456154 534702263 530959396 528170509 526278801
1326 526278801 525583878 525633926 525604515 525786934 525602379 525217285 523449478 520266953 517210045 513580589
1335.7 513580589 509323463 506004868 504208794 502950478 503089180 505288124 507691994 510617332
1343.4 510617332 512514458 514144554 514984779 513784218 511702499 508975792 506615639 504596786
1351.1 504596786 503178062 502912292 504027863 505944328 507532043 509476242 510845222 511786804 511566238
1359.8 511566238 509591255 507020340 504202156 500424232 498510590 498176727 497836723 498578377 500291290
1368.5 500291290 502304344 504812279 506417160 507670631 507731705 506705437 505153084 503829117 502929420
1377.2 502929420 501026611 500684700 501448441 503618050 506592255 509403915 512339554 514736557 517116051
1385.8 517116051 518229103 518222389 518355637 518329697 517527618 516795311 517411423 518488007 519800453 521406288
1395.5 521406288 524420586 527040977 528457909 527554550 525750542 524685707 522009659 519584427
1403.2 519584427 517245712 513860931 512612419 513080864 514203529 515335846 517078819 518154335
1410.9 518154335 519229546 518658524 516657715 514721718 512490997 510389748 507471886 505978889
1418.6 505978889 501898193 502520485 506117287 508350525 510950813 512260780 513257904 514034424 513684998
1427.3 513684998 513227882 511184082 508571320 507096519 507766838 507934341 508751945 512056084 514957123
1436 514957123 516943130 518005753 521073151 522709579 522991219 521914215 519364548 518139153 516743279
1444.7 516743279 517020645 517684555 518756332 519614830 521367493 524381943 525351601 526196747 525210457
1453.3 525210457 524298248 522604218 518423271 510519524 505493202 508716240 508990593 512038078 514094772
1462 514094772 516778679 520896072 522134438 525004501 526322250 528033676 527944069 528598022 530608177
1470.7 530608177 530113945 533264160 536354637 543726273 548724518 554733887 560847626 566224937
1478.4 566224937 571279335 573462296 576039009 576528969 577705421 578166656 579094429 581842117 583646088
1487.1 583646088 587835426 591486435 598478203 603392143 607370720 610483475 611666756 613321686
1494.8 613321686 611779938 608125534 609178772 609674797 609496269 612741432 617264977 620811729 626153946
1503.5 626153946 630234222 633951035 627567940 623933334 630910606 630642853 630672455 630571518 630523605
1512.2 630523605 629671631 632445412 635537949 638229256 643193207 644294434 649482803 652896347
1519.9 652896347 651487885 647619171 644278107 645784988 644858322 642901459 642968674 646275787 648935242
1528.6 648935242 652412567 657519608 660484772 663576736 662076492 659329453 660001068 658300323
1536.3 658300323 656981735 655736771 652818451 645296936 652232361 655820770 659370728 664369278
1544 664369278 665759354 667211075 668400879 668188019 666120148 661608429 656941833 656436005 657136765
1552.7 657136765 657424698 655816650 657813644 663274155 668985062 666628723 660111923 657938156
1560.4 657938156 662114563 661846313 659636841 656193008 650915756 650749741 652155457 654527817 656679764
1569.1 656679764 655226364 657761078 660121460 660137863 658895798 657670135 652979050 642004395
1576.8 642004395 643152542 643238144 642407532 642381744 643550034 646200180 648655472 650134430 650711136
1585.5 650711136 650438004 649152222 646450577 643079758 639235535 636013832 633372269 632856331 633269539
1594.1 633269539 634083900 636034737 637493515 638769073 639309425 638259239 635539207 631963768 628378067
1602.8 628378067 624281120 621390495 619252815 618051796 616938858 617841797 619258232 619635582 620733719
1611.5 620733719 619924355 618381653 615910835 613871040 609799232 597697105 598684006 598674507 598600807
1620.2 598600807 598595161 600231590 601284752 599322701 600416069 600616112 600181198 596584167 593068733
1628.9 593068733 591390076 588679657 586837006 585375710 586609383 588010635 585640106 585952034
1636.6 585952034 589024849 590851288 591908150 592042046 590209236 589385872 587616386 587337608 587445374
1645.3 587445374 583738556 583495255 585080833 589369812 593222351 597452011 601710358 605780296
1653 605780296 595906067 597077675 599477043 600193024 600318565 600088043 600789070 602803459 606388817
1661.6 606388817 610726357 613035851 616832275 620015678 622379646 624145889 625044708 622347145
1669.4 622347145 622046852 623842354 623747292 626457214 630550919 632927094 634829750 639928093 644818954
1678 644818954 648790665 652092743 652862244 654817200 656292648 650589676 643032227 650746918 656781082
1686.7 656781082 660146866 663018570 667731934 672815323 676756439 680185471 682388306 684595871
1694.4 684595871 683937683 675647964 678759232 682406158 686570129 681622314 677207565 686359863
1702.1 686359863 692607040 697361832 699978943 702201767 702628555 702853470 702571564 700502090 698812256
1710.8 698812256 698614807 699191208 699985886 700772629 703140106 708490982 713715286 710967865 712490692
1719.5 712490692 714608612 715138474 714015427 711582947 708804550 708218918 708361664 708837433 711332169
1728.2 711332169 714459839 716471558 718217773 722049255 725202713 721360779 716775970 718721313
1735.9 718721313 719564514 717893677 718078766 715588837 713875656 718820801 722924042 725404739 727438354
1744.6 727438354 730739288 732942734 733072815 732062225 729348221 729630051 725839233 724208145 727369537
1753.3 727369537 729679031 733045197 736827774 739123077 741312027 744156570 745766602 746983185
1761 746983185 743456573 740345535 740473709 739397202 739158783 740277176 742235565 742402420 745655212
1769.7 745655212 751099472 753777542 753951416 752064667 753539886 753191605 749750595 748787460 746905289
1778.3 746905289 746550598 746488953 746768188 749540253 753416824 757197800 758881454 759616394 760424728
1787 760424728 760027771 758006516 756680984 754190445 751379623 748730011 749183960 753491287 756199036
1795.7 756199036 758005905 761288605 764423676 765326920 763681183 763614655 761097794 758763504 757668152
1804.4 757668152 756321640 756095428 756190109 757732925 760601349 763979874 765714035 767639999 769251556
1813 769251556 768960876 768027267 765365753 763272018 760826874 759387741 759564514 760527420 762742233
1821.7 762742233 764723892 767942810 770783157 771276779 771593323 772094650 771745224 768636246 763033218
1830.4 763033218 762378540 762813721 762393188 763418655 765616150 768551025 771529922 772815933 774166946
1839.1 774166946 774160614 773710709 772156448 770354233 767422333 760450516 762167740 764168167 765002289
1847.8 765002289 766746979 769724426 772871399 774676437 776096115 775671005 774537201 773039780
1855.5 773039780 770799561 768484421 766240997 765525131 765506439 766932297 768834686 771304092 773739853
1864.2 773739853 775266266 776837006 776645813 776030655 773308716 769756775 768546219 767667465 767427673
1872.8 767427673 767475739 768734131 770643845 773302612 775711746 777452011 778529282 778212128 777358398
1881.5 777358398 774982834 772726364 770335388 768474655 768212662 768536072 771095428 773783951 775219269
1890.2 775219269 777169342 779111557 779617233 779816971 778758545 775457687 773454590 771515732 770303497
1898.9 770303497 770054779 770605698 772178802 774073563 776876373 778889542 780041428 780409851 779938583
1907.6 779938583 778493652 776168518 773508987 771289520 770764389 770445938 771604767 773345947 775402756
1916.2 775402756 778580704 779497299 780313110 780960083 780198898 778608704 775231094 773325119 772619019
1924.9 772619019 771750183 771062393 772017288 774052963 776173401 778463516 780381012 781787872 781331940
1933.6 781331940 780530853 779028931 776839600 774775162 772546616 771473389 771240768 773321915 775535126
1942.3 775535126 776383133 778891220 781193390 781755753 781098938 780341797 778740387 776491776 774350433
1951 774350433 772635880 772118683 772417526 773672104 775442505 777678986 779605560 781324463 782791138
1959.6 782791138 782784195 781659241 779469833 777433319 775635681 774399414 774031448 773515472 774277039
1968.3 774277039 776477585 779429855 781614304 782907715 783378372 782828445 781750565 779813156 777752686
1977 777752686 775783234 774500427 774353333 774902344 775962830 777503967 779642487 781473694 782787247
1985.7 782787247 783505630 783462372 781680374 779216995 777813644 776012573 773866196 773370972 774569397
1994.3 774569397 776258392 778165817 780135803 781938477 783563538 783515244 782702408 781207352 779175110
2003 779175110 777102661 775171738 774384384 774211273 774749146 775867691 777912674 780095520 781629028
2011.7 781629028 782814484 782446594 781101608 779328842 777322159 774913025 773206100 772628860 772560654
2020.4 772560654 773390884 774478836 776388245 778439026 779786453 780180817 779322662 778419876 776832352
2029.1 776832352 775027542 773050003 771469345 770781097 770476685 771223373 772592316 774445267 775974121
2037.7 775974121 777171249 777632446 776947556 775845642 774035034 772165833 770237122 768945312 768248978
2046.4 768248978 768530197 769871063 771188812 772931976 774680710 776275330 776613007 775985794 774851608
2055.1 774851608 772693329 771093674 769703140 768569565 767824173 768218231 769672318 771375427 773678665
2063.8 773678665 774946671 775503540 775736237 775286255 774218521 772400894 770686951 769262772 768425369
2072.5 768425369 768206100 768884888 770373840 772147827 773765030 775048752 776141129 776245804 775519714
2081.1 775519714 774050064 772391968 770699081 769181442 768586273 768667145 769593506 771007690 772815323
2089.8 772815323 774256363 775714111 776945190 776649323 775965424 774477234 772808762 771151123 769600220
2098.5 769600220 769004135 769062271 770226364 771724548 773351974 775056076 776470642 777087097 777134705
2107.2 777134705 776654129 774495316 772462234 771019897 769921265 769414062 769791412 771079865 772352219
2115.9 772352219 774271622 776122284 777342682 777695084 777366486 776535950 774708786 772843704 770890732
2124.5 770890732 769865112 769772110 770195618 771229782 772587891 774592743 776174698 777297745 777621994
2133.2 777621994 777346878 776351395 774143906 772412796 771408615 770762100 770258636 770656815 771739502
2141.9 771739502 773175659 775032425 776265717 777253723 777611465 777034225 775667114 774121017 772623749
2150.6 772623749 771191864 770473785 770276031 770985718 771993866 773569794 775398483 776679001 777612686
2159.3 777612686 777700806 777371521 776048737 774711533 773471832 771953888 771195602 771139832 772168503
2167.9 772168503 773572159 775593567 777358780 778510590 779714050 779959717 779548721 778133392 776573105
2176.6 776573105 775139160 774029617 773817291 774115829 775104752 776235809 777941055 779521103 780681992
2185.3 780681992 781678009 782120361 781668625 780223618 778893890 777318878 776735306 776818314 776936722
2194 776936722 777890778 779188385 781197281 782544556 783563385 784228973 783832703 782746429 781280441
2202.6 781280441 780596771 779488983 778606491 778275146 778303909 779277344 780699463 782633209 784207916
2211.3 784207916 785539246 786162643 785876312 784739838 783334732 782532501 781400299 780516052 780043335
2220 780043335 780687103 781846466 783330383 785636444 786981354 787808990 787843399 787115631 785995865
2228.7 785995865 784619522 783383560 782265625 781762543 781561661 782424850 783625259 784882660 786546173
2237.4 786546173 787850876 788642960 788587799 788134308 786692123 785174179 783908234 782674637 782349396
2246 782349396 782833710 783983612 784783020 786036758 787137756 788125992 789524918 789738083 789072495
2254.7 789072495 787349625 785939789 784747314 783673096 783328400 783223877 784203415 785482483 786927185
2263.4 786927185 788289337 789578552 789896469 788992920 788484344 787508545 786311493 784973984 784312210
2272.1 784312210 784040833 784007874 785182953 786564636 787869949 788621063 789716110 790469208 790287552
2280.8 790287552 789635925 788425140 787378845 785650635 784643173 784102859 784366455 785675507 786659241
2289.4 786659241 787969284 788995285 790018387 790015182 789480820 788572083 786927338 785937729 784275208
2298.1 784275208 783408737 783120346 783814545 785151596 785693970 786413116 787198105 788610077 788022003
2306.8 788022003 786899033 786578674 784984360 782974167 780771179 780127029 779505005 779910889 780974884
2315.5 780974884 781962204 783466187 783155212 783399963 783223648 782859650 781798935 779248428 777609177
2324.2 777609177 775539093 774734039 774870911 776426468 777122574 776834412 777776184 778274994 778942490
2332.8 778942490 778315964 777830963 776113663 774396820 774733734 774067535 772539368 770837784 771652908
2341.5 771652908 772654724 774482651 776021576 776450577 778027649 778743820 780243835 780314102 777877731
2350.2 777877731 775053558 772853088 771419830 770756149 770834045 769576721 770411148 772928619 773085937
2358.9 773085937 771642838 769335098 768531799 767764740 766479874 766026382 767091217 767714844 767723083
2367.6 767723083 768842850 771021118 773720779 775292282 776942902 778018646 777913895 777162399 776497269
2376.2 776497269 776351776 776351395 777079544 777470703 778045731 779301224 781017761 782850876 784114075
2384.9 784114075 784854202 784413910 784112396 783405838 781834030 780677872 779485931 779100342 779449005
2393.6 779449005 779878616 780218277 781215439 782686615 783421478 783586273 783001785 782438126 781374512
2402.3 781374512 779859009 778806458 777939224 777474823 777443924 778158035 778770065 779267044 780019913
2410.9 780019913 780717697 781040802 780662689 780144196 778795624 777125092 776077652 775543976 775128555
2419.6 775128555 774911041 775340729 775730286 776518707 777420349 778011932 778172302 777661133 776574707
2428.3 776574707 774824600 773326416 772186508 771566467 771012039 771166840 772315445 772866058 773378601
2437 773378601 773809433 774320679 774362259 773787384 773055420 771460419 769757843 768237762 767464752 767154312
2446.6 767154312 767314148 768322067 769391403 770167770 770529251 770811386 770165787 769628448 769156952
2455.3 769156952 767575912 765815430 764184341 763802261 764065933 764539032 765167542 765853653 766689987
2464 766689987 766630936 766756821 766751862 765947037 764747009 763646164 762642899 761380310 760693207 760565567
2473.6 760565567 761403961 762114944 762527466 763396454 763862534 764160309 763540497 762330246 761271667
2482.3 761271667 760378189 759387131 758230133 757649841 757750015 758653183 759300461 759845200 760393677
2491 760393677 760603638 760911102 760559692 759732285 758745880 757937469 756783829 755496140 755120316 755444031
2500.6 755444031 756533661 757456055 757959900 758528900 759077835 758872986 758234863 757637939 756380005
2509.3 756380005 755192642 754069443 753411026 753346558 753607407 754436798 755341797 756190643 756479111
2518 756479111 756882477 756737671 755936508 755110550 753757858 752959747 752054062 751148224 750781708 751254730
2527.6 751254730 752102432 752082901 752803116 753629074 753966751 754038315 753023071 751653442 750343781
2536.3 750343781 749134216 748115997 747367325 746946793 747241516 748023911 748926926 749486313 749410706
2545 749410706 749657135 749889679 749328461 747782135 746678009 746147842 744888840 743785706 743277969
2553.7 743277969 743663635 744321213 744935608 745618057 745775604 745824509 745618515 745098419 744199829 743147659
2563.3 743147659 741671829 739923553 739077301 739235992 740027924 740460358 740975647 741694031 742291260
2572 742291260 742477341 741382599 740252609 739541931 738753052 737595749 736555252 736079483 736034927
2580.7 736034927 736733246 737374191 737968063 738570175 738649750 738208542 737833633 737449265 736163940 734859619
2590.3 734859619 734161987 733918839 733386993 732822952 733225937 733945541 734501801 734817429 735348053 735677185
2600 735677185 735308533 734329300 732911072 731608963 730623703 730103683 729656830 729855270 730290680 730747986
2609.6 730747986 731512070 731725616 732281189 732368011 731347885 729981079 728765793 727975693 727012177
2618.3 727012177 726243744 725638733 725503616 725540466 725926208 727037125 727322159 726827469 726105347 725286331
2627.9 725286331 724112549 722901230 721657410 720389481 719587860 718994064 719348297 719550934 719520493
2636.6 719520493 719975281 720042953 719740219 718861923 718173523 717305145 715971527 714810791 713768997
2645.3 713768997 712990341 712514877 712681656 712785416 713085937 713580933 713408356 712996445 712334671 711080704
2654.9 711080704 709645996 709013290 708238373 707212067 706619339 706257553 706317368 706104507 706022491 706432037
2664.6 706432037 707073441 706923218 705621033 704441452 703239288 702221756 701372452 700681000 700246277
2673.3 700246277 700056534 700510864 701230316 701824722 701834030 701535416 700801392 699805756 698839264 697548676
2682.9 697548676 696420059 695645065 695290375 694911194 694989853 695300064 695242157 695471420 695726242 696035385
2692.5 696035385 695574265 694691162 693772583 692518387 691600800 690597916 689944916 689338455 688869247
2701.2 688869247 689201660 689842758 690446091 690331726 689920731 689494095 688719025 687244263 685686111
2709.9 685686111 684695892 683873978 683406830 683187027 683466339 683615341 683249664 683210144 683490524 683808823
2719.5 683808823 683231583 682002258 681053238 680141602 679125214 678190994 677503586 677539749 677804794
2728.2 677804794 677702484 678037109 678509445 678583527 678080063 677412415 676586227 675634308 675377121 674472504
2737.9 674472504 673681412 673453674 672999878 673218613 673558655 674108276 674610214 674678345 674223404 673587341
2747.5 673587341 673192139 672380524 671492386 670204849 669292297 669091721 669202118 669753036 669886398
2756.2 669886398 670003204 670057678 670186768 670136185 669476624 668689423 667704315 666805801 666021118 665783691
2765.8 665783691 665649033 665425110 665775681 666522369 667022018 666986542 667006226 666394577 665713882 665249863
2775.5 665249863 664314499 663284912 662201538 661731262 661312332 661155014 661547012 661705856 661745758
2784.2 661745758 661731415 661877365 661591644 660896301 659544296 657955170 656816025 655580597 654906006
2792.8 654906006 654687958 654901505 654981308 654663162 654880219 654850388 653865280 652750931 652079010 650793533
2802.5 650793533 649453506 648279343 646763687 645891037 645454788 645423126 645405655 645130005 644848099
2811.2 644848099 644456787 643677826 642551270 641873245 640583954 638616486 637131767 635975494 634761009
2819.8 634761009 633826218 633720970 633420563 632703209 632100716 631342583 630167999 628949738 627771034
2828.5 627771034 626285820 624803505 623302307 622199249 621134377 619958534 619337158 619042511 618695183
2837.2 618695183 617464905 615790710 613969955 612140236 610556946 608874283 607017784 604980927
2844.9 604980927 603601227 601824722 599706955 598318481 597152939 596218376 594808540 593656120
2852.6 593656120 592355919 590468216 589220505 587984123 586554756 585309563 584525604 583530731 582280388
2861.3 582280388 581329765 580326805 579150009 577944450 576897049 575277290 573147125 570394669
2869 570394669 567457771 565481873 563718796 561789551 559646187 557688637 556038017 554501572 552836380
2877.7 552836380 550870743 549125900 547257767 545432930 543549690 541810646 540471420 539263039
2885.4 539263039 538292618 536969566 536178322 536134911 536344719 536446724 535977707 535580826 535186844 535078239
2895.1 535078239 534635811 533877487 533455696 532675934 532110558 532099190 532284012 532273026 531842384 531077614
2904.7 531077614 530796356 530756226 530141335 529341583 527856407 526671791 525910454 524569702 522975388
2913.4 522975388 521599236 520851402 519367752 517906418 516853065 514960175 513444595 512102432
2921.1 512102432 510564575 509330750 507613754 505520935 504663239 504790611 504824638 504812088 505105171
2929.8 505105171 505691147 505728912 506184196 507345543 508623848 509811592 510493927 511636238 513142509
2938.5 513142509 514923439 516861458 519012451 521385956 523718796 526473160 528628006 530770111
2946.2 530770111 533184090 535388031 537371559 538899994 541178169 543526535 545513802 547638359
2953.9 547638359 549852905 552215004 554771843 557368851 559573441 562184868 564603310 566786652
2961.6 566786652 568962784 570576134 572177811 573267822 574622421 576680832 578713875 580680466
2969.3 580680466 582483711 584677849 587136536 589361305 591188011 592431374 593383789 594412575
2977 594412575 595225105 596132584 597539673 599040413 600537567 601901131 603374748 605005798 606457748
2985.7 606457748 607377510 608029366 609005547 609928741 610542831 610682640 611048317 611627655 611896095 612483139
2995.3 612483139 613294067 614108505 614515686 614881935 615333328 615410500 615295029 614648170 614091110 613850174
3005 613850174 613389244 613182487 613519592 613883209 613934708 613899651 613756371 613026543 612097206 611932182
3014.6 611932182 611458549 610547943 609674339 608491325 607750969 606983528 606333542 605989304 605603180
3023.3 605603180 605160599 604352760 603590088 602433891 601507034 600849991 599876328 598739128 596911774
3032 596911774 595802574 595217590 594202499 593304291 592564049 592042694 591349297 590548401 589589043 588405228
3041.6 588405228 587102089 585578651 584459763 583231201 581420135 580345573 579838295 579132233 578492317
3050.3 578492317 577460213 576616516 575946960 574669762 573408279 571918564 570425758 569031601 567523079
3059 567523079 566287956 565030327 564159393 563780289 562964134 561734123 560973434 560144081 558904800
3067.7 558904800 557810822 556439705 554853897 553164711 551849480 551106339 550001526 549050865 548655586
3076.4 548655586 547774391 546497192 545454826 544074135 542227173 540674553 539913368 538922424 537370682
3085 537370682 536246567 535376968 534789314 533879128 532593956 531459885 530428085 529591026 528220177
3093.7 528220177 527230034 526280212 524705086 523721619 522616081 521342621 520314865 519284096 518412132
3102.4 518412132 517974815 517111244 515846634 515070381 514112091 513109741 511666412 510149155 508677940
3111.1 508677940 506925812 506104431 505355606 504865341 504226761 502643051 501568146 500802498 499903297
3119.8 499903297 499071236 498159180 496757698 495680580 494512024 492947998 492122879 491307983 490668945
3128.4 490668945 489871674 488888359 488413315 487581520 486338425 485026741 483847809 482818222 482100334
3137.1 482100334 481073303 479740715 478610077 477541428 477080269 476365013 475423241 474736061 474137154
3145.8 474137154 473879585 473270493 472104454 470585747 469203148 468022537 466990013 466129684 465404053
3154.5 465404053 464762077 463888168 463143463 462239532 461591415 460984879 460110779 459526863 458561592 457580338
3164.1 457580338 456346550 455342484 454873390 453930969 453112259 452460251 452018852 451603584 450962334
3172.8 450962334 450147705 449230003 448360138 447278748 446235733 445259552 444807358 444509964 443727798
3181.5 443727798 443036308 442569122 441948166 441218109 440769043 439951363 438950462 438108902 437434006
3190.1 437434006 436962967 436171761 435408478 434358139 433514214 433114204 432557831 432201958 431829948
3198.8 431829948 431315842 430588074 430104065 429665794 429138107 428464966 427371254 426596680 425846291
3207.5 425846291 425273285 424544487 423862038 423685074 423369026 423168488 422629814 422325516 421885834 420943375
3217.2 420943375 420397949 419667206 418818092 417907600 417321014 417238998 416907234 415971603 415596657 416077538
3226.8 416077538 415536575 414621201 413851547 413099480 412782288 412277946 411740074 411445732 411311188 410826607
3236.4 410826607 410061684 409567642 409451065 409450150 409121704 408511086 407988586 407843666 407379189 406762924
3246.1 406762924 406025887 405310860 405372810 405140228 404510803 404003906 403758240 403286285 402738457 402763176
3255.7 402763176 402217751 401335258 400905495 401057014 400837860 400028229 400019760 400122185 399742050 399386482
3265.4 399386482 399373550 399110870 398549080 398174400 397569885 397026405 396587029 396070900 395561523 395294495
3275 395294495 394926872 394563141 394697304 394662933 394599571 394074364 393583641 393716660 393317604 392534065
3284.7 392534065 391971359 392048683 391835709 391186409 391047630 390943985 390970650 390814590 390227966 389792023
3294.3 389792023 389604225 389565392 389338493 388753929 388434105 388428764 388106079 387784691 387450790 386857185
3303.9 386857185 386570053 386606216 386287727 386098442 386057968 385175285 384499779 384164619 383907471 383980026
3313.6 383980026 383522491 382917290 382698708 382481270 382126770 382369804 382389641 381730766 381523781 380784912
3323.2 380784912 380034904 379842720 379176140 378356743 378058891 378334312 377825050 376991501 377133484 377243881
3332.9 377243881 377006950 376958122 376558075 375696335 374929504 374236412 374081001 374148216 373678741 372969284
3342.5 372969284 372463036 372398796 372138748 371579819 371071167 370761528 370574226 370304298 370219727 369748230
3352.2 369748230 368788567 368402863 368531609 368135033 367453613 367080116 366825256 366638031 366523094 366225739
3361.8 366225739 365088348 364293213 364283295 364001999 364016380 363753624 362912903 362404518 362187843 361888809
3371.4 361888809 361723900 361674309 361135826 360780983 360555534 360120277 359859810 359535484 359115868 358404465
3381.1 358404465 358012505 358387604 358429222 358080292 358068695 358041229 357898674 357395592 356539001 356037521
3390.7 356037521 355636902 355303040 354897232 355096130 355554085 354850502 354206734 353991356 354230461 354632607
3400.4 354632607 354382858 353980980 353704033 353634796 353224640 353179321 353273277 352869492 352811279 352932930
3410 352932930 353010483 352751884 352984505 353291702 353133583 353333435 353150635 352677612 352223167 351982079
3419.7 351982079 351941414 352344894 352677422 352202797 352180328 352194710 352215652 352367973 352138329 352438698
3429.3 352438698 352952652 352956467 352818756 352723999 352211075 351758881 351770325 352104149 352776947 353443336
3439 353443336 353949432 354500389 354517593 353445396 353609581 354259186 354278641 354847603 354625282 354787483
3448.6 354787483 355170059 355237999 356019020 356486473 356626129 356642494 357027550 357497139 357680397 357617149
3458.2 357617149 357228699 357478409 358151360 358863792 358911781 358828430 359409752 360013580 360262642 360748711
3467.9 360748711 361861916 361992111 361995773 362360802 362429047 362932892 363206558 363644600 364101830 364069977
3477.5 364069977 364218445 364810143 365466728 366236877 366525078 366014824 366707573 367166862 367055016 367685928
3487.2 367685928 368175392 368865204 369592056 370053558 370364914 370955925 371272430 371637726 372343712 372290878
3496.8 372290878 372493324 372825851 373598557 374205780 374765549 375771332 375222740 375220680 376039925 377130814
3506.5 377130814 378441925 379379158 379244652 378710060 380066147 380698051 380844078 381465950 382106094
3515.1 382106094 382995872 383297806 383755684 383979301 384822350 385796776 386247635 386510162 385911026 386755829
3524.8 386755829 387927895 388721466 389245834 389203682 389210052 389751472 391185150 392278976 392944183 392878456
3534.4 392878456 393688393 394883385 395178223 396195221 396423149 396675034 397356873 398533669 399690247
3543.1 399690247 400545998 401347847 400948448 401660194 401344070 401756210 403351135 405027962 406705627
3551.8 406705627 405927010 407065048 408315239 409624863 411019859 410701447 412483330 414106789 414409180
3560.5 414409180 414576912 416493721 417773933 418923454 423387222 422248230 420086250 419443779 418654976
3569.1 418654976 422151337 424738541 427109871 428477173 429541130 429990501 431211929 434340477
3576.9 434340477 434953041 436290627 436898880 436790237 438530388 440639954 442094345 443299828 447971458
3585.5 447971458 449410782 447984924 449149208 447585793 451234016 455252380 458329926 458712692
3593.2 458712692 458425522 461121597 459951859 463695602 467552032 466999931 469436798 470008926 470830498
3601.9 470830498 473626328 475448303 477253799 480857468 483548927 481641884 484605064 483462830
3609.6 483462830 483905182 492749176 493354836 490849075 494960251 494314575 499040527 504589920 504815712
3618.3 504815712 505018501 502790184 504305191 507940521 509902420 511954117 515096970 517666283
3626 517666283 520633659 527548218 526433487 515622749 519371872 524223328 529838943 530517883 528482819
3634.7 528482819 531423569 535015450 536760941 537038116 539677048 543008537 545669823 546657104 547046547
3643.4 547046547 549612122 553555527 559550400 558929024 555888786 559481659 556466484 553246727
3651.1 553246727 554990311 561850853 566625824 571365356 575948601 566427536 568267021 573181343
3658.8 573181343 574111557 575912666 577226906 579578362 580616035 582502480 584819336 585883865
3666.5 585883865 590741577 593933144 592343483 589724808 583451729 588002243 597619095 607763252
3674.3 607763252 606504059 584980011 589114342 599069901 604257812 600671005 601517296 605313416
3682 605313416 607049942 608537865 609319572 610229492 614499016 619695663 607783508 606879463 616721535
3690.6 616721535 609773026 610478058 616433983 617740555 619592552 620313263 620939751 622132378 623114815
3699.3 623114815 626400185 629341087 623652458 621382790 626131020 627595901 628375740 629711456
3707 629711456 633486290 637194939 629110031 634285011 636964302 622389183 628916435 634151649
3714.8 634151649 634388809 635371132 638607674 640581665 636805954 638091316 644453201 639132385 634936905
3723.4 634936905 641432037 641671448 640706863 637915726 639171600 643908386 645257645 651169510 647027512
3732.1 647027512 640911026 650148773 647893219 639355164 641727905 644777603 645096664 648409348
3739.8 648409348 652210846 649481354 654884720 666184082 645082016 632996216 647984238 655125275
3747.5 655125275 661602249 656672745 647257385 659121780 649577103 644631119 652115479 657487717
3755.3 657487717 660961990 655305328 659148026 664231491 653914566 653580017 659019775 660553131
3763 660553131 661005249 664444122 660203018 656004562 661343765 667006531 666431351 656369400 658852158
3771.7 658852158 663148727 664275055 665536270 664827728 665466156 666881180 670679932 669573822 660481567
3780.3 660481567 663475266 665754089 667216492 670199127 667205048 666065750 667389069 669015045
3788 669015045 670277939 669864273 670031815 669699860 670021439 670364075 672730484 676459045 671388702
3796.7 671388702 667908554 671574020 677033157 682045975 670619278 661512909 667384949 672419891
3804.4 672419891 678881989 683008575 668649139 666140137 673431473 675534286 676073990 677225723
3812.2 677225723 677506485 679636002 686716461 685007477 668482132 674944687 681709976 685426865
3819.9 685426865 684959106 664080276 668286667 675816193 678720398 681927032 681833649 677593536 678256226
3828.6 678256226 680358124 684160690 685655289 676666031 680985565 688639221 681180115 681504593
3836.3 681504593 689156265 677172699 675415726 685306625 678824234 679423447 686797791 682695312
3844 682695312 679009018 682389374 683935165 684627914 687138901 686841202 689525452 696159134 690549164
3852.7 690549164 688359756 669500504 674929428 686381531 683549194 682391205 686218948 689853973
3860.4 689853973 692246017 685527878 687357559 693952637 684870987 681017456 686567917 692685089
3868.1 692685089 699012756 689375305 679541855 683834381 690909653 693028870 681201630 684367752
3875.8 684367752 689551392 689497375 692737274 697613907 689944763 683913422 691832657 693474350 694444656
3884.5 694444656 696849747 681603775 684070206 689334412 691417007 696382141 694540253 686086121
3892.2 686086121 689240265 692806473 691048813 692390976 693926544 697244186 698096695 686855392
3899.9 686855392 692576904 693513565 687114258 692054749 689369125 689272537 690787582 692016144 694366455
3908.6 694366455 693934021 693656693 693163147 693737946 694661713 694516602 695777130 696921844 692172623
3917.3 692172623 689924850 695470963 695038910 691388550 693913269 695471573 696892776 694457016
3925 694457016 691265869 693422165 695380020 696458130 694859543 695141983 697997131 694380112 692076721
3933.7 692076721 693986740 694335403 694617157 695592728 695833588 695744553 695833740 697405548 697514038 692569580
3943.3 692569580 692715073 695137024 696903687 698421402 695737457 696932907 697265778 693790588 696001282
3952 696001282 697138519 696187592 696346741 696579132 696468277 695898895 696002884 695820541 697367020 698261490
3961.6 698261490 697390518 698192215 697725754 697028275 697305450 697632675 698000412 696759033 696296234
3970.3 696296234 697756653 697919159 697552185 698168411 698612900 698604202 697680740 697732391 698937454 698928070
3980 698928070 698617020 698215103 697115707 696469269 696816025 697286301 698391800 699443436 698982925
3988.6 698982925 698989868 699667740 700183716 699908447 699005356 698809967 698627777 698714676 699011993 699407883
3998.3 699407883 700105820 700270538
4000.2 700270538
##END=$$ End of the data block
